maven-notifications mailing list archives

Site index · List index
Message view « Date » · « Thread »
Top « Date » · « Thread »
From Hudson <Hud...@sonatype.org>
Subject Build failed in Hudson: Maven-2.0.x-with-bootstrap » 1.4,osx #77
Date Thu, 29 Jan 2009 06:45:21 GMT
See http://grid.sonatype.org/ci/job/Maven-2.0.x-with-bootstrap/./jdk=1.4,label=osx/77/changes

Changes:

[brett] [MNG-3920] block out the component api from plugins since they are only going to be
exposed to the one from the core (it is not shaded). This prevents the confusing scenario
of double loading the interfaces and having the container not register them properly
Merged from: r738753

[brett] [MNG-3810] improve error message when you forget to add a required field in model
that modello isn't picking up
Merged from: r738723

------------------------------------------
[...truncated 3788 lines...]
     [exec] mng0095ReactorFailureBehavior(itFailFast)...................OK (2.6 s)
     [exec] mng0095ReactorFailureBehavior(itFailNever)..................OK (3.0 s)
     [exec] mng0095ReactorFailureBehavior(itFailAtEnd)..................OK (2.5 s)
     [exec] 0144LifecycleExecutionOrder(it0144).........................OK (5.5 s)
     [exec] 0143TransitiveDependencyScopes(itCompileScope)..............OK (2.5 s)
     [exec] 0143TransitiveDependencyScopes(itProvidedScope).............OK (2.4 s)
     [exec] 0143TransitiveDependencyScopes(itRuntimeScope)..............OK (2.3 s)
     [exec] 0143TransitiveDependencyScopes(itTestScope).................OK (2.4 s)
     [exec] 0142DirectDependencyScopes(it0142)..........................OK (2.5 s)
     [exec] 0140(it0140)................................................OK (2.8 s)
     [exec] 0139(it0139)................................................OK (3.0 s)
     [exec] 0138PluginLifecycle(it0138).................................OK (4.6 s)
     [exec] 0137EarLifecycle(it0137)....................................OK (4.1 s)
     [exec] 0136RarLifecycle(it0136)....................................OK (4.2 s)
     [exec] 0135EjbLifecycle(it0135)....................................OK (4.2 s)
     [exec] 0134WarLifecycle(it0134)....................................OK (4.2 s)
     [exec] 0133JarLifecycle(it0133)....................................OK (4.3 s)
     [exec] 0132PomLifecycle(it0132)....................................OK (3.1 s)
     [exec] 0131SiteLifecycle(it0131)...................................OK (2.3 s)
     [exec] 0130CleanLifecycle(it0130)..................................OK (2.4 s)
     [exec] 0113ServerAuthzAvailableToWagonMgrInPlugin(it0113)..........OK (2.1 s)
     [exec] 0090(it0090)................................................OK (1.9 s)
     [exec] 0087(it0087)................................................OK (2.6 s)
     [exec] 0086(it0086)................................................OK (2.3 s)
     [exec] 0085(it0085)................................................OK (2.3 s)
     [exec] 0072(it0072)................................................OK (1.9 s)
     [exec] 0071(it0071)................................................OK (2.2 s)
     [exec] 0064(it0064)................................................OK (1.7 s)
     [exec] 0063(it0063)................................................OK (2.0 s)
     [exec] 0056(it0056)................................................OK (1.7 s)
     [exec] 0052(it0052)................................................OK (3.3 s)
     [exec] 0051(it0051)................................................OK (4.4 s)
     [exec] 0041(it0041)................................................OK (2.7 s)
     [exec] 0040(it0040)................................................OK (1.8 s)
     [exec] 0039(it0039)................................................OK (1.7 s)
     [exec] 0038(it0038)................................................OK (1.7 s)
     [exec] 0037(it0037)................................................OK (1.8 s)
     [exec] 0036(it0036)................................................OK (1.9 s)
     [exec] 0032(it0032)................................................OK (1.1 s)
     [exec] 0030(it0030)................................................OK (11.1 s)
     [exec] 0025(it0025)................................................OK (2.2 s)
     [exec] 0024(it0024)................................................OK (1.7 s)
     [exec] 0023(it0023)................................................OK (1.9 s)
     [exec] 0021(it0021)................................................OK (2.1 s)
     [exec] 0019(it0019)................................................OK (3.5 s)
     [exec] 0018(it0018)................................................OK (2.2 s)
     [exec] 0012(it0012)................................................OK (2.2 s)
     [exec] 0011(it0011)................................................OK (2.1 s)
     [exec] 0010(it0010)................................................OK (2.2 s)
     [exec] 0009(it0009)................................................OK (2.2 s)
     [exec] 0008(it0008)................................................OK (2.2 s)
     [exec] 0007(it0007)................................................OK (1.0 s)
     [exec] Tests run: 307, Failures: 0, Errors: 1, Skipped: 0, Time elapsed: 1,422.293 sec
<<< FAILURE!
     [exec] testmng2668(org.apache.maven.it.MavenITmng2668UsePluginDependenciesForSortingTest)
 Time elapsed: 10.558 sec  <<< ERROR!
     [exec] org.apache.maven.it.VerificationException: Exit code was non-zero: 1; command
line and log = 
     [exec] /tmp/apache-maven-2.0.11-SNAPSHOT/bin/mvn -e --batch-mode -Dmaven.repo.local=/opt/repos/local-repository
install
     [exec] + Error stacktraces are turned on.
     [exec] [INFO] Scanning for projects...
     [exec] [INFO] Reactor build order: 
     [exec] [INFO]   test-project
     [exec] [INFO]   Unnamed - org.apache.maven.its.mng2668:project:jar:1.0-SNAPSHOT
     [exec] [INFO]   Unnamed - org.apache.maven.its.mng2668:tools:jar:1.0-SNAPSHOT
     [exec] [INFO] ------------------------------------------------------------------------
     [exec] [INFO] Building test-project
     [exec] [INFO]    task-segment: [install]
     [exec] [INFO] ------------------------------------------------------------------------
     [exec] [INFO] [site:attach-descriptor]
     [exec] [INFO] [install:install]
     [exec] [INFO] Installing /private/tmp/maven-integration-tests-2.0.x/core-it-suite/target/test-classes/mng-2668/pom.xml
to /opt/repos/local-repository/org/apache/maven/its/mng2668/test-project/1.0-SNAPSHOT/test-project-1.0-SNAPSHOT.pom
     [exec] [INFO] ------------------------------------------------------------------------
     [exec] [INFO] Building Unnamed - org.apache.maven.its.mng2668:project:jar:1.0-SNAPSHOT
     [exec] [INFO]    task-segment: [install]
     [exec] [INFO] ------------------------------------------------------------------------
     [exec] [INFO] snapshot org.apache.maven.its.plugins:maven-it-plugin-dependency-resolution:2.1-SNAPSHOT:
checking for updates from central
     [exec] [INFO] snapshot org.apache.maven.its.plugins:maven-it-plugin-dependency-resolution:2.1-SNAPSHOT:
checking for updates from central
     [exec] [INFO] snapshot org.apache.maven.its.plugins:maven-it-plugins:2.1-SNAPSHOT: checking
for updates from central
     [exec] [INFO] snapshot org.apache.maven.its.plugins:maven-it-plugins:2.1-SNAPSHOT: checking
for updates from central
     [exec] [INFO] snapshot org.apache.maven.its:core-integration-testing:2.1-SNAPSHOT: checking
for updates from central
     [exec] [INFO] snapshot org.apache.maven.its:core-integration-testing:2.1-SNAPSHOT: checking
for updates from central
     [exec] [INFO] snapshot org.apache.maven.its.mng2668:tools:1.0-SNAPSHOT: checking for
updates from central
     [exec] [INFO] snapshot org.apache.maven.its.mng2668:tools:1.0-SNAPSHOT: checking for
updates from apache.snapshots
     [exec] [INFO] snapshot org.apache.maven.its.mng2668:tools:1.0-SNAPSHOT: checking for
updates from central
     [exec] Downloading: http://repository.sonatype.org:8081/content/groups/public/org/apache/maven/its/mng2668/tools/1.0-SNAPSHOT/tools-1.0-SNAPSHOT.jar
     [exec] Downloading: http://repository.sonatype.org:8081/content/groups/public/org/apache/maven/its/mng2668/tools/1.0-SNAPSHOT/tools-1.0-SNAPSHOT.jar
     [exec] Downloading: http://repository.sonatype.org:8081/content/groups/public/org/apache/maven/its/mng2668/tools/1.0-SNAPSHOT/tools-1.0-SNAPSHOT.jar
     [exec] [INFO] ------------------------------------------------------------------------
     [exec] [ERROR] BUILD ERROR
     [exec] [INFO] ------------------------------------------------------------------------
     [exec] [INFO] Failed to resolve artifact.
     [exec] Missing:
     [exec] ----------
     [exec] 1) org.apache.maven.its.mng2668:tools:jar:1.0-SNAPSHOT
     [exec]   Try downloading the file manually from the project website.
     [exec]   Then, install it using the command: 
     [exec]       mvn install:install-file -DgroupId=org.apache.maven.its.mng2668 -DartifactId=tools
-Dversion=1.0-SNAPSHOT -Dpackaging=jar -Dfile=/path/to/file
     [exec]   Alternatively, if you host your own repository you can deploy the file there:

     [exec]       mvn deploy:deploy-file -DgroupId=org.apache.maven.its.mng2668 -DartifactId=tools
-Dversion=1.0-SNAPSHOT -Dpackaging=jar -Dfile=/path/to/file -Durl=[url] -DrepositoryId=[id]
     [exec]   Path to dependency: 
     [exec]   	1) org.apache.maven.its.plugins:maven-it-plugin-dependency-resolution:maven-plugin:2.1-SNAPSHOT
     [exec]   	2) org.apache.maven.its.mng2668:tools:jar:1.0-SNAPSHOT
     [exec] ----------
     [exec] 1 required artifact is missing.
     [exec] for artifact: 
     [exec]   org.apache.maven.its.plugins:maven-it-plugin-dependency-resolution:maven-plugin:2.1-SNAPSHOT
     [exec] from the specified remote repositories:
     [exec]   Nexus (http://repository.sonatype.org:8081/content/groups/public)
     [exec] [INFO] ------------------------------------------------------------------------
     [exec] [INFO] Trace
     [exec] org.apache.maven.lifecycle.LifecycleExecutionException: Missing:
     [exec] ----------
     [exec] 1) org.apache.maven.its.mng2668:tools:jar:1.0-SNAPSHOT
     [exec]   Try downloading the file manually from the project website.
     [exec]   Then, install it using the command: 
     [exec]       mvn install:install-file -DgroupId=org.apache.maven.its.mng2668 -DartifactId=tools
-Dversion=1.0-SNAPSHOT -Dpackaging=jar -Dfile=/path/to/file
     [exec]   Alternatively, if you host your own repository you can deploy the file there:

     [exec]       mvn deploy:deploy-file -DgroupId=org.apache.maven.its.mng2668 -DartifactId=tools
-Dversion=1.0-SNAPSHOT -Dpackaging=jar -Dfile=/path/to/file -Durl=[url] -DrepositoryId=[id]
     [exec]   Path to dependency: 
     [exec]   	1) org.apache.maven.its.plugins:maven-it-plugin-dependency-resolution:maven-plugin:2.1-SNAPSHOT
     [exec]   	2) org.apache.maven.its.mng2668:tools:jar:1.0-SNAPSHOT
     [exec] ----------
     [exec] 1 required artifact is missing.
     [exec] for artifact: 
     [exec]   org.apache.maven.its.plugins:maven-it-plugin-dependency-resolution:maven-plugin:2.1-SNAPSHOT
     [exec] from the specified remote repositories:
     [exec]   Nexus (http://repository.sonatype.org:8081/content/groups/public)
     [exec] 	at org.apache.maven.lifecycle.DefaultLifecycleExecutor.executeGoals(DefaultLifecycleExecutor.java:576)
     [exec] 	at org.apache.maven.lifecycle.DefaultLifecycleExecutor.executeGoalWithLifecycle(DefaultLifecycleExecutor.java:500)
     [exec] 	at org.apache.maven.lifecycle.DefaultLifecycleExecutor.executeGoal(DefaultLifecycleExecutor.java:479)
     [exec] 	at org.apache.maven.lifecycle.DefaultLifecycleExecutor.executeGoalAndHandleFailures(DefaultLifecycleExecutor.java:331)
     [exec] 	at org.apache.maven.lifecycle.DefaultLifecycleExecutor.executeTaskSegments(DefaultLifecycleExecutor.java:292)
     [exec] 	at org.apache.maven.lifecycle.DefaultLifecycleExecutor.execute(DefaultLifecycleExecutor.java:142)
     [exec] 	at org.apache.maven.DefaultMaven.doExecute(DefaultMaven.java:336)
     [exec] 	at org.apache.maven.DefaultMaven.execute(DefaultMaven.java:129)
     [exec] 	at org.apache.maven.cli.MavenCli.main(MavenCli.java:288)
     [exec] 	at sun.reflect.NativeMethodAccessorImpl.invoke0(Native Method)
     [exec] 	at sun.reflect.NativeMethodAccessorImpl.invoke(NativeMethodAccessorImpl.java:39)
     [exec] 	at sun.reflect.DelegatingMethodAccessorImpl.invoke(DelegatingMethodAccessorImpl.java:25)
     [exec] 	at java.lang.reflect.Method.invoke(Method.java:324)
     [exec] 	at org.codehaus.classworlds.Launcher.launchEnhanced(Launcher.java:315)
     [exec] 	at org.codehaus.classworlds.Launcher.launch(Launcher.java:255)
     [exec] 	at org.codehaus.classworlds.Launcher.mainWithExitCode(Launcher.java:430)
     [exec] 	at org.codehaus.classworlds.Launcher.main(Launcher.java:375)
     [exec] Caused by: org.apache.maven.artifact.resolver.MultipleArtifactsNotFoundException:
Missing:
     [exec] ----------
     [exec] 1) org.apache.maven.its.mng2668:tools:jar:1.0-SNAPSHOT
     [exec]   Try downloading the file manually from the project website.
     [exec]   Then, install it using the command: 
     [exec]       mvn install:install-file -DgroupId=org.apache.maven.its.mng2668 -DartifactId=tools
-Dversion=1.0-SNAPSHOT -Dpackaging=jar -Dfile=/path/to/file
     [exec]   Alternatively, if you host your own repository you can deploy the file there:

     [exec]       mvn deploy:deploy-file -DgroupId=org.apache.maven.its.mng2668 -DartifactId=tools
-Dversion=1.0-SNAPSHOT -Dpackaging=jar -Dfile=/path/to/file -Durl=[url] -DrepositoryId=[id]
     [exec]   Path to dependency: 
     [exec]   	1) org.apache.maven.its.plugins:maven-it-plugin-dependency-resolution:maven-plugin:2.1-SNAPSHOT
     [exec]   	2) org.apache.maven.its.mng2668:tools:jar:1.0-SNAPSHOT
     [exec] ----------
     [exec] 1 required artifact is missing.
     [exec] for artifact: 
     [exec]   org.apache.maven.its.plugins:maven-it-plugin-dependency-resolution:maven-plugin:2.1-SNAPSHOT
     [exec] from the specified remote repositories:
     [exec]   Nexus (http://repository.sonatype.org:8081/content/groups/public)
     [exec] 	at org.apache.maven.artifact.resolver.DefaultArtifactResolver.resolveTransitively(DefaultArtifactResolver.java:324)
     [exec] 	at org.apache.maven.artifact.resolver.DefaultArtifactResolver.resolveTransitively(DefaultArtifactResolver.java:288)
     [exec] 	at org.apache.maven.plugin.DefaultPluginManager.ensurePluginContainerIsComplete(DefaultPluginManager.java:772)
     [exec] 	at org.apache.maven.plugin.DefaultPluginManager.getConfiguredMojo(DefaultPluginManager.java:606)
     [exec] 	at org.apache.maven.plugin.DefaultPluginManager.executeMojo(DefaultPluginManager.java:431)
     [exec] 	at org.apache.maven.lifecycle.DefaultLifecycleExecutor.executeGoals(DefaultLifecycleExecutor.java:559)
     [exec] 	... 16 more
     [exec] [INFO] ------------------------------------------------------------------------
     [exec] [INFO] Total time: 9 seconds
     [exec] [INFO] Finished at: Thu Jan 29 00:38:18 CST 2009
     [exec] [INFO] Final Memory: 9M/18M
     [exec] [INFO] ------------------------------------------------------------------------
     [exec] 	at org.apache.maven.it.Verifier.executeGoals(Verifier.java:1268)
     [exec] 	at org.apache.maven.it.Verifier.executeGoal(Verifier.java:1120)
     [exec] 	at org.apache.maven.it.Verifier.executeGoal(Verifier.java:1114)
     [exec] 	at org.apache.maven.it.MavenITmng2668UsePluginDependenciesForSortingTest.testmng2668(MavenITmng2668UsePluginDependenciesForSortingTest.java:38)
     [exec] 	at org.apache.maven.it.MavenITmng2668UsePluginDependenciesForSortingTest.testmng2668(MavenITmng2668UsePluginDependenciesForSortingTest.java:38)
     [exec] 	at sun.reflect.NativeMethodAccessorImpl.invoke0(Native Method)
     [exec] 	at sun.reflect.NativeMethodAccessorImpl.invoke(NativeMethodAccessorImpl.java:39)
     [exec] 	at sun.reflect.DelegatingMethodAccessorImpl.invoke(DelegatingMethodAccessorImpl.java:25)
     [exec] 	at java.lang.reflect.Method.invoke(Method.java:324)
     [exec] 	at junit.framework.TestCase.runTest(TestCase.java:164)
     [exec] 	at org.apache.maven.it.AbstractMavenIntegrationTestCase.runTest(AbstractMavenIntegrationTestCase.java:164)
     [exec] 	at junit.framework.TestCase.runBare(TestCase.java:130)
     [exec] 	at junit.framework.TestResult$1.protect(TestResult.java:106)
     [exec] 	at junit.framework.TestResult.runProtected(TestResult.java:124)
     [exec] 	at junit.framework.TestResult.run(TestResult.java:109)
     [exec] 	at junit.framework.TestCase.run(TestCase.java:120)
     [exec] 	at junit.framework.TestSuite.runTest(TestSuite.java:230)
     [exec] 	at junit.framework.TestSuite.run(TestSuite.java:225)
     [exec] 	at junit.framework.TestSuite.runTest(TestSuite.java:230)
     [exec] 	at junit.framework.TestSuite.run(TestSuite.java:225)
     [exec] 	at sun.reflect.NativeMethodAccessorImpl.invoke0(Native Method)
     [exec] 	at sun.reflect.NativeMethodAccessorImpl.invoke(NativeMethodAccessorImpl.java:39)
     [exec] 	at sun.reflect.DelegatingMethodAccessorImpl.invoke(DelegatingMethodAccessorImpl.java:25)
     [exec] 	at java.lang.reflect.Method.invoke(Method.java:324)
     [exec] 	at org.apache.maven.surefire.junit.JUnitTestSet.execute(JUnitTestSet.java:213)
     [exec] 	at org.apache.maven.surefire.suite.AbstractDirectoryTestSuite.executeTestSet(AbstractDirectoryTestSuite.java:138)
     [exec] 	at org.apache.maven.surefire.suite.AbstractDirectoryTestSuite.execute(AbstractDirectoryTestSuite.java:125)
     [exec] 	at org.apache.maven.surefire.Surefire.run(Surefire.java:132)
     [exec] 	at sun.reflect.NativeMethodAccessorImpl.invoke0(Native Method)
     [exec] 	at sun.reflect.NativeMethodAccessorImpl.invoke(NativeMethodAccessorImpl.java:39)
     [exec] 	at sun.reflect.DelegatingMethodAccessorImpl.invoke(DelegatingMethodAccessorImpl.java:25)
     [exec] 	at java.lang.reflect.Method.invoke(Method.java:324)
     [exec] 	at org.apache.maven.surefire.booter.SurefireBooter.runSuitesInProcess(SurefireBooter.java:290)
     [exec] 	at org.apache.maven.surefire.booter.SurefireBooter.run(SurefireBooter.java:198)
     [exec] 	at org.apache.maven.plugin.surefire.SurefirePlugin.execute(SurefirePlugin.java:398)
     [exec] 	at org.apache.maven.plugin.DefaultPluginManager.executeMojo(DefaultPluginManager.java:453)
     [exec] 	at org.apache.maven.lifecycle.DefaultLifecycleExecutor.executeGoals(DefaultLifecycleExecutor.java:559)
     [exec] 	at org.apache.maven.lifecycle.DefaultLifecycleExecutor.executeGoalWithLifecycle(DefaultLifecycleExecutor.java:500)
     [exec] 	at org.apache.maven.lifecycle.DefaultLifecycleExecutor.executeGoal(DefaultLifecycleExecutor.java:479)
     [exec] 	at org.apache.maven.lifecycle.DefaultLifecycleExecutor.executeGoalAndHandleFailures(DefaultLifecycleExecutor.java:331)
     [exec] 	at org.apache.maven.lifecycle.DefaultLifecycleExecutor.executeTaskSegments(DefaultLifecycleExecutor.java:292)
     [exec] 	at org.apache.maven.lifecycle.DefaultLifecycleExecutor.execute(DefaultLifecycleExecutor.java:142)
     [exec] 	at org.apache.maven.DefaultMaven.doExecute(DefaultMaven.java:336)
     [exec] 	at org.apache.maven.DefaultMaven.execute(DefaultMaven.java:129)
     [exec] 	at org.apache.maven.cli.MavenCli.main(MavenCli.java:288)
     [exec] 	at sun.reflect.NativeMethodAccessorImpl.invoke0(Native Method)
     [exec] 	at sun.reflect.NativeMethodAccessorImpl.invoke(NativeMethodAccessorImpl.java:39)
     [exec] 	at sun.reflect.DelegatingMethodAccessorImpl.invoke(DelegatingMethodAccessorImpl.java:25)
     [exec] 	at java.lang.reflect.Method.invoke(Method.java:324)
     [exec] 	at org.codehaus.classworlds.Launcher.launchEnhanced(Launcher.java:315)
     [exec] 	at org.codehaus.classworlds.Launcher.launch(Launcher.java:255)
     [exec] 	at org.codehaus.classworlds.Launcher.mainWithExitCode(Launcher.java:430)
     [exec] 	at org.codehaus.classworlds.Launcher.main(Launcher.java:375)
     [exec] 
     [exec] 
     [exec] Results :
     [exec] 
     [exec] Tests in error: 
     [exec]   testmng2668(org.apache.maven.it.MavenITmng2668UsePluginDependenciesForSortingTest)
     [exec] 
     [exec] Tests run: 307, Failures: 0, Errors: 1, Skipped: 0
     [exec] 
     [exec] [INFO] ------------------------------------------------------------------------
     [exec] [ERROR] BUILD FAILURE
     [exec] [INFO] ------------------------------------------------------------------------
     [exec] [INFO] There are test failures.
     [exec] [INFO] ------------------------------------------------------------------------
     [exec] [INFO] For more information, run Maven with the -e switch
     [exec] [INFO] ------------------------------------------------------------------------
     [exec] [INFO] Total time: 25 minutes 5 seconds
     [exec] [INFO] Finished at: Thu Jan 29 00:45:20 CST 2009
     [exec] [INFO] Final Memory: 30M/55M
     [exec] [INFO] ------------------------------------------------------------------------

BUILD FAILED
http://grid.sonatype.org/ci/job/Maven-2.0.x-with-bootstrap/./jdk=1.4,label=osx/ws/maven-2.0.x/build.xml
:271: exec returned: 1

Total time: 28 minutes 23 seconds


Mime
View raw message