maven-notifications mailing list archives

Site index · List index
Message view « Date » · « Thread »
Top « Date » · « Thread »
From Hudson <Hud...@sonatype.org>
Subject Build failed in Hudson: Maven-2.1.x-bootstrap » 1.4,osx #66
Date Thu, 29 Jan 2009 06:44:45 GMT
See http://grid.sonatype.org/ci/job/Maven-2.1.x-bootstrap/./jdk=1.4,label=osx/66/changes

Changes:

[brett] [MNG-3920] block out the component api from plugins since they are only going to be
exposed to the one from the core (it is not shaded). This prevents the confusing scenario
of double loading the interfaces and having the container not register them properly

[brett] [MNG-3600] reverted the defaults for deployment. In 2.0.x, they didn't work due to
bugs in the Wagon implementation using Jsch and were hit and miss depending on existing permissions
in scpexe. These were resolved in 2.1.0-M1, however the use of defaults prevents the user
setting it up in the environment itself (eg using umasks), and problems with file modes causing
errors when they didn't need to be set. In conjunction, more deployment has moved to HTTP
reducing the impact. This is best left at "system default" and the way to configure it documented
(as it is on the site)

[brett] [MNG-3810] improve error message when you forget to add a required field in model
that modello isn't picking up

[brett] [MNG-3760] add the ${project.baseUri} expression

[brett] formatting

[brett] [MNG-2668] honour plugin dependencies in reactor sort order
Submitted by: Tibor Varga

------------------------------------------
[...truncated 4329 lines...]
     [exec] mng0818WarDepsNotTransitive(itMNG0818)......................OK (3.5 s)
     [exec] mng0814ExplicitProfileActivation(itMNG814)..................OK (1.8 s)
     [exec] mng0786ProfileAwareReactor(itMNG0786).......................OK (2.0 s)
     [exec] mng0781PluginConfigVsExecConfig(itMNG0781)..................OK (2.0 s)
     [exec] mng0773SettingsProfileReactorPollution(itMNG773)............OK (1.1 s)
     [exec] mng0768OfflineMode(itMNG768)................................OK (6.8 s)
     [exec] mng0761MissingSnapshotDistRepo(itMNG761)....................OK (2.0 s)
     [exec] mng0731LegacyRepoLayout(itMNG731)...........................OK (2.0 s)
     [exec] mng0680ParentBasedir(itMNG680)..............................OK (1.8 s)
     [exec] mng0674PluginParameterAlias(itMNG674).......................OK (2.1 s)
     [exec] mng0666IgnoreLegacyPom(itMNG666)............................OK (3.5 s)
     [exec] mng0557UserSettingsCliOption(itMNG557)......................OK (1.8 s)
     [exec] mng0553SettingsAuthzEncryption(it0553)......................FAILURE (1.1 s)
     [exec] mng0522PluginMgmtConfig(itMNG522)...........................OK (1.9 s)
     [exec] mng0507ArtifactRelocation(itMNG507).........................OK (2.1 s)
     [exec] mng0505VersionRange(itMNG505)...............................OK (13.0 s)
     [exec] mng0496IgnoreUnknownPluginParameters(itMNG496)..............OK (1.8 s)
     [exec] mng0479OverrideCentralRepo(itMNG479)........................OK (3.3 s)
     [exec] mng0471CustomLifecycle(itMNG471)............................OK (2.0 s)
     [exec] mng0469ReportConfig(itReportConfigOverridesBuildDefaults)...OK (1.8 s)
     [exec] mng0469ReportConfig(itBuildConfigDominantDuringBuild).......OK (1.8 s)
     [exec] mng0469ReportConfig(itBuildConfigIrrelevantForReports)......OK (2.2 s)
     [exec] mng0377PluginLookupFromPrefix(itMNG377).....................OK (2.7 s)
     [exec] mng0294MergeGlobalAndUserSettings(itMNG294).................OK (1.8 s)
     [exec] mng0282NonReactorExecWhenProjectIndependent(itMNG282).......OK (1.9 s)
     [exec] mng0249ResolveDepsFromReactor(itMNG0249)....................OK (2.3 s)
     [exec] mng0095ReactorFailureBehavior(itFailFast)...................OK (2.1 s)
     [exec] mng0095ReactorFailureBehavior(itFailNever)..................OK (2.2 s)
     [exec] mng0095ReactorFailureBehavior(itFailAtEnd)..................OK (2.1 s)
     [exec] 0144LifecycleExecutionOrder(it0144).........................OK (4.5 s)
     [exec] 0143TransitiveDependencyScopes(itCompileScope)..............OK (7.5 s)
     [exec] 0143TransitiveDependencyScopes(itProvidedScope).............OK (2.1 s)
     [exec] 0143TransitiveDependencyScopes(itRuntimeScope)..............OK (2.2 s)
     [exec] 0143TransitiveDependencyScopes(itTestScope).................OK (2.1 s)
     [exec] 0142DirectDependencyScopes(it0142)..........................OK (8.9 s)
     [exec] 0140(it0140)................................................OK (2.4 s)
     [exec] 0139(it0139)................................................OK (2.4 s)
     [exec] 0138PluginLifecycle(it0138).................................OK (3.6 s)
     [exec] 0137EarLifecycle(it0137)....................................OK (3.3 s)
     [exec] 0136RarLifecycle(it0136)....................................OK (3.4 s)
     [exec] 0135EjbLifecycle(it0135)....................................OK (3.3 s)
     [exec] 0134WarLifecycle(it0134)....................................OK (3.3 s)
     [exec] 0133JarLifecycle(it0133)....................................OK (3.7 s)
     [exec] 0132PomLifecycle(it0132)....................................OK (2.5 s)
     [exec] 0131SiteLifecycle(it0131)...................................OK (2.0 s)
     [exec] 0130CleanLifecycle(it0130)..................................OK (2.0 s)
     [exec] 0113ServerAuthzAvailableToWagonMgrInPlugin(it0113)..........OK (1.9 s)
     [exec] 0090(it0090)................................................OK (1.9 s)
     [exec] 0087(it0087)................................................OK (3.9 s)
     [exec] 0086(it0086)................................................OK (2.2 s)
     [exec] 0085(it0085)................................................OK (3.6 s)
     [exec] 0072(it0072)................................................OK (1.8 s)
     [exec] 0071(it0071)................................................OK (2.1 s)
     [exec] 0064(it0064)................................................OK (1.8 s)
     [exec] 0063(it0063)................................................OK (1.9 s)
     [exec] 0056(it0056)................................................OK (1.8 s)
     [exec] 0052(it0052)................................................OK (2.8 s)
     [exec] 0051(it0051)................................................OK (3.6 s)
     [exec] 0041(it0041)................................................OK (2.3 s)
     [exec] 0040(it0040)................................................OK (1.9 s)
     [exec] 0039(it0039)................................................OK (1.9 s)
     [exec] 0038(it0038)................................................OK (1.7 s)
     [exec] 0037(it0037)................................................OK (1.8 s)
     [exec] 0036(it0036)................................................OK (1.8 s)
     [exec] 0032(it0032)................................................OK (1.1 s)
     [exec] 0030(it0030)................................................OK (7.7 s)
     [exec] 0025(it0025)................................................OK (2.2 s)
     [exec] 0024(it0024)................................................OK (1.9 s)
     [exec] 0023(it0023)................................................OK (1.8 s)
     [exec] 0021(it0021)................................................OK (5.0 s)
     [exec] 0019(it0019)................................................OK (2.4 s)
     [exec] 0018(it0018)................................................OK (11.0 s)
     [exec] 0012(it0012)................................................OK (2.1 s)
     [exec] 0011(it0011)................................................OK (5.0 s)
     [exec] 0010(it0010)................................................OK (5.9 s)
     [exec] 0009(it0009)................................................OK (2.1 s)
     [exec] 0008(it0008)................................................OK (2.2 s)
     [exec] 0007(it0007)................................................OK (1.2 s)
     [exec] Tests run: 307, Failures: 1, Errors: 1, Skipped: 0, Time elapsed: 1,415.026 sec
<<< FAILURE!
     [exec] testitMNG3415(org.apache.maven.it.MavenITmng3415JunkRepositoryMetadataTest)  Time
elapsed: 15.352 sec  <<< FAILURE!
     [exec] junit.framework.AssertionFailedError: Metadata file should NOT be present in local
repository: /opt/repos/local-repository/org/apache/maven/its/mng3415/missing/1.0-SNAPSHOT/maven-metadata-testing-repo.xml
     [exec] 	at junit.framework.Assert.fail(Assert.java:47)
     [exec] 	at junit.framework.Assert.assertTrue(Assert.java:20)
     [exec] 	at junit.framework.Assert.assertFalse(Assert.java:34)
     [exec] 	at org.apache.maven.it.MavenITmng3415JunkRepositoryMetadataTest.assertMetadataMissing(MavenITmng3415JunkRepositoryMetadataTest.java:216)
     [exec] 	at org.apache.maven.it.MavenITmng3415JunkRepositoryMetadataTest.testitMNG3415(MavenITmng3415JunkRepositoryMetadataTest.java:114)
     [exec] 	at org.apache.maven.it.MavenITmng3415JunkRepositoryMetadataTest.testitMNG3415(MavenITmng3415JunkRepositoryMetadataTest.java:114)
     [exec] 	at sun.reflect.NativeMethodAccessorImpl.invoke0(Native Method)
     [exec] 	at sun.reflect.NativeMethodAccessorImpl.invoke(NativeMethodAccessorImpl.java:39)
     [exec] 	at sun.reflect.DelegatingMethodAccessorImpl.invoke(DelegatingMethodAccessorImpl.java:25)
     [exec] 	at java.lang.reflect.Method.invoke(Method.java:324)
     [exec] 	at junit.framework.TestCase.runTest(TestCase.java:164)
     [exec] 	at org.apache.maven.it.AbstractMavenIntegrationTestCase.runTest(AbstractMavenIntegrationTestCase.java:164)
     [exec] 	at junit.framework.TestCase.runBare(TestCase.java:130)
     [exec] 	at junit.framework.TestResult$1.protect(TestResult.java:106)
     [exec] 	at junit.framework.TestResult.runProtected(TestResult.java:124)
     [exec] 	at junit.framework.TestResult.run(TestResult.java:109)
     [exec] 	at junit.framework.TestCase.run(TestCase.java:120)
     [exec] 	at junit.framework.TestSuite.runTest(TestSuite.java:230)
     [exec] 	at junit.framework.TestSuite.run(TestSuite.java:225)
     [exec] 	at junit.framework.TestSuite.runTest(TestSuite.java:230)
     [exec] 	at junit.framework.TestSuite.run(TestSuite.java:225)
     [exec] 	at sun.reflect.NativeMethodAccessorImpl.invoke0(Native Method)
     [exec] 	at sun.reflect.NativeMethodAccessorImpl.invoke(NativeMethodAccessorImpl.java:39)
     [exec] 	at sun.reflect.DelegatingMethodAccessorImpl.invoke(DelegatingMethodAccessorImpl.java:25)
     [exec] 	at java.lang.reflect.Method.invoke(Method.java:324)
     [exec] 	at org.apache.maven.surefire.junit.JUnitTestSet.execute(JUnitTestSet.java:213)
     [exec] 	at org.apache.maven.surefire.suite.AbstractDirectoryTestSuite.executeTestSet(AbstractDirectoryTestSuite.java:138)
     [exec] 	at org.apache.maven.surefire.suite.AbstractDirectoryTestSuite.execute(AbstractDirectoryTestSuite.java:125)
     [exec] 	at org.apache.maven.surefire.Surefire.run(Surefire.java:132)
     [exec] 	at sun.reflect.NativeMethodAccessorImpl.invoke0(Native Method)
     [exec] 	at sun.reflect.NativeMethodAccessorImpl.invoke(NativeMethodAccessorImpl.java:39)
     [exec] 	at sun.reflect.DelegatingMethodAccessorImpl.invoke(DelegatingMethodAccessorImpl.java:25)
     [exec] 	at java.lang.reflect.Method.invoke(Method.java:324)
     [exec] 	at org.apache.maven.surefire.booter.SurefireBooter.runSuitesInProcess(SurefireBooter.java:290)
     [exec] 	at org.apache.maven.surefire.booter.SurefireBooter.run(SurefireBooter.java:198)
     [exec] 	at org.apache.maven.plugin.surefire.SurefirePlugin.execute(SurefirePlugin.java:398)
     [exec] 	at org.apache.maven.plugin.DefaultPluginManager.executeMojo(DefaultPluginManager.java:460)
     [exec] 	at org.apache.maven.lifecycle.DefaultLifecycleExecutor.executeGoals(DefaultLifecycleExecutor.java:677)
     [exec] 	at org.apache.maven.lifecycle.DefaultLifecycleExecutor.executeGoalWithLifecycle(DefaultLifecycleExecutor.java:539)
     [exec] 	at org.apache.maven.lifecycle.DefaultLifecycleExecutor.executeGoal(DefaultLifecycleExecutor.java:518)
     [exec] 	at org.apache.maven.lifecycle.DefaultLifecycleExecutor.executeGoalAndHandleFailures(DefaultLifecycleExecutor.java:370)
     [exec] 	at org.apache.maven.lifecycle.DefaultLifecycleExecutor.executeTaskSegments(DefaultLifecycleExecutor.java:331)
     [exec] 	at org.apache.maven.lifecycle.DefaultLifecycleExecutor.execute(DefaultLifecycleExecutor.java:181)
     [exec] 	at org.apache.maven.DefaultMaven.doExecute(DefaultMaven.java:345)
     [exec] 	at org.apache.maven.DefaultMaven.execute(DefaultMaven.java:132)
     [exec] 	at org.apache.maven.cli.MavenCli.main(MavenCli.java:291)
     [exec] 	at sun.reflect.NativeMethodAccessorImpl.invoke0(Native Method)
     [exec] 	at sun.reflect.NativeMethodAccessorImpl.invoke(NativeMethodAccessorImpl.java:39)
     [exec] 	at sun.reflect.DelegatingMethodAccessorImpl.invoke(DelegatingMethodAccessorImpl.java:25)
     [exec] 	at java.lang.reflect.Method.invoke(Method.java:324)
     [exec] 	at org.codehaus.classworlds.Launcher.launchEnhanced(Launcher.java:315)
     [exec] 	at org.codehaus.classworlds.Launcher.launch(Launcher.java:255)
     [exec] 	at org.codehaus.classworlds.Launcher.mainWithExitCode(Launcher.java:430)
     [exec] 	at org.codehaus.classworlds.Launcher.main(Launcher.java:375)
     [exec] 
     [exec] testit0553(org.apache.maven.it.MavenITmng0553SettingsAuthzEncryptionTest)  Time
elapsed: 1.078 sec  <<< ERROR!
     [exec] org.apache.maven.it.VerificationException: Exit code was non-zero: 1; command
line and log = 
     [exec] /tmp/apache-maven-2.1.0-M2-SNAPSHOT/bin/mvn --settings settings.xml -Dmaven.sec.path=sec.xml
-e --batch-mode -Dmaven.repo.local=/opt/repos/local-repository validate
     [exec] + Error stacktraces are turned on.
     [exec] [INFO] ------------------------------------------------------------------------
     [exec] [ERROR] FATAL ERROR
     [exec] [INFO] ------------------------------------------------------------------------
     [exec] [INFO] Unable to configure Maven for execution
     [exec] org.sonatype.plexus.components.sec.dispatcher.SecDispatcherException: java.io.FileNotFoundException:
sec.xml (No such file or directory)
     [exec] [INFO] ------------------------------------------------------------------------
     [exec] [INFO] Trace
     [exec] org.apache.maven.reactor.MavenExecutionException: Unable to configure Maven for
execution
     [exec] 	at org.apache.maven.DefaultMaven.doExecute(DefaultMaven.java:285)
     [exec] 	at org.apache.maven.DefaultMaven.execute(DefaultMaven.java:132)
     [exec] 	at org.apache.maven.cli.MavenCli.main(MavenCli.java:291)
     [exec] 	at sun.reflect.NativeMethodAccessorImpl.invoke0(Native Method)
     [exec] 	at sun.reflect.NativeMethodAccessorImpl.invoke(NativeMethodAccessorImpl.java:39)
     [exec] 	at sun.reflect.DelegatingMethodAccessorImpl.invoke(DelegatingMethodAccessorImpl.java:25)
     [exec] 	at java.lang.reflect.Method.invoke(Method.java:324)
     [exec] 	at org.codehaus.classworlds.Launcher.launchEnhanced(Launcher.java:315)
     [exec] 	at org.codehaus.classworlds.Launcher.launch(Launcher.java:255)
     [exec] 	at org.codehaus.classworlds.Launcher.mainWithExitCode(Launcher.java:430)
     [exec] 	at org.codehaus.classworlds.Launcher.main(Launcher.java:375)
     [exec] Caused by: org.apache.maven.SettingsConfigurationException: org.sonatype.plexus.components.sec.dispatcher.SecDispatcherException:
java.io.FileNotFoundException: sec.xml (No such file or directory)
     [exec] 	at org.apache.maven.DefaultMaven.resolveParameters(DefaultMaven.java:719)
     [exec] 	at org.apache.maven.DefaultMaven.doExecute(DefaultMaven.java:273)
     [exec] 	... 10 more
     [exec] [INFO] ------------------------------------------------------------------------
     [exec] [INFO] Total time: < 1 second
     [exec] [INFO] Finished at: Thu Jan 29 00:41:27 CST 2009
     [exec] [INFO] Final Memory: 1M/2M
     [exec] [INFO] ------------------------------------------------------------------------
     [exec] 	at org.apache.maven.it.Verifier.executeGoals(Verifier.java:1268)
     [exec] 	at org.apache.maven.it.Verifier.executeGoal(Verifier.java:1120)
     [exec] 	at org.apache.maven.it.Verifier.executeGoal(Verifier.java:1114)
     [exec] 	at org.apache.maven.it.MavenITmng0553SettingsAuthzEncryptionTest.testit0553(MavenITmng0553SettingsAuthzEncryptionTest.java:55)
     [exec] 	at org.apache.maven.it.MavenITmng0553SettingsAuthzEncryptionTest.testit0553(MavenITmng0553SettingsAuthzEncryptionTest.java:55)
     [exec] 	at sun.reflect.NativeMethodAccessorImpl.invoke0(Native Method)
     [exec] 	at sun.reflect.NativeMethodAccessorImpl.invoke(NativeMethodAccessorImpl.java:39)
     [exec] 	at sun.reflect.DelegatingMethodAccessorImpl.invoke(DelegatingMethodAccessorImpl.java:25)
     [exec] 	at java.lang.reflect.Method.invoke(Method.java:324)
     [exec] 	at junit.framework.TestCase.runTest(TestCase.java:164)
     [exec] 	at org.apache.maven.it.AbstractMavenIntegrationTestCase.runTest(AbstractMavenIntegrationTestCase.java:164)
     [exec] 	at junit.framework.TestCase.runBare(TestCase.java:130)
     [exec] 	at junit.framework.TestResult$1.protect(TestResult.java:106)
     [exec] 	at junit.framework.TestResult.runProtected(TestResult.java:124)
     [exec] 	at junit.framework.TestResult.run(TestResult.java:109)
     [exec] 	at junit.framework.TestCase.run(TestCase.java:120)
     [exec] 	at junit.framework.TestSuite.runTest(TestSuite.java:230)
     [exec] 	at junit.framework.TestSuite.run(TestSuite.java:225)
     [exec] 	at junit.framework.TestSuite.runTest(TestSuite.java:230)
     [exec] 	at junit.framework.TestSuite.run(TestSuite.java:225)
     [exec] 	at sun.reflect.NativeMethodAccessorImpl.invoke0(Native Method)
     [exec] 	at sun.reflect.NativeMethodAccessorImpl.invoke(NativeMethodAccessorImpl.java:39)
     [exec] 	at sun.reflect.DelegatingMethodAccessorImpl.invoke(DelegatingMethodAccessorImpl.java:25)
     [exec] 	at java.lang.reflect.Method.invoke(Method.java:324)
     [exec] 	at org.apache.maven.surefire.junit.JUnitTestSet.execute(JUnitTestSet.java:213)
     [exec] 	at org.apache.maven.surefire.suite.AbstractDirectoryTestSuite.executeTestSet(AbstractDirectoryTestSuite.java:138)
     [exec] 	at org.apache.maven.surefire.suite.AbstractDirectoryTestSuite.execute(AbstractDirectoryTestSuite.java:125)
     [exec] 	at org.apache.maven.surefire.Surefire.run(Surefire.java:132)
     [exec] 	at sun.reflect.NativeMethodAccessorImpl.invoke0(Native Method)
     [exec] 	at sun.reflect.NativeMethodAccessorImpl.invoke(NativeMethodAccessorImpl.java:39)
     [exec] 	at sun.reflect.DelegatingMethodAccessorImpl.invoke(DelegatingMethodAccessorImpl.java:25)
     [exec] 	at java.lang.reflect.Method.invoke(Method.java:324)
     [exec] 	at org.apache.maven.surefire.booter.SurefireBooter.runSuitesInProcess(SurefireBooter.java:290)
     [exec] 	at org.apache.maven.surefire.booter.SurefireBooter.run(SurefireBooter.java:198)
     [exec] 	at org.apache.maven.plugin.surefire.SurefirePlugin.execute(SurefirePlugin.java:398)
     [exec] 	at org.apache.maven.plugin.DefaultPluginManager.executeMojo(DefaultPluginManager.java:460)
     [exec] 	at org.apache.maven.lifecycle.DefaultLifecycleExecutor.executeGoals(DefaultLifecycleExecutor.java:677)
     [exec] 	at org.apache.maven.lifecycle.DefaultLifecycleExecutor.executeGoalWithLifecycle(DefaultLifecycleExecutor.java:539)
     [exec] 	at org.apache.maven.lifecycle.DefaultLifecycleExecutor.executeGoal(DefaultLifecycleExecutor.java:518)
     [exec] 	at org.apache.maven.lifecycle.DefaultLifecycleExecutor.executeGoalAndHandleFailures(DefaultLifecycleExecutor.java:370)
     [exec] 	at org.apache.maven.lifecycle.DefaultLifecycleExecutor.executeTaskSegments(DefaultLifecycleExecutor.java:331)
     [exec] 	at org.apache.maven.lifecycle.DefaultLifecycleExecutor.execute(DefaultLifecycleExecutor.java:181)
     [exec] 	at org.apache.maven.DefaultMaven.doExecute(DefaultMaven.java:345)
     [exec] 	at org.apache.maven.DefaultMaven.execute(DefaultMaven.java:132)
     [exec] 	at org.apache.maven.cli.MavenCli.main(MavenCli.java:291)
     [exec] 	at sun.reflect.NativeMethodAccessorImpl.invoke0(Native Method)
     [exec] 	at sun.reflect.NativeMethodAccessorImpl.invoke(NativeMethodAccessorImpl.java:39)
     [exec] 	at sun.reflect.DelegatingMethodAccessorImpl.invoke(DelegatingMethodAccessorImpl.java:25)
     [exec] 	at java.lang.reflect.Method.invoke(Method.java:324)
     [exec] 	at org.codehaus.classworlds.Launcher.launchEnhanced(Launcher.java:315)
     [exec] 	at org.codehaus.classworlds.Launcher.launch(Launcher.java:255)
     [exec] 	at org.codehaus.classworlds.Launcher.mainWithExitCode(Launcher.java:430)
     [exec] 	at org.codehaus.classworlds.Launcher.main(Launcher.java:375)
     [exec] 
     [exec] 
     [exec] Results :
     [exec] 
     [exec] Failed tests: 
     [exec]   testitMNG3415(org.apache.maven.it.MavenITmng3415JunkRepositoryMetadataTest)
     [exec] 
     [exec] Tests in error: 
     [exec]   testit0553(org.apache.maven.it.MavenITmng0553SettingsAuthzEncryptionTest)
     [exec] 
     [exec] Tests run: 307, Failures: 1, Errors: 1, Skipped: 0
     [exec] 
     [exec] [INFO] ------------------------------------------------------------------------
     [exec] [ERROR] BUILD FAILURE
     [exec] [INFO] ------------------------------------------------------------------------
     [exec] [INFO] There are test failures.
     [exec] [INFO] ------------------------------------------------------------------------
     [exec] [INFO] For more information, run Maven with the -e switch
     [exec] [INFO] ------------------------------------------------------------------------
     [exec] [INFO] Total time: 25 minutes 29 seconds
     [exec] [INFO] Finished at: Thu Jan 29 00:44:44 CST 2009
     [exec] [INFO] Final Memory: 30M/58M
     [exec] [INFO] ------------------------------------------------------------------------

BUILD FAILED
http://grid.sonatype.org/ci/job/Maven-2.1.x-bootstrap/./jdk=1.4,label=osx/ws/maven-2.1.x/build.xml
:279: exec returned: 1

Total time: 28 minutes 6 seconds


Mime
View raw message