maven-notifications mailing list archives

Site index · List index
Message view « Date » · « Thread »
Top « Date » · « Thread »
From Hudson <Hud...@sonatype.org>
Subject Build failed in Hudson: Maven-2.0.10-RC-bootstrap » osx #54
Date Wed, 07 Jan 2009 23:36:07 GMT
See http://grid.sonatype.com/ci/job/Maven-2.0.10-RC-bootstrap/./label=osx/54/changes

------------------------------------------
[...truncated 3183 lines...]
     [exec] 	at org.codehaus.classworlds.Launcher.main(Launcher.java:375)
     [exec] 
     [exec] testit0113(org.apache.maven.it.MavenIT0113ServerAuthzAvailableToWagonMgrInPluginTest)
 Time elapsed: 1.476 sec  <<< ERROR!
     [exec] org.apache.maven.it.VerificationException: Exit code was non-zero: 1; log = 
     [exec] + Error stacktraces are turned on.
     [exec] [INFO] Scanning for projects...
     [exec] [INFO] ------------------------------------------------------------------------
     [exec] [INFO] Building test
     [exec] [INFO]    task-segment: [validate]
     [exec] [INFO] ------------------------------------------------------------------------
     [exec] [INFO] ------------------------------------------------------------------------
     [exec] [ERROR] BUILD ERROR
     [exec] [INFO] ------------------------------------------------------------------------
     [exec] [INFO] Error building POM (may not be this project's POM).
     [exec] Project ID: org.apache.maven.its.plugins:maven-it-plugin-uses-wagon
     [exec] Reason: POM 'org.apache.maven.its.plugins:maven-it-plugin-uses-wagon' not found
in repository: Unable to download the artifact from any repository
     [exec]   org.apache.maven.its.plugins:maven-it-plugin-uses-wagon:pom:2.1-SNAPSHOT
     [exec] from the specified remote repositories:
     [exec]   central (http://repo1.maven.org/maven2)
     [exec]  for project org.apache.maven.its.plugins:maven-it-plugin-uses-wagon
     [exec] [INFO] ------------------------------------------------------------------------
     [exec] [INFO] Trace
     [exec] org.apache.maven.lifecycle.LifecycleExecutionException: Unable to build project
for plugin 'org.apache.maven.its.plugins:maven-it-plugin-uses-wagon': POM 'org.apache.maven.its.plugins:maven-it-plugin-uses-wagon'
not found in repository: Unable to download the artifact from any repository
     [exec]   org.apache.maven.its.plugins:maven-it-plugin-uses-wagon:pom:2.1-SNAPSHOT
     [exec] from the specified remote repositories:
     [exec]   central (http://repo1.maven.org/maven2)
     [exec]  for project org.apache.maven.its.plugins:maven-it-plugin-uses-wagon
     [exec] 	at org.apache.maven.lifecycle.DefaultLifecycleExecutor.verifyPlugin(DefaultLifecycleExecutor.java:1292)
     [exec] 	at org.apache.maven.lifecycle.DefaultLifecycleExecutor.bindPluginToLifecycle(DefaultLifecycleExecutor.java:1239)
     [exec] 	at org.apache.maven.lifecycle.DefaultLifecycleExecutor.constructLifecycleMappings(DefaultLifecycleExecutor.java:1005)
     [exec] 	at org.apache.maven.lifecycle.DefaultLifecycleExecutor.executeGoal(DefaultLifecycleExecutor.java:478)
     [exec] 	at org.apache.maven.lifecycle.DefaultLifecycleExecutor.executeGoalAndHandleFailures(DefaultLifecycleExecutor.java:331)
     [exec] 	at org.apache.maven.lifecycle.DefaultLifecycleExecutor.executeTaskSegments(DefaultLifecycleExecutor.java:292)
     [exec] 	at org.apache.maven.lifecycle.DefaultLifecycleExecutor.execute(DefaultLifecycleExecutor.java:142)
     [exec] 	at org.apache.maven.DefaultMaven.doExecute(DefaultMaven.java:336)
     [exec] 	at org.apache.maven.DefaultMaven.execute(DefaultMaven.java:129)
     [exec] 	at org.apache.maven.cli.MavenCli.main(MavenCli.java:301)
     [exec] 	at sun.reflect.NativeMethodAccessorImpl.invoke0(Native Method)
     [exec] 	at sun.reflect.NativeMethodAccessorImpl.invoke(NativeMethodAccessorImpl.java:39)
     [exec] 	at sun.reflect.DelegatingMethodAccessorImpl.invoke(DelegatingMethodAccessorImpl.java:25)
     [exec] 	at java.lang.reflect.Method.invoke(Method.java:597)
     [exec] 	at org.codehaus.classworlds.Launcher.launchEnhanced(Launcher.java:315)
     [exec] 	at org.codehaus.classworlds.Launcher.launch(Launcher.java:255)
     [exec] 	at org.codehaus.classworlds.Launcher.mainWithExitCode(Launcher.java:430)
     [exec] 	at org.codehaus.classworlds.Launcher.main(Launcher.java:375)
     [exec] Caused by: org.apache.maven.plugin.InvalidPluginException: Unable to build project
for plugin 'org.apache.maven.its.plugins:maven-it-plugin-uses-wagon': POM 'org.apache.maven.its.plugins:maven-it-plugin-uses-wagon'
not found in repository: Unable to download the artifact from any repository
     [exec]   org.apache.maven.its.plugins:maven-it-plugin-uses-wagon:pom:2.1-SNAPSHOT
     [exec] from the specified remote repositories:
     [exec]   central (http://repo1.maven.org/maven2)
     [exec]  for project org.apache.maven.its.plugins:maven-it-plugin-uses-wagon
     [exec] 	at org.apache.maven.plugin.DefaultPluginManager.checkRequiredMavenVersion(DefaultPluginManager.java:281)
     [exec] 	at org.apache.maven.plugin.DefaultPluginManager.verifyVersionedPlugin(DefaultPluginManager.java:197)
     [exec] 	at org.apache.maven.plugin.DefaultPluginManager.verifyPlugin(DefaultPluginManager.java:176)
     [exec] 	at org.apache.maven.lifecycle.DefaultLifecycleExecutor.verifyPlugin(DefaultLifecycleExecutor.java:1275)
     [exec] 	... 17 more
     [exec] Caused by: org.apache.maven.project.ProjectBuildingException: POM 'org.apache.maven.its.plugins:maven-it-plugin-uses-wagon'
not found in repository: Unable to download the artifact from any repository
     [exec]   org.apache.maven.its.plugins:maven-it-plugin-uses-wagon:pom:2.1-SNAPSHOT
     [exec] from the specified remote repositories:
     [exec]   central (http://repo1.maven.org/maven2)
     [exec]  for project org.apache.maven.its.plugins:maven-it-plugin-uses-wagon
     [exec] 	at org.apache.maven.project.DefaultMavenProjectBuilder.findModelFromRepository(DefaultMavenProjectBuilder.java:602)
     [exec] 	at org.apache.maven.project.DefaultMavenProjectBuilder.buildFromRepository(DefaultMavenProjectBuilder.java:248)
     [exec] 	at org.apache.maven.plugin.DefaultPluginManager.checkRequiredMavenVersion(DefaultPluginManager.java:265)
     [exec] 	... 20 more
     [exec] Caused by: org.apache.maven.artifact.resolver.ArtifactNotFoundException: Unable
to download the artifact from any repository
     [exec]   org.apache.maven.its.plugins:maven-it-plugin-uses-wagon:pom:2.1-SNAPSHOT
     [exec] from the specified remote repositories:
     [exec]   central (http://repo1.maven.org/maven2)
     [exec] 	at org.apache.maven.artifact.resolver.DefaultArtifactResolver.resolve(DefaultArtifactResolver.java:212)
     [exec] 	at org.apache.maven.artifact.resolver.DefaultArtifactResolver.resolve(DefaultArtifactResolver.java:74)
     [exec] 	at org.apache.maven.project.DefaultMavenProjectBuilder.findModelFromRepository(DefaultMavenProjectBuilder.java:555)
     [exec] 	... 22 more
     [exec] Caused by: org.apache.maven.wagon.ResourceDoesNotExistException: Unable to download
the artifact from any repository
     [exec] 	at org.apache.maven.artifact.manager.DefaultWagonManager.getArtifact(DefaultWagonManager.java:332)
     [exec] 	at org.apache.maven.artifact.resolver.DefaultArtifactResolver.resolve(DefaultArtifactResolver.java:200)
     [exec] 	... 24 more
     [exec] [INFO] ------------------------------------------------------------------------
     [exec] [INFO] Total time: < 1 second
     [exec] [INFO] Finished at: Wed Jan 07 17:30:13 CST 2009
     [exec] [INFO] Final Memory: 2M/7M
     [exec] [INFO] ------------------------------------------------------------------------
     [exec] 	at org.apache.maven.it.Verifier.executeGoals(Verifier.java:1267)
     [exec] 	at org.apache.maven.it.Verifier.executeGoal(Verifier.java:1120)
     [exec] 	at org.apache.maven.it.Verifier.executeGoal(Verifier.java:1114)
     [exec] 	at org.apache.maven.it.MavenIT0113ServerAuthzAvailableToWagonMgrInPluginTest.testit0113(MavenIT0113ServerAuthzAvailableToWagonMgrInPluginTest.java:50)
     [exec] 	at sun.reflect.NativeMethodAccessorImpl.invoke0(Native Method)
     [exec] 	at sun.reflect.NativeMethodAccessorImpl.invoke(NativeMethodAccessorImpl.java:39)
     [exec] 	at sun.reflect.DelegatingMethodAccessorImpl.invoke(DelegatingMethodAccessorImpl.java:25)
     [exec] 	at java.lang.reflect.Method.invoke(Method.java:597)
     [exec] 	at junit.framework.TestCase.runTest(TestCase.java:164)
     [exec] 	at org.apache.maven.it.AbstractMavenIntegrationTestCase.runTest(AbstractMavenIntegrationTestCase.java:164)
     [exec] 	at junit.framework.TestCase.runBare(TestCase.java:130)
     [exec] 	at junit.framework.TestResult$1.protect(TestResult.java:106)
     [exec] 	at junit.framework.TestResult.runProtected(TestResult.java:124)
     [exec] 	at junit.framework.TestResult.run(TestResult.java:109)
     [exec] 	at junit.framework.TestCase.run(TestCase.java:120)
     [exec] 	at junit.framework.TestSuite.runTest(TestSuite.java:230)
     [exec] 	at junit.framework.TestSuite.run(TestSuite.java:225)
     [exec] 	at junit.framework.TestSuite.runTest(TestSuite.java:230)
     [exec] 	at junit.framework.TestSuite.run(TestSuite.java:225)
     [exec] 	at sun.reflect.NativeMethodAccessorImpl.invoke0(Native Method)
     [exec] 	at sun.reflect.NativeMethodAccessorImpl.invoke(NativeMethodAccessorImpl.java:39)
     [exec] 	at sun.reflect.DelegatingMethodAccessorImpl.invoke(DelegatingMethodAccessorImpl.java:25)
     [exec] 	at java.lang.reflect.Method.invoke(Method.java:597)
     [exec] 	at org.apache.maven.surefire.junit.JUnitTestSet.execute(JUnitTestSet.java:213)
     [exec] 	at org.apache.maven.surefire.suite.AbstractDirectoryTestSuite.executeTestSet(AbstractDirectoryTestSuite.java:140)
     [exec] 	at org.apache.maven.surefire.suite.AbstractDirectoryTestSuite.execute(AbstractDirectoryTestSuite.java:127)
     [exec] 	at org.apache.maven.surefire.Surefire.run(Surefire.java:177)
     [exec] 	at sun.reflect.NativeMethodAccessorImpl.invoke0(Native Method)
     [exec] 	at sun.reflect.NativeMethodAccessorImpl.invoke(NativeMethodAccessorImpl.java:39)
     [exec] 	at sun.reflect.DelegatingMethodAccessorImpl.invoke(DelegatingMethodAccessorImpl.java:25)
     [exec] 	at java.lang.reflect.Method.invoke(Method.java:597)
     [exec] 	at org.apache.maven.surefire.booter.SurefireBooter.runSuitesInProcess(SurefireBooter.java:345)
     [exec] 	at org.apache.maven.surefire.booter.SurefireBooter.run(SurefireBooter.java:241)
     [exec] 	at org.apache.maven.plugin.surefire.SurefirePlugin.execute(SurefirePlugin.java:537)
     [exec] 	at org.apache.maven.plugin.DefaultPluginManager.executeMojo(DefaultPluginManager.java:453)
     [exec] 	at org.apache.maven.lifecycle.DefaultLifecycleExecutor.executeGoals(DefaultLifecycleExecutor.java:559)
     [exec] 	at org.apache.maven.lifecycle.DefaultLifecycleExecutor.executeGoalWithLifecycle(DefaultLifecycleExecutor.java:500)
     [exec] 	at org.apache.maven.lifecycle.DefaultLifecycleExecutor.executeGoal(DefaultLifecycleExecutor.java:479)
     [exec] 	at org.apache.maven.lifecycle.DefaultLifecycleExecutor.executeGoalAndHandleFailures(DefaultLifecycleExecutor.java:331)
     [exec] 	at org.apache.maven.lifecycle.DefaultLifecycleExecutor.executeTaskSegments(DefaultLifecycleExecutor.java:292)
     [exec] 	at org.apache.maven.lifecycle.DefaultLifecycleExecutor.execute(DefaultLifecycleExecutor.java:142)
     [exec] 	at org.apache.maven.DefaultMaven.doExecute(DefaultMaven.java:336)
     [exec] 	at org.apache.maven.DefaultMaven.execute(DefaultMaven.java:129)
     [exec] 	at org.apache.maven.cli.MavenCli.main(MavenCli.java:301)
     [exec] 	at sun.reflect.NativeMethodAccessorImpl.invoke0(Native Method)
     [exec] 	at sun.reflect.NativeMethodAccessorImpl.invoke(NativeMethodAccessorImpl.java:39)
     [exec] 	at sun.reflect.DelegatingMethodAccessorImpl.invoke(DelegatingMethodAccessorImpl.java:25)
     [exec] 	at java.lang.reflect.Method.invoke(Method.java:597)
     [exec] 	at org.codehaus.classworlds.Launcher.launchEnhanced(Launcher.java:315)
     [exec] 	at org.codehaus.classworlds.Launcher.launch(Launcher.java:255)
     [exec] 	at org.codehaus.classworlds.Launcher.mainWithExitCode(Launcher.java:430)
     [exec] 	at org.codehaus.classworlds.Launcher.main(Launcher.java:375)
     [exec] Caused by: org.apache.maven.plugin.InvalidPluginException: Unable to build project
for plugin 'org.apache.maven.its.plugins:maven-it-plugin-uses-wagon': POM 'org.apache.maven.its.plugins:maven-it-plugin-uses-wagon'
not found in repository: Unable to download the artifact from any repository
     [exec]   org.apache.maven.its.plugins:maven-it-plugin-uses-wagon:pom:2.1-SNAPSHOT
     [exec] from the specified remote repositories:
     [exec]   central (http://repo1.maven.org/maven2)
     [exec]  for project org.apache.maven.its.plugins:maven-it-plugin-uses-wagon
     [exec] 	at org.apache.maven.plugin.DefaultPluginManager.checkRequiredMavenVersion(DefaultPluginManager.java:281)
     [exec] 	at org.apache.maven.plugin.DefaultPluginManager.verifyVersionedPlugin(DefaultPluginManager.java:197)
     [exec] 	at org.apache.maven.plugin.DefaultPluginManager.verifyPlugin(DefaultPluginManager.java:176)
     [exec] 	at org.apache.maven.lifecycle.DefaultLifecycleExecutor.verifyPlugin(DefaultLifecycleExecutor.java:1275)
     [exec] 	... 17 more
     [exec] Caused by: org.apache.maven.project.ProjectBuildingException: POM 'org.apache.maven.its.plugins:maven-it-plugin-uses-wagon'
not found in repository: Unable to download the artifact from any repository
     [exec]   org.apache.maven.its.plugins:maven-it-plugin-uses-wagon:pom:2.1-SNAPSHOT
     [exec] from the specified remote repositories:
     [exec]   central (http://repo1.maven.org/maven2)
     [exec]  for project org.apache.maven.its.plugins:maven-it-plugin-uses-wagon
     [exec] 	at org.apache.maven.project.DefaultMavenProjectBuilder.findModelFromRepository(DefaultMavenProjectBuilder.java:602)
     [exec] 	at org.apache.maven.project.DefaultMavenProjectBuilder.buildFromRepository(DefaultMavenProjectBuilder.java:248)
     [exec] 	at org.apache.maven.plugin.DefaultPluginManager.checkRequiredMavenVersion(DefaultPluginManager.java:265)
     [exec] 	... 20 more
     [exec] Caused by: org.apache.maven.artifact.resolver.ArtifactNotFoundException: Unable
to download the artifact from any repository
     [exec]   org.apache.maven.its.plugins:maven-it-plugin-uses-wagon:pom:2.1-SNAPSHOT
     [exec] from the specified remote repositories:
     [exec]   central (http://repo1.maven.org/maven2)
     [exec] 	at org.apache.maven.artifact.resolver.DefaultArtifactResolver.resolve(DefaultArtifactResolver.java:212)
     [exec] 	at org.apache.maven.artifact.resolver.DefaultArtifactResolver.resolve(DefaultArtifactResolver.java:74)
     [exec] 	at org.apache.maven.project.DefaultMavenProjectBuilder.findModelFromRepository(DefaultMavenProjectBuilder.java:555)
     [exec] 	... 22 more
     [exec] Caused by: org.apache.maven.wagon.ResourceDoesNotExistException: Unable to download
the artifact from any repository
     [exec] 	at org.apache.maven.artifact.manager.DefaultWagonManager.getArtifact(DefaultWagonManager.java:332)
     [exec] 	at org.apache.maven.artifact.resolver.DefaultArtifactResolver.resolve(DefaultArtifactResolver.java:200)
     [exec] 	... 24 more
     [exec] [INFO] ------------------------------------------------------------------------
     [exec] [INFO] Total time: < 1 second
     [exec] [INFO] Finished at: Wed Jan 07 17:30:13 CST 2009
     [exec] [INFO] Final Memory: 2M/7M
     [exec] [INFO] ------------------------------------------------------------------------
     [exec] 	at org.apache.maven.it.Verifier.executeGoals(Verifier.java:1267)
     [exec] 	at org.apache.maven.it.Verifier.executeGoal(Verifier.java:1120)
     [exec] 	at org.apache.maven.it.Verifier.executeGoal(Verifier.java:1114)
     [exec] 	at org.apache.maven.it.MavenIT0113ServerAuthzAvailableToWagonMgrInPluginTest.testit0113(MavenIT0113ServerAuthzAvailableToWagonMgrInPluginTest.java:50)
     [exec] 	at sun.reflect.NativeMethodAccessorImpl.invoke0(Native Method)
     [exec] 	at sun.reflect.NativeMethodAccessorImpl.invoke(NativeMethodAccessorImpl.java:39)
     [exec] 	at sun.reflect.DelegatingMethodAccessorImpl.invoke(DelegatingMethodAccessorImpl.java:25)
     [exec] 	at java.lang.reflect.Method.invoke(Method.java:597)
     [exec] 	at junit.framework.TestCase.runTest(TestCase.java:164)
     [exec] 	at org.apache.maven.it.AbstractMavenIntegrationTestCase.runTest(AbstractMavenIntegrationTestCase.java:164)
     [exec] 	at junit.framework.TestCase.runBare(TestCase.java:130)
     [exec] 	at junit.framework.TestResult$1.protect(TestResult.java:106)
     [exec] 	at junit.framework.TestResult.runProtected(TestResult.java:124)
     [exec] 	at junit.framework.TestResult.run(TestResult.java:109)
     [exec] 	at junit.framework.TestCase.run(TestCase.java:120)
     [exec] 	at junit.framework.TestSuite.runTest(TestSuite.java:230)
     [exec] 	at junit.framework.TestSuite.run(TestSuite.java:225)
     [exec] 	at junit.framework.TestSuite.runTest(TestSuite.java:230)
     [exec] 	at junit.framework.TestSuite.run(TestSuite.java:225)
     [exec] 	at sun.reflect.NativeMethodAccessorImpl.invoke0(Native Method)
     [exec] 	at sun.reflect.NativeMethodAccessorImpl.invoke(NativeMethodAccessorImpl.java:39)
     [exec] 	at sun.reflect.DelegatingMethodAccessorImpl.invoke(DelegatingMethodAccessorImpl.java:25)
     [exec] 	at java.lang.reflect.Method.invoke(Method.java:597)
     [exec] 	at org.apache.maven.surefire.junit.JUnitTestSet.execute(JUnitTestSet.java:213)
     [exec] 	at org.apache.maven.surefire.suite.AbstractDirectoryTestSuite.executeTestSet(AbstractDirectoryTestSuite.java:140)
     [exec] 	at org.apache.maven.surefire.suite.AbstractDirectoryTestSuite.execute(AbstractDirectoryTestSuite.java:127)
     [exec] 	at org.apache.maven.surefire.Surefire.run(Surefire.java:177)
     [exec] 	at sun.reflect.NativeMethodAccessorImpl.invoke0(Native Method)
     [exec] 	at sun.reflect.NativeMethodAccessorImpl.invoke(NativeMethodAccessorImpl.java:39)
     [exec] 	at sun.reflect.DelegatingMethodAccessorImpl.invoke(DelegatingMethodAccessorImpl.java:25)
     [exec] 	at java.lang.reflect.Method.invoke(Method.java:597)
     [exec] 	at org.apache.maven.surefire.booter.SurefireBooter.runSuitesInProcess(SurefireBooter.java:345)
     [exec] 	at org.apache.maven.surefire.booter.SurefireBooter.run(SurefireBooter.java:241)
     [exec] 	at org.apache.maven.plugin.surefire.SurefirePlugin.execute(SurefirePlugin.java:537)
     [exec] 	at org.apache.maven.plugin.DefaultPluginManager.executeMojo(DefaultPluginManager.java:453)
     [exec] 	at org.apache.maven.lifecycle.DefaultLifecycleExecutor.executeGoals(DefaultLifecycleExecutor.java:559)
     [exec] 	at org.apache.maven.lifecycle.DefaultLifecycleExecutor.executeGoalWithLifecycle(DefaultLifecycleExecutor.java:500)
     [exec] 	at org.apache.maven.lifecycle.DefaultLifecycleExecutor.executeGoal(DefaultLifecycleExecutor.java:479)
     [exec] 	at org.apache.maven.lifecycle.DefaultLifecycleExecutor.executeGoalAndHandleFailures(DefaultLifecycleExecutor.java:331)
     [exec] 	at org.apache.maven.lifecycle.DefaultLifecycleExecutor.executeTaskSegments(DefaultLifecycleExecutor.java:292)
     [exec] 	at org.apache.maven.lifecycle.DefaultLifecycleExecutor.execute(DefaultLifecycleExecutor.java:142)
     [exec] 	at org.apache.maven.DefaultMaven.doExecute(DefaultMaven.java:336)
     [exec] 	at org.apache.maven.DefaultMaven.execute(DefaultMaven.java:129)
     [exec] 	at org.apache.maven.cli.MavenCli.main(MavenCli.java:301)
     [exec] 	at sun.reflect.NativeMethodAccessorImpl.invoke0(Native Method)
     [exec] 	at sun.reflect.NativeMethodAccessorImpl.invoke(NativeMethodAccessorImpl.java:39)
     [exec] 	at sun.reflect.DelegatingMethodAccessorImpl.invoke(DelegatingMethodAccessorImpl.java:25)
     [exec] 	at java.lang.reflect.Method.invoke(Method.java:597)
     [exec] 	at org.codehaus.classworlds.Launcher.launchEnhanced(Launcher.java:315)
     [exec] 	at org.codehaus.classworlds.Launcher.launch(Launcher.java:255)
     [exec] 	at org.codehaus.classworlds.Launcher.mainWithExitCode(Launcher.java:430)
     [exec] 	at org.codehaus.classworlds.Launcher.main(Launcher.java:375)
     [exec] 
     [exec] 
     [exec] Results :
     [exec] 
     [exec] Tests in error: 
     [exec]   testitMNG3710_OriginalModel(org.apache.maven.it.MavenITmng3710PollutedClonedPluginsTest)
     [exec]   testit0113(org.apache.maven.it.MavenIT0113ServerAuthzAvailableToWagonMgrInPluginTest)
     [exec] 
     [exec] Tests run: 272, Failures: 0, Errors: 2, Skipped: 0
     [exec] 
     [exec] [INFO] ------------------------------------------------------------------------
     [exec] [ERROR] BUILD FAILURE
     [exec] [INFO] ------------------------------------------------------------------------
     [exec] [INFO] There are test failures.
     [exec] 
     [exec] Please refer to /private/tmp/maven-integration-tests-2.0.10-RC/core-it-suite/target/surefire-reports
for the individual test results.
     [exec] [INFO] ------------------------------------------------------------------------
     [exec] [INFO] For more information, run Maven with the -e switch
     [exec] [INFO] ------------------------------------------------------------------------
     [exec] [INFO] Total time: 45 minutes 47 seconds
     [exec] [INFO] Finished at: Wed Jan 07 17:36:06 CST 2009
     [exec] [INFO] Final Memory: 47M/112M
     [exec] [INFO] ------------------------------------------------------------------------

BUILD FAILED
http://grid.sonatype.com/ci/job/Maven-2.0.10-RC-bootstrap/./label=osx/ws/maven-2.0.10-RC/build.xml
:260: exec returned: 1

Total time: 48 minutes 39 seconds


Mime
View raw message