maven-notifications mailing list archives

Site index · List index
Message view « Date » · « Thread »
Top « Date » · « Thread »
From Hudson <Hud...@sonatype.org>
Subject Build failed in Hudson: Maven-2.1.x-bootstrap » 1.4,osx #65
Date Thu, 29 Jan 2009 02:40:26 GMT
See http://grid.sonatype.org/ci/job/Maven-2.1.x-bootstrap/./jdk=1.4,label=osx/65/changes

Changes:

[brett] remove empty directories

------------------------------------------
[...truncated 4464 lines...]
     [exec] mng2865MirrorWildcard(itCentralRepo)........................OK (1.5 s)
     [exec] mng2861RelocationsAndRanges(itMNG2861)......................OK (8.8 s)
     [exec] mng2843PluginConfigPropertiesInjection(itMNG2843)...........OK (2.7 s)
     [exec] mng2831CustomArtifactHandlerAndCustomLifecycle(itMNG2831)...OK (2.9 s)
     [exec] mng2790LastUpdatedMetadata(itMNG2790).......................OK (3.6 s)
     [exec] mng2749ExtensionAvailableToPlugin(itMNG2749)................OK (2.0 s)
     [exec] mng2744checksumVerification(itMNG2744)......................OK (1.9 s)
     [exec] mng2739RequiredRepositoryElements(itMNG2739_RepositoryId)...OK (1.0 s)
     [exec] mng2739RequiredRepositoryElements(itMNG2739_RepositoryUrl)..OK (1.0 s)
     [exec] mng2695OfflinePluginSnapshots(itMNG2695)....................OK (3.1 s)
     [exec] mng2605BogusProfileActivation(itMNG2605)....................OK (1.4 s)
     [exec] mng2591MergeInheritedPluginConfig(itMNG2591)................OK (1.7 s)
     [exec] mng2562Timestamp(itMNG2562).................................OK (5.4 s)
     [exec] mng2539PluginDependenciesComeFromPluginRepos(itMNG2539).....OK (1.9 s)
     [exec] mng2339BadProjectInterpolation(itMNG2339a)..................OK (2.6 s)
     [exec] mng2339BadProjectInterpolation(itMNG2339b)..................OK (6.8 s)
     [exec] mng2318LocalParentResolution(itMNG2318).....................OK (1.8 s)
     [exec] mng2293CustomPluginParamImpl(itMNG2293).....................OK (2.3 s)
     [exec] mng2277AggregatorAndResolutionPlugins(itMNG2277)............OK (2.4 s)
     [exec] mng2254PomEncoding(itMNG2254)...............................OK (1.7 s)
     [exec] mng2234ActiveProfilesFromSettings(itMNG2234)................OK (4.7 s)
     [exec] mng2228ComponentInjection(itMNG2228)........................OK (2.5 s)
     [exec] mng2201PluginConfigInterpolation(itMNG2201).................OK (1.8 s)
     [exec] mng2196ParentResolution(itMNG2196)..........................OK (6.4 s)
     [exec] mng2136ActiveByDefaultProfile(itMNG2136)....................OK (4.4 s)
     [exec] mng2130ParentLookupFromReactorCache(itMNG2130)..............OK (6.4 s)
     [exec] mng2124PomInterpolationWithParentValues(itMNG2124)..........OK (2.2 s)
     [exec] mng2123VersionRangeDependency(itMNG2123)....................OK (21.2 s)
     [exec] mng2068ReactorRelativeParents(itInheritedIdFields)..........OK (1.1 s)
     [exec] mng2068ReactorRelativeParents(itExplicitIdFields)...........OK (1.0 s)
     [exec] mng2068ReactorRelativeParents(itComplex)....................OK (1.1 s)
     [exec] mng2054PluginExecutionInheritance(itMNG2054)................OK (9.7 s)
     [exec] mng2052InterpolateWithSettingsProfileProperties(itMNG2052)..OK (3.0 s)
     [exec] mng2045testJarDependenciesBrokenInReactor(itMNG2045)........OK (7.5 s)
     [exec] mng2006ChildPathAwareUrlInheritance(itMNG2006)..............OK (1.9 s)
     [exec] mng1999DefaultReportsInheritance(itInheritSuppression)......OK (2.3 s)
     [exec] mng1999DefaultReportsInheritance(itOverrideSuppression).....OK (34.9 s)
     [exec] mng1995InterpolateBooleanModelElements(itMNG1995)...........SKIPPED - version
2.1.0-M2-SNAPSHOT not in range (2.999.0,)
     [exec] mng1992SystemPropOverridesPomProp(itMNG1992)................SKIPPED - version
2.1.0-M2-SNAPSHOT not in range (2.999,)
     [exec] mng1908LegacySnapshotUpdate(itMNG1908)......................OK (3.2 s)
     [exec] mng1830ShowVersion(Version).................................OK (1.8 s)
     [exec] mng1703PluginMgmtDepInheritance(itMNG1703)..................OK (2.2 s)
     [exec] mng1493NonStandardModulePomNames(itMNG1493).................OK (1.7 s)
     [exec] mng1491ReactorArtifactIdCollision(itMNG1491)................OK (1.1 s)
     [exec] mng1415QuotedSystemProperties(itMNG1415)....................OK (4.0 s)
     [exec] mng1412DependenciesOrder(itMNG1412).........................OK (6.0 s)
     [exec] mng1349ChecksumFormats(itMNG1349)...........................OK (2.1 s)
     [exec] mng1323AntrunDependencies(itMNG1323)........................SKIPPED - version
2.1.0-M2-SNAPSHOT not in range (2.999,)
     [exec] mng1233WarDepWithProvidedScope(itMNG1233)...................OK (1.8 s)
     [exec] mng1088ReactorDepResolution(itMNG1088)......................OK (2.4 s)
     [exec] mng1052PluginMngtConfig(itMNG1052)..........................OK (2.9 s)
     [exec] mng1021EqualAttachmentBuildNumber(itMNG1021)................OK (3.9 s)
     [exec] mng0985NonExecutedPluginMngtGoals(itMNG0985)................OK (1.7 s)
     [exec] mng0956ComponentInjectionViaProjectLevelPluginDep(itMNG0956)..OK (2.6 s)
     [exec] mng0870ReactorAwarePluginDiscovery(itMNG0870)...............OK (2.0 s)
     [exec] mng0866EvaluateDefaultValue(itMNG866).......................OK (1.8 s)
     [exec] mng0848SystemPropOverridesDefaultValue(itMNG848)............OK (1.7 s)
     [exec] mng0836PluginParentResolution(itMNG836).....................OK (1.4 s)
     [exec] mng0823MojoContextPassing(itMNG0823)........................OK (3.9 s)
     [exec] mng0820ConflictResolution(itMNG0820)........................OK (13.9 s)
     [exec] mng0818WarDepsNotTransitive(itMNG0818)......................OK (2.0 s)
     [exec] mng0814ExplicitProfileActivation(itMNG814)..................OK (1.7 s)
     [exec] mng0786ProfileAwareReactor(itMNG0786).......................OK (1.7 s)
     [exec] mng0781PluginConfigVsExecConfig(itMNG0781)..................OK (1.9 s)
     [exec] mng0773SettingsProfileReactorPollution(itMNG773)............OK (1.0 s)
     [exec] mng0768OfflineMode(itMNG768)................................OK (4.6 s)
     [exec] mng0761MissingSnapshotDistRepo(itMNG761)....................OK (1.9 s)
     [exec] mng0731LegacyRepoLayout(itMNG731)...........................OK (1.8 s)
     [exec] mng0680ParentBasedir(itMNG680)..............................OK (1.6 s)
     [exec] mng0674PluginParameterAlias(itMNG674).......................OK (1.9 s)
     [exec] mng0666IgnoreLegacyPom(itMNG666)............................OK (1.9 s)
     [exec] mng0557UserSettingsCliOption(itMNG557)......................OK (1.6 s)
     [exec] mng0553SettingsAuthzEncryption(it0553)......................FAILURE (0.9 s)
     [exec] mng0522PluginMgmtConfig(itMNG522)...........................OK (1.8 s)
     [exec] mng0507ArtifactRelocation(itMNG507).........................OK (3.5 s)
     [exec] mng0505VersionRange(itMNG505)...............................OK (8.6 s)
     [exec] mng0496IgnoreUnknownPluginParameters(itMNG496)..............OK (1.7 s)
     [exec] mng0479OverrideCentralRepo(itMNG479)........................OK (3.0 s)
     [exec] mng0471CustomLifecycle(itMNG471)............................OK (3.4 s)
     [exec] mng0469ReportConfig(itReportConfigOverridesBuildDefaults)...OK (1.7 s)
     [exec] mng0469ReportConfig(itBuildConfigDominantDuringBuild).......OK (1.6 s)
     [exec] mng0469ReportConfig(itBuildConfigIrrelevantForReports)......OK (2.6 s)
     [exec] mng0377PluginLookupFromPrefix(itMNG377).....................OK (2.5 s)
     [exec] mng0294MergeGlobalAndUserSettings(itMNG294).................OK (1.6 s)
     [exec] mng0282NonReactorExecWhenProjectIndependent(itMNG282).......OK (1.8 s)
     [exec] mng0249ResolveDepsFromReactor(itMNG0249)....................OK (2.2 s)
     [exec] mng0095ReactorFailureBehavior(itFailFast)...................OK (2.8 s)
     [exec] mng0095ReactorFailureBehavior(itFailNever)..................OK (2.0 s)
     [exec] mng0095ReactorFailureBehavior(itFailAtEnd)..................OK (2.1 s)
     [exec] 0144LifecycleExecutionOrder(it0144).........................OK (5.0 s)
     [exec] 0143TransitiveDependencyScopes(itCompileScope)..............OK (2.0 s)
     [exec] 0143TransitiveDependencyScopes(itProvidedScope).............OK (1.9 s)
     [exec] 0143TransitiveDependencyScopes(itRuntimeScope)..............OK (1.9 s)
     [exec] 0143TransitiveDependencyScopes(itTestScope).................OK (1.9 s)
     [exec] 0142DirectDependencyScopes(it0142)..........................OK (2.0 s)
     [exec] 0140(it0140)................................................OK (2.4 s)
     [exec] 0139(it0139)................................................OK (2.3 s)
     [exec] 0138PluginLifecycle(it0138).................................OK (4.2 s)
     [exec] 0137EarLifecycle(it0137)....................................OK (4.1 s)
     [exec] 0136RarLifecycle(it0136)....................................OK (3.2 s)
     [exec] 0135EjbLifecycle(it0135)....................................OK (3.3 s)
     [exec] 0134WarLifecycle(it0134)....................................OK (3.3 s)
     [exec] 0133JarLifecycle(it0133)....................................OK (3.0 s)
     [exec] 0132PomLifecycle(it0132)....................................OK (2.3 s)
     [exec] 0131SiteLifecycle(it0131)...................................OK (1.8 s)
     [exec] 0130CleanLifecycle(it0130)..................................OK (1.8 s)
     [exec] 0113ServerAuthzAvailableToWagonMgrInPlugin(it0113)..........OK (1.6 s)
     [exec] 0090(it0090)................................................OK (1.8 s)
     [exec] 0087(it0087)................................................OK (2.1 s)
     [exec] 0086(it0086)................................................OK (2.0 s)
     [exec] 0085(it0085)................................................OK (1.9 s)
     [exec] 0072(it0072)................................................OK (1.7 s)
     [exec] 0071(it0071)................................................OK (1.9 s)
     [exec] 0064(it0064)................................................OK (1.9 s)
     [exec] 0063(it0063)................................................OK (1.8 s)
     [exec] 0056(it0056)................................................OK (1.6 s)
     [exec] 0052(it0052)................................................OK (2.6 s)
     [exec] 0051(it0051)................................................OK (3.9 s)
     [exec] 0041(it0041)................................................OK (2.3 s)
     [exec] 0040(it0040)................................................OK (1.7 s)
     [exec] 0039(it0039)................................................OK (1.7 s)
     [exec] 0038(it0038)................................................OK (1.7 s)
     [exec] 0037(it0037)................................................OK (1.7 s)
     [exec] 0036(it0036)................................................OK (1.7 s)
     [exec] 0032(it0032)................................................OK (1.0 s)
     [exec] 0030(it0030)................................................OK (7.3 s)
     [exec] 0025(it0025)................................................OK (1.9 s)
     [exec] 0024(it0024)................................................OK (1.8 s)
     [exec] 0023(it0023)................................................OK (1.6 s)
     [exec] 0021(it0021)................................................OK (2.4 s)
     [exec] 0019(it0019)................................................OK (2.3 s)
     [exec] 0018(it0018)................................................OK (3.2 s)
     [exec] 0012(it0012)................................................OK (2.0 s)
     [exec] 0011(it0011)................................................OK (1.9 s)
     [exec] 0010(it0010)................................................OK (1.9 s)
     [exec] 0009(it0009)................................................OK (1.9 s)
     [exec] 0008(it0008)................................................OK (1.9 s)
     [exec] 0007(it0007)................................................OK (1.0 s)
     [exec] Tests run: 299, Failures: 0, Errors: 1, Skipped: 0, Time elapsed: 1,190.802 sec
<<< FAILURE!
     [exec] testit0553(org.apache.maven.it.MavenITmng0553SettingsAuthzEncryptionTest)  Time
elapsed: 0.925 sec  <<< ERROR!
     [exec] org.apache.maven.it.VerificationException: Exit code was non-zero: 1; command
line and log = 
     [exec] /tmp/apache-maven-2.1.0-M2-SNAPSHOT/bin/mvn --settings settings.xml -Dmaven.sec.path=sec.xml
-e --batch-mode -Dmaven.repo.local=/opt/repos/local-repository validate
     [exec] + Error stacktraces are turned on.
     [exec] [INFO] ------------------------------------------------------------------------
     [exec] [ERROR] FATAL ERROR
     [exec] [INFO] ------------------------------------------------------------------------
     [exec] [INFO] Unable to configure Maven for execution
     [exec] org.sonatype.plexus.components.sec.dispatcher.SecDispatcherException: java.io.FileNotFoundException:
sec.xml (No such file or directory)
     [exec] [INFO] ------------------------------------------------------------------------
     [exec] [INFO] Trace
     [exec] org.apache.maven.reactor.MavenExecutionException: Unable to configure Maven for
execution
     [exec] 	at org.apache.maven.DefaultMaven.doExecute(DefaultMaven.java:285)
     [exec] 	at org.apache.maven.DefaultMaven.execute(DefaultMaven.java:132)
     [exec] 	at org.apache.maven.cli.MavenCli.main(MavenCli.java:291)
     [exec] 	at sun.reflect.NativeMethodAccessorImpl.invoke0(Native Method)
     [exec] 	at sun.reflect.NativeMethodAccessorImpl.invoke(NativeMethodAccessorImpl.java:39)
     [exec] 	at sun.reflect.DelegatingMethodAccessorImpl.invoke(DelegatingMethodAccessorImpl.java:25)
     [exec] 	at java.lang.reflect.Method.invoke(Method.java:324)
     [exec] 	at org.codehaus.classworlds.Launcher.launchEnhanced(Launcher.java:315)
     [exec] 	at org.codehaus.classworlds.Launcher.launch(Launcher.java:255)
     [exec] 	at org.codehaus.classworlds.Launcher.mainWithExitCode(Launcher.java:430)
     [exec] 	at org.codehaus.classworlds.Launcher.main(Launcher.java:375)
     [exec] Caused by: org.apache.maven.SettingsConfigurationException: org.sonatype.plexus.components.sec.dispatcher.SecDispatcherException:
java.io.FileNotFoundException: sec.xml (No such file or directory)
     [exec] 	at org.apache.maven.DefaultMaven.resolveParameters(DefaultMaven.java:719)
     [exec] 	at org.apache.maven.DefaultMaven.doExecute(DefaultMaven.java:273)
     [exec] 	... 10 more
     [exec] [INFO] ------------------------------------------------------------------------
     [exec] [INFO] Total time: < 1 second
     [exec] [INFO] Finished at: Wed Jan 28 20:37:48 CST 2009
     [exec] [INFO] Final Memory: 1M/2M
     [exec] [INFO] ------------------------------------------------------------------------
     [exec] 	at org.apache.maven.it.Verifier.executeGoals(Verifier.java:1268)
     [exec] 	at org.apache.maven.it.Verifier.executeGoal(Verifier.java:1120)
     [exec] 	at org.apache.maven.it.Verifier.executeGoal(Verifier.java:1114)
     [exec] 	at org.apache.maven.it.MavenITmng0553SettingsAuthzEncryptionTest.testit0553(MavenITmng0553SettingsAuthzEncryptionTest.java:55)
     [exec] 	at org.apache.maven.it.MavenITmng0553SettingsAuthzEncryptionTest.testit0553(MavenITmng0553SettingsAuthzEncryptionTest.java:55)
     [exec] 	at sun.reflect.NativeMethodAccessorImpl.invoke0(Native Method)
     [exec] 	at sun.reflect.NativeMethodAccessorImpl.invoke(NativeMethodAccessorImpl.java:39)
     [exec] 	at sun.reflect.DelegatingMethodAccessorImpl.invoke(DelegatingMethodAccessorImpl.java:25)
     [exec] 	at java.lang.reflect.Method.invoke(Method.java:324)
     [exec] 	at junit.framework.TestCase.runTest(TestCase.java:164)
     [exec] 	at org.apache.maven.it.AbstractMavenIntegrationTestCase.runTest(AbstractMavenIntegrationTestCase.java:164)
     [exec] 	at junit.framework.TestCase.runBare(TestCase.java:130)
     [exec] 	at junit.framework.TestResult$1.protect(TestResult.java:106)
     [exec] 	at junit.framework.TestResult.runProtected(TestResult.java:124)
     [exec] 	at junit.framework.TestResult.run(TestResult.java:109)
     [exec] 	at junit.framework.TestCase.run(TestCase.java:120)
     [exec] 	at junit.framework.TestSuite.runTest(TestSuite.java:230)
     [exec] 	at junit.framework.TestSuite.run(TestSuite.java:225)
     [exec] 	at junit.framework.TestSuite.runTest(TestSuite.java:230)
     [exec] 	at junit.framework.TestSuite.run(TestSuite.java:225)
     [exec] 	at sun.reflect.NativeMethodAccessorImpl.invoke0(Native Method)
     [exec] 	at sun.reflect.NativeMethodAccessorImpl.invoke(NativeMethodAccessorImpl.java:39)
     [exec] 	at sun.reflect.DelegatingMethodAccessorImpl.invoke(DelegatingMethodAccessorImpl.java:25)
     [exec] 	at java.lang.reflect.Method.invoke(Method.java:324)
     [exec] 	at org.apache.maven.surefire.junit.JUnitTestSet.execute(JUnitTestSet.java:213)
     [exec] 	at org.apache.maven.surefire.suite.AbstractDirectoryTestSuite.executeTestSet(AbstractDirectoryTestSuite.java:138)
     [exec] 	at org.apache.maven.surefire.suite.AbstractDirectoryTestSuite.execute(AbstractDirectoryTestSuite.java:125)
     [exec] 	at org.apache.maven.surefire.Surefire.run(Surefire.java:132)
     [exec] 	at sun.reflect.NativeMethodAccessorImpl.invoke0(Native Method)
     [exec] 	at sun.reflect.NativeMethodAccessorImpl.invoke(NativeMethodAccessorImpl.java:39)
     [exec] 	at sun.reflect.DelegatingMethodAccessorImpl.invoke(DelegatingMethodAccessorImpl.java:25)
     [exec] 	at java.lang.reflect.Method.invoke(Method.java:324)
     [exec] 	at org.apache.maven.surefire.booter.SurefireBooter.runSuitesInProcess(SurefireBooter.java:290)
     [exec] 	at org.apache.maven.surefire.booter.SurefireBooter.run(SurefireBooter.java:198)
     [exec] 	at org.apache.maven.plugin.surefire.SurefirePlugin.execute(SurefirePlugin.java:398)
     [exec] 	at org.apache.maven.plugin.DefaultPluginManager.executeMojo(DefaultPluginManager.java:460)
     [exec] 	at org.apache.maven.lifecycle.DefaultLifecycleExecutor.executeGoals(DefaultLifecycleExecutor.java:677)
     [exec] 	at org.apache.maven.lifecycle.DefaultLifecycleExecutor.executeGoalWithLifecycle(DefaultLifecycleExecutor.java:539)
     [exec] 	at org.apache.maven.lifecycle.DefaultLifecycleExecutor.executeGoal(DefaultLifecycleExecutor.java:518)
     [exec] 	at org.apache.maven.lifecycle.DefaultLifecycleExecutor.executeGoalAndHandleFailures(DefaultLifecycleExecutor.java:370)
     [exec] 	at org.apache.maven.lifecycle.DefaultLifecycleExecutor.executeTaskSegments(DefaultLifecycleExecutor.java:331)
     [exec] 	at org.apache.maven.lifecycle.DefaultLifecycleExecutor.execute(DefaultLifecycleExecutor.java:181)
     [exec] 	at org.apache.maven.DefaultMaven.doExecute(DefaultMaven.java:345)
     [exec] 	at org.apache.maven.DefaultMaven.execute(DefaultMaven.java:132)
     [exec] 	at org.apache.maven.cli.MavenCli.main(MavenCli.java:291)
     [exec] 	at sun.reflect.NativeMethodAccessorImpl.invoke0(Native Method)
     [exec] 	at sun.reflect.NativeMethodAccessorImpl.invoke(NativeMethodAccessorImpl.java:39)
     [exec] 	at sun.reflect.DelegatingMethodAccessorImpl.invoke(DelegatingMethodAccessorImpl.java:25)
     [exec] 	at java.lang.reflect.Method.invoke(Method.java:324)
     [exec] 	at org.codehaus.classworlds.Launcher.launchEnhanced(Launcher.java:315)
     [exec] 	at org.codehaus.classworlds.Launcher.launch(Launcher.java:255)
     [exec] 	at org.codehaus.classworlds.Launcher.mainWithExitCode(Launcher.java:430)
     [exec] 	at org.codehaus.classworlds.Launcher.main(Launcher.java:375)
     [exec] 
     [exec] 
     [exec] Results :
     [exec] 
     [exec] Tests in error: 
     [exec]   testit0553(org.apache.maven.it.MavenITmng0553SettingsAuthzEncryptionTest)
     [exec] 
     [exec] Tests run: 299, Failures: 0, Errors: 1, Skipped: 0
     [exec] 
     [exec] [INFO] ------------------------------------------------------------------------
     [exec] [ERROR] BUILD FAILURE
     [exec] [INFO] ------------------------------------------------------------------------
     [exec] [INFO] There are test failures.
     [exec] [INFO] ------------------------------------------------------------------------
     [exec] [INFO] For more information, run Maven with the -e switch
     [exec] [INFO] ------------------------------------------------------------------------
     [exec] [INFO] Total time: 21 minutes 3 seconds
     [exec] [INFO] Finished at: Wed Jan 28 20:40:25 CST 2009
     [exec] [INFO] Final Memory: 28M/56M
     [exec] [INFO] ------------------------------------------------------------------------

BUILD FAILED
http://grid.sonatype.org/ci/job/Maven-2.1.x-bootstrap/./jdk=1.4,label=osx/ws/maven-2.1.x/build.xml
:279: exec returned: 1

Total time: 23 minutes 31 seconds


Mime
View raw message