maven-notifications mailing list archives

Site index · List index
Message view « Date » · « Thread »
Top « Date » · « Thread »
From Hudson <Hud...@sonatype.org>
Subject Build failed in Hudson: Maven-2.0.10-RC-bootstrap » ubuntu #55
Date Fri, 09 Jan 2009 18:54:54 GMT
See http://grid.sonatype.com/ci/job/Maven-2.0.10-RC-bootstrap/./label=ubuntu/55/changes

Changes:

[Brian Fox] MNG-3974 - stop on first mirror pattern match (fix to handle repeated entires)

[Brian Fox] MNG-3974 - stop on first mirror pattern match

------------------------------------------
[...truncated 1967 lines...]
     [exec] mng3740SelfReferentialReactorProjects(itMNG3740)............OK (20.6 s)
     [exec] mng3729MultiForkAggregators(itMNG3729)......................OK (14.0 s)
     [exec] mng3724ExecutionProjectSync(itMNG3724)......................OK (14.4 s)
     [exec] mng3723ConcreteParentProject(itMNG3723).....................OK (11.6 s)
     [exec] mng3716AggregatorForking(itMNG3716).........................OK (23.6 s)
     [exec] mng3710PollutedClonedPlugins(itMNG3710_POMInheritance)......OK (12.8 s)
     [exec] mng3710PollutedClonedPlugins(itMNG3710_OriginalModel).......OK (15.1 s)
     [exec] mng3704LifecycleExecutorWrapper(itMNG3704)..................OK (17.8 s)
     [exec] mng3703ExecutionProjectWithRelativePaths(ForkFromMojo)......SKIPPED - version
2.0.10-RC8-SNAPSHOT not in range [2.1.0-M1,)
     [exec] mng3703ExecutionProjectWithRelativePaths(ForkFromReport)....SKIPPED - version
2.0.10-RC8-SNAPSHOT not in range [2.1.0-M1,)
     [exec] mng3694ReactorProjectsDynamism(itMNG3694)...................OK (12.6 s)
     [exec] mng3693PomFileBasedirChange(itMNG3693)......................OK (17.7 s)
     [exec] mng3684BuildPluginParameter(itMNG3684)......................OK (22.4 s)
     [exec] mng3680InvalidDependencyPOM(itMNG3680)......................OK (11.9 s)
     [exec] mng3679PluginExecIdInterpolation(itMNG3679).................OK (3.4 s)
     [exec] mng3671PluginLevelDepInterpolation(itMNG3671)...............OK (5.7 s)
     [exec] mng3667ResolveDepsWithBadPomVersion(itMNG3667)..............OK (6.1 s)
     [exec] mng3652UserAgentHeader(mng3652_UnConfiguredHttp)............SKIPPED - version
2.0.10-RC8-SNAPSHOT not in range [2.1.0-M1,2.99.99)
     [exec] mng3652UserAgentHeader(mng3652_UnConfiguredDAV).............SKIPPED - version
2.0.10-RC8-SNAPSHOT not in range [2.1.0-M1,2.99.99)
     [exec] mng3652UserAgentHeader(mng3652_ConfigurationInSettingsWithoutUserAgent)..SKIPPED
- version 2.0.10-RC8-SNAPSHOT not in range [2.1.0-M1,2.99.99)
     [exec] mng3652UserAgentHeader(mng3652_UserAgentConfiguredInSettings)..SKIPPED - version
2.0.10-RC8-SNAPSHOT not in range [2.1.0-M1,2.99.99)
     [exec] mng3642DynamicResources(itMNG3642)..........................OK (4.9 s)
     [exec] mng3599useHttpProxyForWebDAV(mng3599useHttpProxyForHttp)....OK (8.9 s)
     [exec] mng3599useHttpProxyForWebDAV(mng3599useHttpProxyForWebDAV).. [skipping DAV test
for Maven versions < 2.0.10]OK (0.0 s)
     [exec] mng3586SystemScopePluginDependency(itFromPlugin)............OK (2.0 s)
     [exec] mng3586SystemScopePluginDependency(itFromProject)...........OK (2.8 s)
     [exec] mng3581PluginUsesWagonDependency(mng3581)...................OK (11.3 s)
     [exec] mng3545ProfileDeactivation(BasicBuildWithDefaultProfiles)...OK (3.3 s)
     [exec] mng3545ProfileDeactivation(DeactivateDefaultProfilesDash)...OK (2.2 s)
     [exec] mng3545ProfileDeactivation(DeactivateDefaultProfilesExclamation)..OK (1.9 s)
     [exec] mng3545ProfileDeactivation(DeactivateActivatedByProp).......OK (2.7 s)
     [exec] mng3545ProfileDeactivation(ActivateThenDeactivate)..........OK (3.2 s)
     [exec] mng3545ProfileDeactivation(DefaultProfileAutoDeactivation)..OK (2.9 s)
     [exec] mng3536AppendedAbsolutePaths(itMNG3536).....................SKIPPED - version
2.0.10-RC8-SNAPSHOT not in range [2.1.0-M1,)
     [exec] mng3535SelfReferentialProperties(itMNG3535_ShouldSucceed)...SKIPPED - version
2.0.10-RC8-SNAPSHOT not in range [2.1.0-M1,2.99.99)
     [exec] mng3535SelfReferentialProperties(itMNG3535_ShouldFail)......SKIPPED - version
2.0.10-RC8-SNAPSHOT not in range [2.1.0-M1,2.99.99)
     [exec] mng3530DynamicPOMInterpolation(itMNG3530_BuildPath).........SKIPPED - version
2.0.10-RC8-SNAPSHOT not in range [2.1.0-M1,2.999)
     [exec] mng3530DynamicPOMInterpolation(itMNG3530_POMProperty).......SKIPPED - version
2.0.10-RC8-SNAPSHOT not in range [2.1.0-M1,2.999)
     [exec] mng3530DynamicPOMInterpolation(itMNG3530_ResourceDirectoryInterpolation)..SKIPPED
- version 2.0.10-RC8-SNAPSHOT not in range [2.1.0-M1,2.999)
     [exec] mng3503Xpp3Shading(itMNG3503NoLinkageErrors)................OK (3.8 s)
     [exec] mng3503Xpp3Shading(itMNG3503Xpp3Shading)....................OK (3.3 s)
     [exec] mng3498ForkToOtherMojo(itMNG3498)...........................OK (13.2 s)
     [exec] mng3485OverrideWagonExtension(itMNG3485)....................OK (9.0 s)
     [exec] mng3482DependencyPomInterpolation(itMNG3482)................OK (6.3 s)
     [exec] mng3475BaseAlignedDir(itMNG3475)............................OK (2.6 s)
     [exec] mng3461MirrorMatching(itExactMatchDominatesWildcard)........OK (2.5 s)
     [exec] mng3461MirrorMatching(itExternalWildcard)...................OK (3.0 s)
     [exec] mng3441MetadataUpdatedFromDeploymentRepository(itMNG3441)...OK (9.2 s)
     [exec] mng3428PluginDescriptorArtifactsIncomplete(itMNG3428).......OK (12.3 s)
     [exec] mng3415JunkRepositoryMetadata(itMNG3415)....................OK (30.0 s)
     [exec] mng3415JunkRepositoryMetadata(ShouldNotRepeatedlyUpdateOnResourceNotFoundException)..OK
(28.4 s)
     [exec] mng3396DependencyManagementForOverConstrainedRanges(itMNG3396)..OK (24.3 s)
     [exec] mng3394POMPluginVersionDominance(itMNG3394a)................OK (4.8 s)
     [exec] mng3394POMPluginVersionDominance(itMNG3394b)................OK (2.3 s)
     [exec] mng3380ManagedRelocatedTransdeps(itMNG3380).................OK (3.6 s)
     [exec] mng3372DirectInvocationOfPlugins(itMNG3372).................OK (11.8 s)
     [exec] mng3372DirectInvocationOfPlugins(DependencyTreeInvocation)..OK (8.2 s)
     [exec] mng3355TranslatedPathInterpolation(itMNG3355)...............OK (3.4 s)
     [exec] mng3331ModulePathNormalization(itMNG3331a)..................OK (3.4 s)
     [exec] mng3331ModulePathNormalization(itMNG3331b)..................OK (2.6 s)
     [exec] mng3314OfflineSnapshots(itMNG3314)..........................OK (5.8 s)
     [exec] mng3284UsingCachedPlugins(itMNG3284)........................SKIPPED - version
2.0.10-RC8-SNAPSHOT not in range (2.999,)
     [exec] mng3271DefaultReportsSuppression(itMNG3271).................SKIPPED - version
2.0.10-RC8-SNAPSHOT not in range (2.9999,)
     [exec] mng3221InfiniteForking(itMNG3221a)..........................OK (21.0 s)
     [exec] mng3221InfiniteForking(itMNG3221b)..........................OK (17.1 s)
     [exec] mng3268MultipleDashPCommandLine(MultipleProfileParams)......OK (8.0 s)
     [exec] mng3259DepsDroppedInMultiModuleBuild(itMNG3259).............OK (23.4 s)
     [exec] mng3220ImportScope(itMNG3220a)..............................OK (14.4 s)
     [exec] mng3220ImportScope(itMNG3220b)..............................OK (2.8 s)
     [exec] mng3106ProfileMultipleActivators(ProfilesWithMultipleActivators)..OK (8.2 s)
     [exec] mng3099SettingsProfilesWithNoPom(itMNG3099).................OK (14.3 s)
     [exec] mng3052DepRepoAggregation(itMNG3052)........................OK (24.0 s)
     [exec] mng3012CoreClassImport(itMNG3012)...........................OK (3.6 s)
     [exec] mng2972OverridePluginDependency(itLifecycleInvocation)......OK (2.9 s)
     [exec] mng2972OverridePluginDependency(itCommandLineInvocation)....OK (2.7 s)
     [exec] mng2926PluginPrefixOrder(itMNG2926).........................OK (19.1 s)
     [exec] mng2921ActiveAttachedArtifacts(itMNG2921)...................OK (3.3 s)
     [exec] mng2892HideCorePlexusUtils(itMNG2892).......................OK (3.3 s)
     [exec] mng2883LegacyRepoOffline(ParentUnresolvable)................OK (5.2 s)
     [exec] mng2883LegacyRepoOffline(DependencyUnresolvable)............OK (9.5 s)
     [exec] mng2883LegacyRepoOffline(PluginUnresolvable)................OK (6.4 s)
     [exec] mng2878DefaultReportXmlImport(itMNG2878)....................OK (3.0 s)
     [exec] mng2871PrePackageSubartifactResolution(itMNG2871)...........SKIPPED - version
2.0.10-RC8-SNAPSHOT not in range (2.999,)
     [exec] mng2861RelocationsAndRanges(itMNG2861)......................OK (14.7 s)
     [exec] mng2843PluginConfigPropertiesInjection(itMNG2843)...........OK (2.8 s)
     [exec] mng2790LastUpdatedMetadata(itMNG2790).......................OK (5.8 s)
     [exec] mng2749ExtensionAvailableToPlugin(itMNG2749)................OK (3.1 s)
     [exec] mng2744checksumVerification(itMNG2744)......................OK (2.8 s)
     [exec] mng2739RequiredRepositoryElements(itMNG2739_RepositoryId)...OK (1.7 s)
     [exec] mng2739RequiredRepositoryElements(itMNG2739_RepositoryUrl)..OK (1.8 s)
     [exec] mng2695OfflinePluginSnapshots(itMNG2695)....................OK (5.2 s)
     [exec] mng2591MergeInheritedPluginConfig(itMNG2591)................OK (2.3 s)
     [exec] mng2562Timestamp(itMNG2562).................................SKIPPED - version
2.0.10-RC8-SNAPSHOT not in range [2.1.0-M1,)
     [exec] mng2539PluginDependenciesComeFromPluginRepos(itMNG2539).....OK (2.7 s)
     [exec] mng2339BadProjectInterpolation(itMNG2339a)..................OK (4.5 s)
     [exec] mng2339BadProjectInterpolation(itMNG2339b)..................OK (8.1 s)
     [exec] mng2318LocalParentResolution(itMNG2318).....................OK (3.9 s)
     [exec] mng2293CustomPluginParamImpl(itMNG2293).....................OK (4.2 s)
     [exec] mng2277AggregatorAndResolutionPlugins(itMNG2277)............OK (3.8 s)
     [exec] mng2254PomEncoding(itMNG2254)...............................OK (3.2 s)
     [exec] mng2234ActiveProfilesFromSettings(itMNG2234)................OK (6.2 s)
     [exec] mng2228ComponentInjection(itMNG2228)........................OK (4.3 s)
     [exec] mng2201PluginConfigInterpolation(itMNG2201).................OK (3.0 s)
     [exec] mng2196ParentResolution(itMNG2196)..........................OK (8.5 s)
     [exec] mng2136ActiveByDefaultProfile(itMNG2136)....................OK (2.9 s)
     [exec] mng2130ParentLookupFromReactorCache(itMNG2130)..............OK (8.0 s)
     [exec] mng2124PomInterpolationWithParentValues(itMNG2124)..........OK (3.7 s)
     [exec] mng2123VersionRangeDependency(itMNG2123)....................OK (41.2 s)
     [exec] mng2068ReactorRelativeParents(itMNG2068)....................OK (3.1 s)
     [exec] mng2054PluginExecutionInheritance(itMNG2054)................OK (10.7 s)
     [exec] mng2052InterpolateWithSettingsProfileProperties(itMNG2052)..OK (5.7 s)
     [exec] mng2045testJarDependenciesBrokenInReactor(itMNG2045)........OK (9.9 s)
     [exec] mng2006ChildPathAwareUrlInheritance(itMNG2006)..............OK (2.7 s)
     [exec] mng1999DefaultReportsInheritance(itInheritSuppression)......OK (2.1 s)
     [exec] mng1999DefaultReportsInheritance(itOverrideSuppression).....OK (11.0 s)
     [exec] mng1995InterpolateBooleanModelElements(itMNG1995)...........SKIPPED - version
2.0.10-RC8-SNAPSHOT not in range (2.999.0,)
     [exec] mng1908LegacySnapshotUpdate(itMNG1908)......................OK (5.8 s)
     [exec] mng1830ShowVersion(Version).................................SKIPPED - version
2.0.10-RC8-SNAPSHOT not in range (2.0.10,2.1.0-M1),(2.1.0-M1,2.999)
     [exec] mng1703PluginMgmtDepInheritance(itMNG1703)..................OK (3.8 s)
     [exec] mng1493NonStandardModulePomNames(itMNG1493).................OK (3.3 s)
     [exec] mng1491ReactorArtifactIdCollision(itMNG1491)................OK (1.5 s)
     [exec] mng1415QuotedSystemProperties(itMNG1415)....................OK (7.3 s)
     [exec] mng1412DependenciesOrder(itMNG1412).........................OK (7.8 s)
     [exec] mng1349ChecksumFormats(itMNG1349)...........................SKIPPED - version
2.0.10-RC8-SNAPSHOT not in range (2.0.10,2.1.0-M1),(2.1.0-M1,)
     [exec] mng1323AntrunDependencies(itMNG1323)........................SKIPPED - version
2.0.10-RC8-SNAPSHOT not in range (2.999,)
     [exec] mng1233WarDepWithProvidedScope(itMNG1233)...................OK (2.4 s)
     [exec] mng1088ReactorDepResolution(itMNG1088)......................OK (3.3 s)
     [exec] mng1052PluginMngtConfig(itMNG1052)..........................OK (3.9 s)
     [exec] mng1021EqualAttachmentBuildNumber(itMNG1021)................OK (3.2 s)
     [exec] mng0985NonExecutedPluginMngtGoals(itMNG0985)................OK (3.2 s)
     [exec] mng0956ComponentInjectionViaProjectLevelPluginDep(itMNG0956)..OK (3.0 s)
     [exec] mng0932TestJarDeployment(itMNG0932).........................OK (12.0 s)
     [exec] mng0866EvaluateDefaultValue(itMNG866).......................OK (2.9 s)
     [exec] mng0851CustomPomFilename(itMNG851)..........................OK (6.7 s)
     [exec] mng0848SystemPropOverridesDefaultValue(itMNG848)............OK (4.4 s)
     [exec] mng0836PluginParentResolution(itMNG836).....................OK (2.9 s)
     [exec] mng0823MojoContextPassing(itMNG0823)........................OK (5.3 s)
     [exec] mng0820ConflictResolution(itMNG0820)........................OK (11.0 s)
     [exec] mng0818WarDepsNotTransitive(itMNG0818)......................OK (2.6 s)
     [exec] mng0814ExplicitProfileActivation(itMNG814)..................OK (6.0 s)
     [exec] mng0786ProfileAwareReactor(itMNG0786).......................OK (2.4 s)
     [exec] mng0781PluginConfigVsExecConfig(itMNG0781)..................OK (3.1 s)
     [exec] mng0773SettingsProfileReactorPollution(itMNG773)............OK (10.2 s)
     [exec] mng0768OfflineMode(itMNG768)................................OK (9.0 s)
     [exec] mng0761MissingSnapshotDistRepo(itMNG761)....................OK (7.5 s)
     [exec] mng0731LegacyRepoLayout(itMNG731)...........................OK (3.9 s)
     [exec] mng0680ParentBasedir(itMNG680)..............................OK (11.2 s)
     [exec] mng0674PluginParameterAlias(itMNG674).......................OK (4.6 s)
     [exec] mng0666IgnoreLegacyPom(itMNG666)............................OK (7.1 s)
     [exec] mng0557UserSettingsCliOption(itMNG557)......................OK (3.2 s)
     [exec] mng0522PluginMgmtConfig(itMNG522)...........................OK (9.4 s)
     [exec] mng0507ArtifactRelocation(itMNG507).........................OK (6.8 s)
     [exec] mng0505VersionRange(itMNG505)...............................OK (6.0 s)
     [exec] mng0496IgnoreUnknownPluginParameters(itMNG496)..............OK (4.0 s)
     [exec] mng0479OverrideCentralRepo(itMNG479)........................OK (6.4 s)
     [exec] mng0471CustomLifecycle(itMNG471)............................OK (3.8 s)
     [exec] mng0469ReportConfig(itReportConfigOverridesBuildDefaults)...OK (2.9 s)
     [exec] mng0469ReportConfig(itBuildConfigDominantDuringBuild).......OK (2.8 s)
     [exec] mng0469ReportConfig(itBuildConfigIrrelevantForReports)......OK (2.8 s)
     [exec] mng0377PluginLookupFromPrefix(itMNG377).....................OK (2.0 s)
     [exec] mng0294MergeGlobalAndUserSettings(itMNG294).................OK (3.3 s)
     [exec] mng0282NonReactorExecWhenProjectIndependent(itMNG282).......OK (4.1 s)
     [exec] mng0249ResolveDepsFromReactor(itMNG249).....................OK (14.1 s)
     [exec] mng0095ReactorFailureBehavior(itMNG95)......................OK (4.1 s)
     [exec] 0144LifecycleExecutionOrder(it0144).........................OK (4.5 s)
     [exec] 0143TransitiveDependencyScopes(itCompileScope)..............OK (2.8 s)
     [exec] 0143TransitiveDependencyScopes(itProvidedScope).............OK (2.3 s)
     [exec] 0143TransitiveDependencyScopes(itRuntimeScope)..............OK (2.2 s)
     [exec] 0143TransitiveDependencyScopes(itTestScope).................OK (2.3 s)
     [exec] 0142DirectDependencyScopes(it0142)..........................OK (3.0 s)
     [exec] 0140(it0140)................................................OK (5.0 s)
     [exec] 0139(it0139)................................................OK (3.7 s)
     [exec] 0138PluginLifecycle(it0138).................................OK (4.0 s)
     [exec] 0137EarLifecycle(it0137)....................................OK (4.2 s)
     [exec] 0136RarLifecycle(it0136)....................................OK (4.4 s)
     [exec] 0135EjbLifecycle(it0135)....................................OK (4.7 s)
     [exec] 0134WarLifecycle(it0134)....................................OK (4.1 s)
     [exec] 0133JarLifecycle(it0133)....................................OK (3.8 s)
     [exec] 0132PomLifecycle(it0132)....................................OK (3.7 s)
     [exec] 0131SiteLifecycle(it0131)...................................OK (3.6 s)
     [exec] 0130CleanLifecycle(it0130)..................................OK (4.5 s)
     [exec] 0115CustomArtifactHandlerAndCustomLifecycle(it0115).........OK (16.9 s)
     [exec] 0113ServerAuthzAvailableToWagonMgrInPlugin(it0113)..........OK (1.7 s)
     [exec] 0097(it0097)................................................OK (12.4 s)
     [exec] 0090(it0090)................................................OK (2.4 s)
     [exec] 0087(it0087)................................................OK (2.9 s)
     [exec] 0086(it0086)................................................OK (3.3 s)
     [exec] 0085(it0085)................................................OK (4.1 s)
     [exec] 0072(it0072)................................................OK (2.3 s)
     [exec] 0071(it0071)................................................OK (3.2 s)
     [exec] 0064(it0064)................................................OK (2.8 s)
     [exec] 0063(it0063)................................................OK (2.7 s)
     [exec] 0056(it0056)................................................OK (1.9 s)
     [exec] 0052(it0052)................................................OK (3.3 s)
     [exec] 0051(it0051)................................................OK (5.0 s)
     [exec] 0041(it0041)................................................OK (2.3 s)
     [exec] 0040(it0040)................................................OK (2.5 s)
     [exec] 0039(it0039)................................................OK (3.6 s)
     [exec] 0038(it0038)................................................OK (3.4 s)
     [exec] 0037(it0037)................................................OK (3.4 s)
     [exec] 0036(it0036)................................................OK (3.2 s)
     [exec] 0032(it0032)................................................OK (1.9 s)
     [exec] 0030(it0030)................................................OK (7.9 s)
     [exec] 0025(it0025)................................................OK (2.4 s)
     [exec] 0024(it0024)................................................OK (2.0 s)
     [exec] 0023(it0023)................................................OK (2.9 s)
     [exec] 0021(it0021)................................................OK (2.5 s)
     [exec] 0019(it0019)................................................OK (3.0 s)
     [exec] 0018(it0018)................................................OK (3.0 s)
     [exec] 0012(it0012)................................................OK (4.0 s)
     [exec] 0011(it0011)................................................OK (3.4 s)
     [exec] 0010(it0010)................................................OK (3.5 s)
     [exec] 0009(it0009)................................................OK (3.5 s)
     [exec] 0008(it0008)................................................OK (3.3 s)
     [exec] 0007(it0007)................................................OK (1.9 s)
     [exec] Tests run: 275, Failures: 1, Errors: 0, Skipped: 0, Time elapsed: 1,462.968 sec
<<< FAILURE!
     [exec] testitFromProfilesXml(org.apache.maven.it.MavenITmng3970DepResolutionFromProfileReposTest)
 Time elapsed: 2.746 sec  <<< FAILURE!
     [exec] junit.framework.AssertionFailedError: Expected file was not found: /opt/repos/local-repository/org/apache/maven/its/mng3970/a/0.1/a-0.1.jar
     [exec] 	at junit.framework.Assert.fail(Assert.java:47)
     [exec] 	at org.apache.maven.it.Verifier.verifyArtifactPresence(Verifier.java:955)
     [exec] 	at org.apache.maven.it.Verifier.assertArtifactPresent(Verifier.java:962)
     [exec] 	at org.apache.maven.it.MavenITmng3970DepResolutionFromProfileReposTest.testitFromProfilesXml(MavenITmng3970DepResolutionFromProfileReposTest.java:58)
     [exec] 
     [exec] 
     [exec] Results :
     [exec] 
     [exec] Failed tests: 
     [exec]   testitFromProfilesXml(org.apache.maven.it.MavenITmng3970DepResolutionFromProfileReposTest)
     [exec] 
     [exec] Tests run: 275, Failures: 1, Errors: 0, Skipped: 0
     [exec] 
     [exec] [INFO] ------------------------------------------------------------------------
     [exec] [ERROR] BUILD FAILURE
     [exec] [INFO] ------------------------------------------------------------------------
     [exec] [INFO] There are test failures.
     [exec] 
     [exec] Please refer to /tmp/maven-integration-tests-2.0.10-RC/core-it-suite/target/surefire-reports
for the individual test results.
     [exec] [INFO] ------------------------------------------------------------------------
     [exec] [INFO] For more information, run Maven with the -e switch
     [exec] [INFO] ------------------------------------------------------------------------
     [exec] [INFO] Total time: 24 minutes 53 seconds
     [exec] [INFO] Finished at: Fri Jan 09 12:54:53 CST 2009
     [exec] [INFO] Final Memory: 25M/71M
     [exec] [INFO] ------------------------------------------------------------------------

BUILD FAILED
/home/hudson/workspace/Maven-2.0.10-RC-bootstrap/label/ubuntu/maven-2.0.10-RC/build.xml:260:
exec returned: 1

Total time: 28 minutes 28 seconds


Mime
View raw message