maven-notifications mailing list archives

Site index · List index
Message view « Date » · « Thread »
Top « Date » · « Thread »
From Hudson <Hud...@sonatype.org>
Subject Build failed in Hudson: Maven-release-trunk » 1.5,osx #22
Date Sat, 17 Jan 2009 23:01:20 GMT
See http://grid.sonatype.com/ci/job/Maven-release-trunk/./jdk=1.5,label=osx/22/changes

Changes:

[Benjamin Bentmann] o Added new SCM stub provider as preparation for more thorough integration
testing

[Benjamin Bentmann] o Fixed output stream

------------------------------------------
[...truncated 155 lines...]
Running org.apache.maven.shared.release.phase.RewritePomsForDevelopmentPhaseTest
Tests run: 49, Failures: 0, Errors: 0, Skipped: 0, Time elapsed: 7.912 sec
Running org.apache.maven.shared.release.phase.RemoveReleasePomsPhaseTest
Tests run: 3, Failures: 0, Errors: 0, Skipped: 0, Time elapsed: 0.379 sec
Running org.apache.maven.shared.release.phase.RunPrepareGoalsPhaseTest
Tests run: 5, Failures: 0, Errors: 0, Skipped: 0, Time elapsed: 0.256 sec
Running org.apache.maven.shared.release.phase.RunPerformGoalsPhaseTest
Tests run: 1, Failures: 0, Errors: 0, Skipped: 0, Time elapsed: 0.052 sec
Running org.apache.maven.shared.release.exec.CommandLineFactoryTest
Tests run: 1, Failures: 0, Errors: 0, Skipped: 0, Time elapsed: 0.204 sec
Running org.apache.maven.shared.release.config.PropertiesReleaseDescriptorStoreTest
Tests run: 14, Failures: 0, Errors: 0, Skipped: 0, Time elapsed: 0.725 sec
Running org.apache.maven.shared.release.config.ReleaseUtilsTest
Tests run: 5, Failures: 0, Errors: 0, Skipped: 0, Time elapsed: 0.007 sec
Running org.apache.maven.shared.release.phase.RewritePomsForReleasePhaseTest
Tests run: 53, Failures: 0, Errors: 0, Skipped: 0, Time elapsed: 8.653 sec
Running org.apache.maven.shared.release.phase.CheckDependencySnapshotsPhaseTest
Tests run: 35, Failures: 0, Errors: 0, Skipped: 0, Time elapsed: 4.947 sec
Running org.apache.maven.shared.release.phase.ScmCommitPhaseTest
Tests run: 11, Failures: 0, Errors: 0, Skipped: 0, Time elapsed: 1.452 sec
Running org.apache.maven.shared.release.scm.DefaultScmRepositoryConfiguratorTest
Tests run: 8, Failures: 0, Errors: 0, Skipped: 0, Time elapsed: 0.474 sec
Running org.apache.maven.shared.release.phase.ScmTagPhaseTest
Tests run: 9, Failures: 0, Errors: 0, Skipped: 0, Time elapsed: 1.335 sec
Running org.apache.maven.shared.release.phase.CheckPomPhaseTest
Tests run: 9, Failures: 0, Errors: 0, Skipped: 0, Time elapsed: 0.546 sec
Running org.apache.maven.shared.release.phase.MapVersionsPhaseTest
Tests run: 8, Failures: 0, Errors: 0, Skipped: 0, Time elapsed: 0.48 sec
Running org.apache.maven.shared.release.phase.GenerateReleasePomsPhaseTest
Tests run: 37, Failures: 0, Errors: 0, Skipped: 0, Time elapsed: 5.878 sec
Running org.apache.maven.shared.release.exec.TeeConsumerTest
Tests run: 1, Failures: 0, Errors: 0, Skipped: 0, Time elapsed: 0.005 sec
Running org.apache.maven.shared.release.phase.ScmCheckModificationsPhaseTest
Tests run: 9, Failures: 0, Errors: 0, Skipped: 0, Time elapsed: 0.579 sec
Running org.apache.maven.shared.release.util.ReleaseUtilTest
Tests run: 1, Failures: 0, Errors: 0, Skipped: 0, Time elapsed: 0.065 sec
Running org.apache.maven.shared.release.versions.DefaultVersionInfoTest
Tests run: 21, Failures: 0, Errors: 0, Skipped: 0, Time elapsed: 1.382 sec
Running org.apache.maven.shared.release.phase.CreateBackupPomsPhaseTest
Tests run: 2, Failures: 0, Errors: 0, Skipped: 0, Time elapsed: 0.161 sec
Running org.apache.maven.shared.release.exec.TeeOutputStreamTest
Tests run: 1, Failures: 0, Errors: 0, Skipped: 0, Time elapsed: 0.004 sec
Running org.apache.maven.shared.release.phase.EndReleasePhaseTest
Tests run: 2, Failures: 0, Errors: 0, Skipped: 0, Time elapsed: 0.127 sec

Results :

Tests run: 321, Failures: 0, Errors: 0, Skipped: 0

[INFO] [jar:jar]
[INFO] Building jar: http://grid.sonatype.com/ci/job/Maven-release-trunk/./jdk=1.5,label=osx/ws/trunk/maven-release-manager/target/maven-release-manager-2.0-beta-9-SNAPSHOT.jar

[INFO] [install:install]
[INFO] Installing http://grid.sonatype.com/ci/job/Maven-release-trunk/./jdk=1.5,label=osx/ws/trunk/maven-release-manager/target/maven-release-manager-2.0-beta-9-SNAPSHOT.jar
 to /opt/repos/release/org/apache/maven/release/maven-release-manager/2.0-beta-9-SNAPSHOT/maven-release-manager-2.0-beta-9-SNAPSHOT.jar
[INFO] ------------------------------------------------------------------------
[INFO] Building Maven Release Plugin
[INFO]    task-segment: [clean, install]
[INFO] ------------------------------------------------------------------------
[INFO] [clean:clean]
[INFO] Deleting directory http://grid.sonatype.com/ci/job/Maven-release-trunk/./jdk=1.5,label=osx/ws/trunk/maven-release-plugin/target

[INFO] [enforcer:enforce {execution: ensure-no-container-api}]
[INFO] [plugin:helpmojo {execution: generated-helpmojo}]
[INFO] Using 2 extractors.
[INFO] Applying extractor for language: java
[INFO] Extractor for language: java found 6 mojo descriptors.
[INFO] Applying extractor for language: bsh
[INFO] Extractor for language: bsh found 0 mojo descriptors.
[INFO] [plugin:descriptor]
[INFO] Using 2 extractors.
[INFO] Applying extractor for language: java
[INFO] Extractor for language: java found 7 mojo descriptors.
[INFO] Applying extractor for language: bsh
[INFO] Extractor for language: bsh found 0 mojo descriptors.
[INFO] [remote-resources:process {execution: default}]
[INFO] [resources:resources]
[INFO] Using 'UTF-8' encoding to copy filtered resources.
[INFO] skip non existing resourceDirectory http://grid.sonatype.com/ci/job/Maven-release-trunk/./jdk=1.5,label=osx/ws/trunk/maven-release-plugin/src/main/resources

[INFO] Copying 3 resources
[INFO] [compiler:compile]
[INFO] Compiling 8 source files to http://grid.sonatype.com/ci/job/Maven-release-trunk/./jdk=1.5,label=osx/ws/trunk/maven-release-plugin/target/classes

[INFO] [resources:testResources]
[INFO] Using 'UTF-8' encoding to copy filtered resources.
[INFO] Copying 7 resources
[INFO] Copying 3 resources
[INFO] [compiler:testCompile]
[INFO] Compiling 5 source files to http://grid.sonatype.com/ci/job/Maven-release-trunk/./jdk=1.5,label=osx/ws/trunk/maven-release-plugin/target/test-classes

[INFO] [surefire:test]
[INFO] Surefire report directory: http://grid.sonatype.com/ci/job/Maven-release-trunk/./jdk=1.5,label=osx/ws/trunk/maven-release-plugin/target/surefire-reports


-------------------------------------------------------
 T E S T S
-------------------------------------------------------
Running org.apache.maven.plugins.release.StageReleaseMojoTest
Tests run: 1, Failures: 0, Errors: 0, Skipped: 0, Time elapsed: 0.76 sec
Running org.apache.maven.plugins.release.PrepareReleaseMojoTest
Tests run: 3, Failures: 0, Errors: 0, Skipped: 0, Time elapsed: 0.461 sec
Running org.apache.maven.plugins.release.PerformReleaseMojoTest
Tests run: 8, Failures: 0, Errors: 0, Skipped: 0, Time elapsed: 1.249 sec
Running org.apache.maven.plugins.release.CleanReleaseMojoTest
Tests run: 1, Failures: 0, Errors: 0, Skipped: 0, Time elapsed: 0.159 sec

Results :

Tests run: 13, Failures: 0, Errors: 0, Skipped: 0

[INFO] [jar:jar]
[INFO] Building jar: http://grid.sonatype.com/ci/job/Maven-release-trunk/./jdk=1.5,label=osx/ws/trunk/maven-release-plugin/target/maven-release-plugin-2.0-beta-9-SNAPSHOT.jar

[INFO] [plugin:addPluginArtifactMetadata]
[INFO] [invoker:install {execution: integration-test}]
[INFO] Installing http://grid.sonatype.com/ci/job/Maven-release-trunk/./jdk=1.5,label=osx/ws/trunk/maven-release-plugin/pom.xml
 to http://grid.sonatype.com/ci/job/Maven-release-trunk/./jdk=1.5,label=osx/ws/trunk/maven-release-plugin/target/local-repo/org/apache/maven/plugins/maven-release-plugin/2.0-beta-9-SNAPSHOT/maven-release-plugin-2.0-beta-9-SNAPSHOT.pom

[INFO] Installing http://grid.sonatype.com/ci/job/Maven-release-trunk/./jdk=1.5,label=osx/ws/trunk/maven-release-plugin/target/maven-release-plugin-2.0-beta-9-SNAPSHOT.jar
 to http://grid.sonatype.com/ci/job/Maven-release-trunk/./jdk=1.5,label=osx/ws/trunk/maven-release-plugin/target/local-repo/org/apache/maven/plugins/maven-release-plugin/2.0-beta-9-SNAPSHOT/maven-release-plugin-2.0-beta-9-SNAPSHOT.jar

[INFO] Installing http://grid.sonatype.com/ci/job/Maven-release-trunk/./jdk=1.5,label=osx/ws/trunk/pom.xml
 to http://grid.sonatype.com/ci/job/Maven-release-trunk/./jdk=1.5,label=osx/ws/trunk/maven-release-plugin/target/local-repo/org/apache/maven/release/maven-release/2.0-beta-9-SNAPSHOT/maven-release-2.0-beta-9-SNAPSHOT.pom

[INFO] Installing http://grid.sonatype.com/ci/job/Maven-release-trunk/./jdk=1.5,label=osx/ws/trunk/maven-release-manager/pom.xml
 to http://grid.sonatype.com/ci/job/Maven-release-trunk/./jdk=1.5,label=osx/ws/trunk/maven-release-plugin/target/local-repo/org/apache/maven/release/maven-release-manager/2.0-beta-9-SNAPSHOT/maven-release-manager-2.0-beta-9-SNAPSHOT.pom

[INFO] Installing http://grid.sonatype.com/ci/job/Maven-release-trunk/./jdk=1.5,label=osx/ws/trunk/maven-release-manager/target/maven-release-manager-2.0-beta-9-SNAPSHOT.jar
 to http://grid.sonatype.com/ci/job/Maven-release-trunk/./jdk=1.5,label=osx/ws/trunk/maven-release-plugin/target/local-repo/org/apache/maven/release/maven-release-manager/2.0-beta-9-SNAPSHOT/maven-release-manager-2.0-beta-9-SNAPSHOT.jar

[INFO] Installing http://grid.sonatype.com/ci/job/Maven-release-trunk/./jdk=1.5,label=osx/ws/trunk/pom.xml
 to http://grid.sonatype.com/ci/job/Maven-release-trunk/./jdk=1.5,label=osx/ws/trunk/maven-release-plugin/target/local-repo/org/apache/maven/release/maven-release/2.0-beta-9-SNAPSHOT/maven-release-2.0-beta-9-SNAPSHOT.pom

[INFO] Installing /opt/repos/release/org/apache/maven/maven-plugin-api/2.0/maven-plugin-api-2.0.jar
to http://grid.sonatype.com/ci/job/Maven-release-trunk/./jdk=1.5,label=osx/ws/trunk/maven-release-plugin/target/local-repo/org/apache/maven/maven-plugin-api/2.0/maven-plugin-api-2.0.jar

[INFO] Installing /opt/repos/release/org/apache/maven/maven-plugin-api/2.0/maven-plugin-api-2.0.pom
to http://grid.sonatype.com/ci/job/Maven-release-trunk/./jdk=1.5,label=osx/ws/trunk/maven-release-plugin/target/local-repo/org/apache/maven/maven-plugin-api/2.0/maven-plugin-api-2.0.pom

[INFO] Installing /opt/repos/release/org/codehaus/plexus/plexus-container-default/1.0-alpha-9/plexus-container-default-1.0-alpha-9.jar
to http://grid.sonatype.com/ci/job/Maven-release-trunk/./jdk=1.5,label=osx/ws/trunk/maven-release-plugin/target/local-repo/org/codehaus/plexus/plexus-container-default/1.0-alpha-9/plexus-container-default-1.0-alpha-9.jar

[INFO] Installing /opt/repos/release/org/codehaus/plexus/plexus-container-default/1.0-alpha-9/plexus-container-default-1.0-alpha-9.pom
to http://grid.sonatype.com/ci/job/Maven-release-trunk/./jdk=1.5,label=osx/ws/trunk/maven-release-plugin/target/local-repo/org/codehaus/plexus/plexus-container-default/1.0-alpha-9/plexus-container-default-1.0-alpha-9.pom

[INFO] Installing /opt/repos/release/junit/junit/3.8.1/junit-3.8.1.jar to http://grid.sonatype.com/ci/job/Maven-release-trunk/./jdk=1.5,label=osx/ws/trunk/maven-release-plugin/target/local-repo/junit/junit/3.8.1/junit-3.8.1.jar

[INFO] Installing /opt/repos/release/junit/junit/3.8.1/junit-3.8.1.pom to http://grid.sonatype.com/ci/job/Maven-release-trunk/./jdk=1.5,label=osx/ws/trunk/maven-release-plugin/target/local-repo/junit/junit/3.8.1/junit-3.8.1.pom

[INFO] Installing /opt/repos/release/org/codehaus/plexus/plexus-utils/1.5.6/plexus-utils-1.5.6.jar
to http://grid.sonatype.com/ci/job/Maven-release-trunk/./jdk=1.5,label=osx/ws/trunk/maven-release-plugin/target/local-repo/org/codehaus/plexus/plexus-utils/1.5.6/plexus-utils-1.5.6.jar

[INFO] Installing /opt/repos/release/org/codehaus/plexus/plexus-utils/1.5.6/plexus-utils-1.5.6.pom
to http://grid.sonatype.com/ci/job/Maven-release-trunk/./jdk=1.5,label=osx/ws/trunk/maven-release-plugin/target/local-repo/org/codehaus/plexus/plexus-utils/1.5.6/plexus-utils-1.5.6.pom

[INFO] Installing /opt/repos/release/classworlds/classworlds/1.1-alpha-2/classworlds-1.1-alpha-2.jar
to http://grid.sonatype.com/ci/job/Maven-release-trunk/./jdk=1.5,label=osx/ws/trunk/maven-release-plugin/target/local-repo/classworlds/classworlds/1.1-alpha-2/classworlds-1.1-alpha-2.jar

[INFO] Installing /opt/repos/release/classworlds/classworlds/1.1-alpha-2/classworlds-1.1-alpha-2.pom
to http://grid.sonatype.com/ci/job/Maven-release-trunk/./jdk=1.5,label=osx/ws/trunk/maven-release-plugin/target/local-repo/classworlds/classworlds/1.1-alpha-2/classworlds-1.1-alpha-2.pom

[INFO] Installing /opt/repos/release/org/codehaus/plexus/plexus-interactivity-api/1.0-alpha-6/plexus-interactivity-api-1.0-alpha-6.jar
to http://grid.sonatype.com/ci/job/Maven-release-trunk/./jdk=1.5,label=osx/ws/trunk/maven-release-plugin/target/local-repo/org/codehaus/plexus/plexus-interactivity-api/1.0-alpha-6/plexus-interactivity-api-1.0-alpha-6.jar

[INFO] Installing /opt/repos/release/org/codehaus/plexus/plexus-interactivity-api/1.0-alpha-6/plexus-interactivity-api-1.0-alpha-6.pom
to http://grid.sonatype.com/ci/job/Maven-release-trunk/./jdk=1.5,label=osx/ws/trunk/maven-release-plugin/target/local-repo/org/codehaus/plexus/plexus-interactivity-api/1.0-alpha-6/plexus-interactivity-api-1.0-alpha-6.pom

[INFO] Installing /opt/repos/release/org/apache/maven/maven-model/2.0/maven-model-2.0.jar
to http://grid.sonatype.com/ci/job/Maven-release-trunk/./jdk=1.5,label=osx/ws/trunk/maven-release-plugin/target/local-repo/org/apache/maven/maven-model/2.0/maven-model-2.0.jar

[INFO] Installing /opt/repos/release/org/apache/maven/maven-model/2.0/maven-model-2.0.pom
to http://grid.sonatype.com/ci/job/Maven-release-trunk/./jdk=1.5,label=osx/ws/trunk/maven-release-plugin/target/local-repo/org/apache/maven/maven-model/2.0/maven-model-2.0.pom

[INFO] Installing /opt/repos/release/org/apache/maven/maven-artifact/2.0.8/maven-artifact-2.0.8.jar
to http://grid.sonatype.com/ci/job/Maven-release-trunk/./jdk=1.5,label=osx/ws/trunk/maven-release-plugin/target/local-repo/org/apache/maven/maven-artifact/2.0.8/maven-artifact-2.0.8.jar

[INFO] Installing /opt/repos/release/org/apache/maven/maven-artifact/2.0.8/maven-artifact-2.0.8.pom
to http://grid.sonatype.com/ci/job/Maven-release-trunk/./jdk=1.5,label=osx/ws/trunk/maven-release-plugin/target/local-repo/org/apache/maven/maven-artifact/2.0.8/maven-artifact-2.0.8.pom

[INFO] Installing /opt/repos/release/org/apache/maven/maven-artifact-manager/2.0.8/maven-artifact-manager-2.0.8.jar
to http://grid.sonatype.com/ci/job/Maven-release-trunk/./jdk=1.5,label=osx/ws/trunk/maven-release-plugin/target/local-repo/org/apache/maven/maven-artifact-manager/2.0.8/maven-artifact-manager-2.0.8.jar

[INFO] Installing /opt/repos/release/org/apache/maven/maven-artifact-manager/2.0.8/maven-artifact-manager-2.0.8.pom
to http://grid.sonatype.com/ci/job/Maven-release-trunk/./jdk=1.5,label=osx/ws/trunk/maven-release-plugin/target/local-repo/org/apache/maven/maven-artifact-manager/2.0.8/maven-artifact-manager-2.0.8.pom

[INFO] Installing /opt/repos/release/org/apache/maven/maven-repository-metadata/2.0.8/maven-repository-metadata-2.0.8.jar
to http://grid.sonatype.com/ci/job/Maven-release-trunk/./jdk=1.5,label=osx/ws/trunk/maven-release-plugin/target/local-repo/org/apache/maven/maven-repository-metadata/2.0.8/maven-repository-metadata-2.0.8.jar

[INFO] Installing /opt/repos/release/org/apache/maven/maven-repository-metadata/2.0.8/maven-repository-metadata-2.0.8.pom
to http://grid.sonatype.com/ci/job/Maven-release-trunk/./jdk=1.5,label=osx/ws/trunk/maven-release-plugin/target/local-repo/org/apache/maven/maven-repository-metadata/2.0.8/maven-repository-metadata-2.0.8.pom

[INFO] Installing /opt/repos/release/org/apache/maven/wagon/wagon-provider-api/1.0-beta-2/wagon-provider-api-1.0-beta-2.jar
to http://grid.sonatype.com/ci/job/Maven-release-trunk/./jdk=1.5,label=osx/ws/trunk/maven-release-plugin/target/local-repo/org/apache/maven/wagon/wagon-provider-api/1.0-beta-2/wagon-provider-api-1.0-beta-2.jar

[INFO] Installing /opt/repos/release/org/apache/maven/wagon/wagon-provider-api/1.0-beta-2/wagon-provider-api-1.0-beta-2.pom
to http://grid.sonatype.com/ci/job/Maven-release-trunk/./jdk=1.5,label=osx/ws/trunk/maven-release-plugin/target/local-repo/org/apache/maven/wagon/wagon-provider-api/1.0-beta-2/wagon-provider-api-1.0-beta-2.pom

[INFO] Installing /opt/repos/release/org/apache/maven/maven-project/2.0/maven-project-2.0.jar
to http://grid.sonatype.com/ci/job/Maven-release-trunk/./jdk=1.5,label=osx/ws/trunk/maven-release-plugin/target/local-repo/org/apache/maven/maven-project/2.0/maven-project-2.0.jar

[INFO] Installing /opt/repos/release/org/apache/maven/maven-project/2.0/maven-project-2.0.pom
to http://grid.sonatype.com/ci/job/Maven-release-trunk/./jdk=1.5,label=osx/ws/trunk/maven-release-plugin/target/local-repo/org/apache/maven/maven-project/2.0/maven-project-2.0.pom

[INFO] Installing /opt/repos/release/org/apache/maven/maven-settings/2.0/maven-settings-2.0.jar
to http://grid.sonatype.com/ci/job/Maven-release-trunk/./jdk=1.5,label=osx/ws/trunk/maven-release-plugin/target/local-repo/org/apache/maven/maven-settings/2.0/maven-settings-2.0.jar

[INFO] Installing /opt/repos/release/org/apache/maven/maven-settings/2.0/maven-settings-2.0.pom
to http://grid.sonatype.com/ci/job/Maven-release-trunk/./jdk=1.5,label=osx/ws/trunk/maven-release-plugin/target/local-repo/org/apache/maven/maven-settings/2.0/maven-settings-2.0.pom

[INFO] Installing /opt/repos/release/org/apache/maven/maven-profile/2.0/maven-profile-2.0.jar
to http://grid.sonatype.com/ci/job/Maven-release-trunk/./jdk=1.5,label=osx/ws/trunk/maven-release-plugin/target/local-repo/org/apache/maven/maven-profile/2.0/maven-profile-2.0.jar

[INFO] Installing /opt/repos/release/org/apache/maven/maven-profile/2.0/maven-profile-2.0.pom
to http://grid.sonatype.com/ci/job/Maven-release-trunk/./jdk=1.5,label=osx/ws/trunk/maven-release-plugin/target/local-repo/org/apache/maven/maven-profile/2.0/maven-profile-2.0.pom

[INFO] Installing /opt/repos/release/org/apache/maven/shared/maven-invoker/2.0.9/maven-invoker-2.0.9.jar
to http://grid.sonatype.com/ci/job/Maven-release-trunk/./jdk=1.5,label=osx/ws/trunk/maven-release-plugin/target/local-repo/org/apache/maven/shared/maven-invoker/2.0.9/maven-invoker-2.0.9.jar

[INFO] Installing /opt/repos/release/org/apache/maven/shared/maven-invoker/2.0.9/maven-invoker-2.0.9.pom
to http://grid.sonatype.com/ci/job/Maven-release-trunk/./jdk=1.5,label=osx/ws/trunk/maven-release-plugin/target/local-repo/org/apache/maven/shared/maven-invoker/2.0.9/maven-invoker-2.0.9.pom

[INFO] Installing /opt/repos/release/commons-cli/commons-cli/1.0/commons-cli-1.0.jar to http://grid.sonatype.com/ci/job/Maven-release-trunk/./jdk=1.5,label=osx/ws/trunk/maven-release-plugin/target/local-repo/commons-cli/commons-cli/1.0/commons-cli-1.0.jar

[INFO] Installing /opt/repos/release/commons-cli/commons-cli/1.0/commons-cli-1.0.pom to http://grid.sonatype.com/ci/job/Maven-release-trunk/./jdk=1.5,label=osx/ws/trunk/maven-release-plugin/target/local-repo/commons-cli/commons-cli/1.0/commons-cli-1.0.pom

[INFO] Installing /opt/repos/release/commons-logging/commons-logging/1.0/commons-logging-1.0.jar
to http://grid.sonatype.com/ci/job/Maven-release-trunk/./jdk=1.5,label=osx/ws/trunk/maven-release-plugin/target/local-repo/commons-logging/commons-logging/1.0/commons-logging-1.0.jar

[INFO] Installing /opt/repos/release/commons-logging/commons-logging/1.0/commons-logging-1.0.pom
to http://grid.sonatype.com/ci/job/Maven-release-trunk/./jdk=1.5,label=osx/ws/trunk/maven-release-plugin/target/local-repo/commons-logging/commons-logging/1.0/commons-logging-1.0.pom

[INFO] Installing /opt/repos/release/commons-lang/commons-lang/1.0/commons-lang-1.0.jar to
http://grid.sonatype.com/ci/job/Maven-release-trunk/./jdk=1.5,label=osx/ws/trunk/maven-release-plugin/target/local-repo/commons-lang/commons-lang/1.0/commons-lang-1.0.jar

[INFO] Installing /opt/repos/release/commons-lang/commons-lang/1.0/commons-lang-1.0.pom to
http://grid.sonatype.com/ci/job/Maven-release-trunk/./jdk=1.5,label=osx/ws/trunk/maven-release-plugin/target/local-repo/commons-lang/commons-lang/1.0/commons-lang-1.0.pom

[INFO] Installing /opt/repos/release/org/apache/maven/scm/maven-scm-provider-accurev/1.1.1-SNAPSHOT/maven-scm-provider-accurev-1.1.1-SNAPSHOT.jar
to http://grid.sonatype.com/ci/job/Maven-release-trunk/./jdk=1.5,label=osx/ws/trunk/maven-release-plugin/target/local-repo/org/apache/maven/scm/maven-scm-provider-accurev/1.1.1-SNAPSHOT/maven-scm-provider-accurev-1.1.1-20090116.144117-28.jar

[INFO] Installing /opt/repos/release/org/apache/maven/scm/maven-scm-provider-accurev/1.1.1-SNAPSHOT/maven-scm-provider-accurev-1.1.1-20090116.144117-28.pom
to http://grid.sonatype.com/ci/job/Maven-release-trunk/./jdk=1.5,label=osx/ws/trunk/maven-release-plugin/target/local-repo/org/apache/maven/scm/maven-scm-provider-accurev/1.1.1-SNAPSHOT/maven-scm-provider-accurev-1.1.1-20090116.144117-28.pom

[INFO] Installing /opt/repos/release/org/apache/maven/scm/maven-scm-api/1.1.1-SNAPSHOT/maven-scm-api-1.1.1-SNAPSHOT.jar
to http://grid.sonatype.com/ci/job/Maven-release-trunk/./jdk=1.5,label=osx/ws/trunk/maven-release-plugin/target/local-repo/org/apache/maven/scm/maven-scm-api/1.1.1-SNAPSHOT/maven-scm-api-1.1.1-SNAPSHOT.jar

[INFO] Installing /opt/repos/release/org/apache/maven/scm/maven-scm-api/1.1.1-SNAPSHOT/maven-scm-api-1.1.1-SNAPSHOT.pom
to http://grid.sonatype.com/ci/job/Maven-release-trunk/./jdk=1.5,label=osx/ws/trunk/maven-release-plugin/target/local-repo/org/apache/maven/scm/maven-scm-api/1.1.1-SNAPSHOT/maven-scm-api-1.1.1-SNAPSHOT.pom

[INFO] Installing /opt/repos/release/org/apache/maven/scm/maven-scm-provider-bazaar/1.1.1-SNAPSHOT/maven-scm-provider-bazaar-1.1.1-SNAPSHOT.jar
to http://grid.sonatype.com/ci/job/Maven-release-trunk/./jdk=1.5,label=osx/ws/trunk/maven-release-plugin/target/local-repo/org/apache/maven/scm/maven-scm-provider-bazaar/1.1.1-SNAPSHOT/maven-scm-provider-bazaar-1.1.1-20090116.144117-28.jar

[INFO] Installing /opt/repos/release/org/apache/maven/scm/maven-scm-provider-bazaar/1.1.1-SNAPSHOT/maven-scm-provider-bazaar-1.1.1-20090116.144117-28.pom
to http://grid.sonatype.com/ci/job/Maven-release-trunk/./jdk=1.5,label=osx/ws/trunk/maven-release-plugin/target/local-repo/org/apache/maven/scm/maven-scm-provider-bazaar/1.1.1-SNAPSHOT/maven-scm-provider-bazaar-1.1.1-20090116.144117-28.pom

[INFO] Installing /opt/repos/release/regexp/regexp/1.3/regexp-1.3.jar to http://grid.sonatype.com/ci/job/Maven-release-trunk/./jdk=1.5,label=osx/ws/trunk/maven-release-plugin/target/local-repo/regexp/regexp/1.3/regexp-1.3.jar

[INFO] Installing /opt/repos/release/regexp/regexp/1.3/regexp-1.3.pom to http://grid.sonatype.com/ci/job/Maven-release-trunk/./jdk=1.5,label=osx/ws/trunk/maven-release-plugin/target/local-repo/regexp/regexp/1.3/regexp-1.3.pom

[INFO] Installing /opt/repos/release/org/apache/maven/scm/maven-scm-provider-clearcase/1.1.1-SNAPSHOT/maven-scm-provider-clearcase-1.1.1-SNAPSHOT.jar
to http://grid.sonatype.com/ci/job/Maven-release-trunk/./jdk=1.5,label=osx/ws/trunk/maven-release-plugin/target/local-repo/org/apache/maven/scm/maven-scm-provider-clearcase/1.1.1-SNAPSHOT/maven-scm-provider-clearcase-1.1.1-20090116.144117-28.jar

[INFO] Installing /opt/repos/release/org/apache/maven/scm/maven-scm-provider-clearcase/1.1.1-SNAPSHOT/maven-scm-provider-clearcase-1.1.1-20090116.144117-28.pom
to http://grid.sonatype.com/ci/job/Maven-release-trunk/./jdk=1.5,label=osx/ws/trunk/maven-release-plugin/target/local-repo/org/apache/maven/scm/maven-scm-provider-clearcase/1.1.1-SNAPSHOT/maven-scm-provider-clearcase-1.1.1-20090116.144117-28.pom

[INFO] Installing /opt/repos/release/org/apache/maven/scm/maven-scm-provider-cvsexe/1.1.1-SNAPSHOT/maven-scm-provider-cvsexe-1.1.1-SNAPSHOT.jar
to http://grid.sonatype.com/ci/job/Maven-release-trunk/./jdk=1.5,label=osx/ws/trunk/maven-release-plugin/target/local-repo/org/apache/maven/scm/maven-scm-provider-cvsexe/1.1.1-SNAPSHOT/maven-scm-provider-cvsexe-1.1.1-20090116.144117-28.jar

[INFO] Installing /opt/repos/release/org/apache/maven/scm/maven-scm-provider-cvsexe/1.1.1-SNAPSHOT/maven-scm-provider-cvsexe-1.1.1-20090116.144117-28.pom
to http://grid.sonatype.com/ci/job/Maven-release-trunk/./jdk=1.5,label=osx/ws/trunk/maven-release-plugin/target/local-repo/org/apache/maven/scm/maven-scm-provider-cvsexe/1.1.1-SNAPSHOT/maven-scm-provider-cvsexe-1.1.1-20090116.144117-28.pom

[INFO] Installing /opt/repos/release/org/apache/maven/scm/maven-scm-provider-cvs-commons/1.1.1-SNAPSHOT/maven-scm-provider-cvs-commons-1.1.1-SNAPSHOT.jar
to http://grid.sonatype.com/ci/job/Maven-release-trunk/./jdk=1.5,label=osx/ws/trunk/maven-release-plugin/target/local-repo/org/apache/maven/scm/maven-scm-provider-cvs-commons/1.1.1-SNAPSHOT/maven-scm-provider-cvs-commons-1.1.1-20090116.144117-28.jar

[INFO] Installing /opt/repos/release/org/apache/maven/scm/maven-scm-provider-cvs-commons/1.1.1-SNAPSHOT/maven-scm-provider-cvs-commons-1.1.1-20090116.144117-28.pom
to http://grid.sonatype.com/ci/job/Maven-release-trunk/./jdk=1.5,label=osx/ws/trunk/maven-release-plugin/target/local-repo/org/apache/maven/scm/maven-scm-provider-cvs-commons/1.1.1-SNAPSHOT/maven-scm-provider-cvs-commons-1.1.1-20090116.144117-28.pom

[INFO] Installing /opt/repos/release/org/apache/maven/scm/maven-scm-provider-cvsjava/1.1.1-SNAPSHOT/maven-scm-provider-cvsjava-1.1.1-SNAPSHOT.jar
to http://grid.sonatype.com/ci/job/Maven-release-trunk/./jdk=1.5,label=osx/ws/trunk/maven-release-plugin/target/local-repo/org/apache/maven/scm/maven-scm-provider-cvsjava/1.1.1-SNAPSHOT/maven-scm-provider-cvsjava-1.1.1-20090116.144117-28.jar

[INFO] Installing /opt/repos/release/org/apache/maven/scm/maven-scm-provider-cvsjava/1.1.1-SNAPSHOT/maven-scm-provider-cvsjava-1.1.1-20090116.144117-28.pom
to http://grid.sonatype.com/ci/job/Maven-release-trunk/./jdk=1.5,label=osx/ws/trunk/maven-release-plugin/target/local-repo/org/apache/maven/scm/maven-scm-provider-cvsjava/1.1.1-SNAPSHOT/maven-scm-provider-cvsjava-1.1.1-20090116.144117-28.pom

[INFO] Installing /opt/repos/release/org/netbeans/lib/cvsclient/20060125/cvsclient-20060125.jar
to http://grid.sonatype.com/ci/job/Maven-release-trunk/./jdk=1.5,label=osx/ws/trunk/maven-release-plugin/target/local-repo/org/netbeans/lib/cvsclient/20060125/cvsclient-20060125.jar

[INFO] Installing /opt/repos/release/org/netbeans/lib/cvsclient/20060125/cvsclient-20060125.pom
to http://grid.sonatype.com/ci/job/Maven-release-trunk/./jdk=1.5,label=osx/ws/trunk/maven-release-plugin/target/local-repo/org/netbeans/lib/cvsclient/20060125/cvsclient-20060125.pom

[INFO] Installing /opt/repos/release/ch/ethz/ganymed/ganymed-ssh2/build210/ganymed-ssh2-build210.jar
to http://grid.sonatype.com/ci/job/Maven-release-trunk/./jdk=1.5,label=osx/ws/trunk/maven-release-plugin/target/local-repo/ch/ethz/ganymed/ganymed-ssh2/build210/ganymed-ssh2-build210.jar

[INFO] Installing /opt/repos/release/ch/ethz/ganymed/ganymed-ssh2/build210/ganymed-ssh2-build210.pom
to http://grid.sonatype.com/ci/job/Maven-release-trunk/./jdk=1.5,label=osx/ws/trunk/maven-release-plugin/target/local-repo/ch/ethz/ganymed/ganymed-ssh2/build210/ganymed-ssh2-build210.pom

[INFO] Installing /opt/repos/release/org/apache/maven/scm/maven-scm-provider-gitexe/1.1.1-SNAPSHOT/maven-scm-provider-gitexe-1.1.1-SNAPSHOT.jar
to http://grid.sonatype.com/ci/job/Maven-release-trunk/./jdk=1.5,label=osx/ws/trunk/maven-release-plugin/target/local-repo/org/apache/maven/scm/maven-scm-provider-gitexe/1.1.1-SNAPSHOT/maven-scm-provider-gitexe-1.1.1-20090116.144117-28.jar

[INFO] Installing /opt/repos/release/org/apache/maven/scm/maven-scm-provider-gitexe/1.1.1-SNAPSHOT/maven-scm-provider-gitexe-1.1.1-20090116.144117-28.pom
to http://grid.sonatype.com/ci/job/Maven-release-trunk/./jdk=1.5,label=osx/ws/trunk/maven-release-plugin/target/local-repo/org/apache/maven/scm/maven-scm-provider-gitexe/1.1.1-SNAPSHOT/maven-scm-provider-gitexe-1.1.1-20090116.144117-28.pom

[INFO] Installing /opt/repos/release/org/apache/maven/scm/maven-scm-provider-git-commons/1.1.1-SNAPSHOT/maven-scm-provider-git-commons-1.1.1-SNAPSHOT.jar
to http://grid.sonatype.com/ci/job/Maven-release-trunk/./jdk=1.5,label=osx/ws/trunk/maven-release-plugin/target/local-repo/org/apache/maven/scm/maven-scm-provider-git-commons/1.1.1-SNAPSHOT/maven-scm-provider-git-commons-1.1.1-20090116.144117-28.jar

[INFO] Installing /opt/repos/release/org/apache/maven/scm/maven-scm-provider-git-commons/1.1.1-SNAPSHOT/maven-scm-provider-git-commons-1.1.1-20090116.144117-28.pom
to http://grid.sonatype.com/ci/job/Maven-release-trunk/./jdk=1.5,label=osx/ws/trunk/maven-release-plugin/target/local-repo/org/apache/maven/scm/maven-scm-provider-git-commons/1.1.1-SNAPSHOT/maven-scm-provider-git-commons-1.1.1-20090116.144117-28.pom

[INFO] Installing /opt/repos/release/org/apache/maven/scm/maven-scm-provider-hg/1.1.1-SNAPSHOT/maven-scm-provider-hg-1.1.1-SNAPSHOT.jar
to http://grid.sonatype.com/ci/job/Maven-release-trunk/./jdk=1.5,label=osx/ws/trunk/maven-release-plugin/target/local-repo/org/apache/maven/scm/maven-scm-provider-hg/1.1.1-SNAPSHOT/maven-scm-provider-hg-1.1.1-20090116.144117-28.jar

[INFO] Installing /opt/repos/release/org/apache/maven/scm/maven-scm-provider-hg/1.1.1-SNAPSHOT/maven-scm-provider-hg-1.1.1-20090116.144117-28.pom
to http://grid.sonatype.com/ci/job/Maven-release-trunk/./jdk=1.5,label=osx/ws/trunk/maven-release-plugin/target/local-repo/org/apache/maven/scm/maven-scm-provider-hg/1.1.1-SNAPSHOT/maven-scm-provider-hg-1.1.1-20090116.144117-28.pom

[INFO] Installing /opt/repos/release/org/apache/maven/scm/maven-scm-provider-perforce/1.1.1-SNAPSHOT/maven-scm-provider-perforce-1.1.1-SNAPSHOT.jar
to http://grid.sonatype.com/ci/job/Maven-release-trunk/./jdk=1.5,label=osx/ws/trunk/maven-release-plugin/target/local-repo/org/apache/maven/scm/maven-scm-provider-perforce/1.1.1-SNAPSHOT/maven-scm-provider-perforce-1.1.1-20090116.144117-28.jar

[INFO] Installing /opt/repos/release/org/apache/maven/scm/maven-scm-provider-perforce/1.1.1-SNAPSHOT/maven-scm-provider-perforce-1.1.1-20090116.144117-28.pom
to http://grid.sonatype.com/ci/job/Maven-release-trunk/./jdk=1.5,label=osx/ws/trunk/maven-release-plugin/target/local-repo/org/apache/maven/scm/maven-scm-provider-perforce/1.1.1-SNAPSHOT/maven-scm-provider-perforce-1.1.1-20090116.144117-28.pom

[INFO] Installing /opt/repos/release/org/apache/maven/scm/maven-scm-provider-starteam/1.1.1-SNAPSHOT/maven-scm-provider-starteam-1.1.1-SNAPSHOT.jar
to http://grid.sonatype.com/ci/job/Maven-release-trunk/./jdk=1.5,label=osx/ws/trunk/maven-release-plugin/target/local-repo/org/apache/maven/scm/maven-scm-provider-starteam/1.1.1-SNAPSHOT/maven-scm-provider-starteam-1.1.1-20090116.144117-28.jar

[INFO] Installing /opt/repos/release/org/apache/maven/scm/maven-scm-provider-starteam/1.1.1-SNAPSHOT/maven-scm-provider-starteam-1.1.1-20090116.144117-28.pom
to http://grid.sonatype.com/ci/job/Maven-release-trunk/./jdk=1.5,label=osx/ws/trunk/maven-release-plugin/target/local-repo/org/apache/maven/scm/maven-scm-provider-starteam/1.1.1-SNAPSHOT/maven-scm-provider-starteam-1.1.1-20090116.144117-28.pom

[INFO] Installing /opt/repos/release/org/apache/maven/scm/maven-scm-provider-svnexe/1.1.1-SNAPSHOT/maven-scm-provider-svnexe-1.1.1-SNAPSHOT.jar
to http://grid.sonatype.com/ci/job/Maven-release-trunk/./jdk=1.5,label=osx/ws/trunk/maven-release-plugin/target/local-repo/org/apache/maven/scm/maven-scm-provider-svnexe/1.1.1-SNAPSHOT/maven-scm-provider-svnexe-1.1.1-20090116.144117-27.jar

[INFO] Installing /opt/repos/release/org/apache/maven/scm/maven-scm-provider-svnexe/1.1.1-SNAPSHOT/maven-scm-provider-svnexe-1.1.1-20090116.144117-27.pom
to http://grid.sonatype.com/ci/job/Maven-release-trunk/./jdk=1.5,label=osx/ws/trunk/maven-release-plugin/target/local-repo/org/apache/maven/scm/maven-scm-provider-svnexe/1.1.1-SNAPSHOT/maven-scm-provider-svnexe-1.1.1-20090116.144117-27.pom

[INFO] Installing /opt/repos/release/org/apache/maven/scm/maven-scm-provider-svn-commons/1.1.1-SNAPSHOT/maven-scm-provider-svn-commons-1.1.1-SNAPSHOT.jar
to http://grid.sonatype.com/ci/job/Maven-release-trunk/./jdk=1.5,label=osx/ws/trunk/maven-release-plugin/target/local-repo/org/apache/maven/scm/maven-scm-provider-svn-commons/1.1.1-SNAPSHOT/maven-scm-provider-svn-commons-1.1.1-20090116.144117-28.jar

[INFO] Installing /opt/repos/release/org/apache/maven/scm/maven-scm-provider-svn-commons/1.1.1-SNAPSHOT/maven-scm-provider-svn-commons-1.1.1-20090116.144117-28.pom
to http://grid.sonatype.com/ci/job/Maven-release-trunk/./jdk=1.5,label=osx/ws/trunk/maven-release-plugin/target/local-repo/org/apache/maven/scm/maven-scm-provider-svn-commons/1.1.1-SNAPSHOT/maven-scm-provider-svn-commons-1.1.1-20090116.144117-28.pom

[INFO] Installing /opt/repos/release/org/apache/maven/scm/maven-scm-provider-synergy/1.1.1-SNAPSHOT/maven-scm-provider-synergy-1.1.1-SNAPSHOT.jar
to http://grid.sonatype.com/ci/job/Maven-release-trunk/./jdk=1.5,label=osx/ws/trunk/maven-release-plugin/target/local-repo/org/apache/maven/scm/maven-scm-provider-synergy/1.1.1-SNAPSHOT/maven-scm-provider-synergy-1.1.1-20090116.144117-27.jar

[INFO] Installing /opt/repos/release/org/apache/maven/scm/maven-scm-provider-synergy/1.1.1-SNAPSHOT/maven-scm-provider-synergy-1.1.1-20090116.144117-27.pom
to http://grid.sonatype.com/ci/job/Maven-release-trunk/./jdk=1.5,label=osx/ws/trunk/maven-release-plugin/target/local-repo/org/apache/maven/scm/maven-scm-provider-synergy/1.1.1-SNAPSHOT/maven-scm-provider-synergy-1.1.1-20090116.144117-27.pom

[INFO] Installing /opt/repos/release/org/apache/maven/scm/maven-scm-provider-vss/1.1.1-SNAPSHOT/maven-scm-provider-vss-1.1.1-SNAPSHOT.jar
to http://grid.sonatype.com/ci/job/Maven-release-trunk/./jdk=1.5,label=osx/ws/trunk/maven-release-plugin/target/local-repo/org/apache/maven/scm/maven-scm-provider-vss/1.1.1-SNAPSHOT/maven-scm-provider-vss-1.1.1-20090116.144117-27.jar

[INFO] Installing /opt/repos/release/org/apache/maven/scm/maven-scm-provider-vss/1.1.1-SNAPSHOT/maven-scm-provider-vss-1.1.1-20090116.144117-27.pom
to http://grid.sonatype.com/ci/job/Maven-release-trunk/./jdk=1.5,label=osx/ws/trunk/maven-release-plugin/target/local-repo/org/apache/maven/scm/maven-scm-provider-vss/1.1.1-SNAPSHOT/maven-scm-provider-vss-1.1.1-20090116.144117-27.pom

[INFO] Installing /opt/repos/release/org/apache/maven/scm/maven-scm-manager-plexus/1.1.1-SNAPSHOT/maven-scm-manager-plexus-1.1.1-SNAPSHOT.jar
to http://grid.sonatype.com/ci/job/Maven-release-trunk/./jdk=1.5,label=osx/ws/trunk/maven-release-plugin/target/local-repo/org/apache/maven/scm/maven-scm-manager-plexus/1.1.1-SNAPSHOT/maven-scm-manager-plexus-1.1.1-20090116.144117-28.jar

[INFO] Installing /opt/repos/release/org/apache/maven/scm/maven-scm-manager-plexus/1.1.1-SNAPSHOT/maven-scm-manager-plexus-1.1.1-20090116.144117-28.pom
to http://grid.sonatype.com/ci/job/Maven-release-trunk/./jdk=1.5,label=osx/ws/trunk/maven-release-plugin/target/local-repo/org/apache/maven/scm/maven-scm-manager-plexus/1.1.1-SNAPSHOT/maven-scm-manager-plexus-1.1.1-20090116.144117-28.pom

[INFO] Installing /opt/repos/release/jdom/jdom/1.0/jdom-1.0.jar to http://grid.sonatype.com/ci/job/Maven-release-trunk/./jdk=1.5,label=osx/ws/trunk/maven-release-plugin/target/local-repo/jdom/jdom/1.0/jdom-1.0.jar

[INFO] Installing /opt/repos/release/jdom/jdom/1.0/jdom-1.0.pom to http://grid.sonatype.com/ci/job/Maven-release-trunk/./jdk=1.5,label=osx/ws/trunk/maven-release-plugin/target/local-repo/jdom/jdom/1.0/jdom-1.0.pom

[INFO] Installing /opt/repos/release/jaxen/jaxen/1.1-beta-8/jaxen-1.1-beta-8.jar to http://grid.sonatype.com/ci/job/Maven-release-trunk/./jdk=1.5,label=osx/ws/trunk/maven-release-plugin/target/local-repo/jaxen/jaxen/1.1-beta-8/jaxen-1.1-beta-8.jar

[INFO] Installing /opt/repos/release/jaxen/jaxen/1.1-beta-8/jaxen-1.1-beta-8.pom to http://grid.sonatype.com/ci/job/Maven-release-trunk/./jdk=1.5,label=osx/ws/trunk/maven-release-plugin/target/local-repo/jaxen/jaxen/1.1-beta-8/jaxen-1.1-beta-8.pom

[INFO] [invoker:run {execution: integration-test}]
[INFO] Building: maven-scm-provider-dummy/pom.xml
[INFO] ...SUCCESS.
[INFO] Building: maven-scm-provider-stub/pom.xml
[INFO] ...SUCCESS.
[INFO] Building: forked-basic/pom.xml
[INFO] ...FAILED. The build exited with code 1. See http://grid.sonatype.com/ci/job/Maven-release-trunk/./jdk=1.5,label=osx/ws/trunk/maven-release-plugin/target/it/forked-basic/build.log
 for details.
[INFO] Building: invoker-basic/pom.xml
[INFO] ...FAILED. The build exited with code 1. See http://grid.sonatype.com/ci/job/Maven-release-trunk/./jdk=1.5,label=osx/ws/trunk/maven-release-plugin/target/it/invoker-basic/build.log
 for details.
[INFO] ---------------------------------------
[INFO] Execution Summary:
[INFO]   Builds Passing: 2
[INFO]   Builds Failing: 2
[INFO] ---------------------------------------
[ERROR] The following builds failed:
[ERROR] *  forked-basic/pom.xml
[ERROR] *  invoker-basic/pom.xml
[INFO] ---------------------------------------
[INFO] ------------------------------------------------------------------------
[ERROR] BUILD FAILURE
[INFO] ------------------------------------------------------------------------
[INFO] : org.apache.maven.plugin.invoker.InvokerMojo@e8ab07
2 builds failed.

2 builds failed.
[INFO] ------------------------------------------------------------------------
[INFO] Trace
org.apache.maven.BuildFailureException: 2 builds failed.
	at org.apache.maven.lifecycle.DefaultLifecycleExecutor.executeGoals(DefaultLifecycleExecutor.java:697)
	at org.apache.maven.lifecycle.DefaultLifecycleExecutor.executeGoalWithLifecycle(DefaultLifecycleExecutor.java:538)
	at org.apache.maven.lifecycle.DefaultLifecycleExecutor.executeGoal(DefaultLifecycleExecutor.java:517)
	at org.apache.maven.lifecycle.DefaultLifecycleExecutor.executeGoalAndHandleFailures(DefaultLifecycleExecutor.java:369)
	at org.apache.maven.lifecycle.DefaultLifecycleExecutor.executeTaskSegments(DefaultLifecycleExecutor.java:330)
	at org.apache.maven.lifecycle.DefaultLifecycleExecutor.execute(DefaultLifecycleExecutor.java:181)
	at org.apache.maven.DefaultMaven.doExecute(DefaultMaven.java:336)
	at org.apache.maven.DefaultMaven.execute(DefaultMaven.java:129)
	at org.apache.maven.cli.MavenCli.main(MavenCli.java:302)
	at sun.reflect.NativeMethodAccessorImpl.invoke0(Native Method)
	at sun.reflect.NativeMethodAccessorImpl.invoke(NativeMethodAccessorImpl.java:39)
	at sun.reflect.DelegatingMethodAccessorImpl.invoke(DelegatingMethodAccessorImpl.java:25)
	at java.lang.reflect.Method.invoke(Method.java:585)
	at org.codehaus.classworlds.Launcher.launchEnhanced(Launcher.java:315)
	at org.codehaus.classworlds.Launcher.launch(Launcher.java:255)
	at org.codehaus.classworlds.Launcher.mainWithExitCode(Launcher.java:430)
	at org.codehaus.classworlds.Launcher.main(Launcher.java:375)
Caused by: org.apache.maven.plugin.MojoFailureException: 2 builds failed.
	at org.apache.maven.plugin.invoker.InvokerMojo.execute(InvokerMojo.java:603)
	at org.apache.maven.plugin.DefaultPluginManager.executeMojo(DefaultPluginManager.java:458)
	at org.apache.maven.lifecycle.DefaultLifecycleExecutor.executeGoals(DefaultLifecycleExecutor.java:676)
	... 16 more
[INFO] ------------------------------------------------------------------------
[INFO] Total time: 1 minute 54 seconds
[INFO] Finished at: Sat Jan 17 17:01:19 CST 2009
[INFO] Final Memory: 41M/75M
[INFO] ------------------------------------------------------------------------


Mime
View raw message