maven-notifications mailing list archives

Site index · List index
Message view « Date » · « Thread »
Top « Date » · « Thread »
From Apache Hudson Server <hud...@hudson.zones.apache.org>
Subject Build failed in Hudson: Maven-2.1.x-with-bootstrap #242
Date Mon, 22 Dec 2008 22:19:56 GMT
See http://hudson.zones.apache.org/hudson/job/Maven-2.1.x-with-bootstrap/242/changes

Changes:

[hboutemy] [MNG-3224] toolchains XSD has wrong namespace
o specify unique namespace

------------------------------------------
[...truncated 805 lines...]
     [java] artifactId = 'maven-state-management'
     [java] goal = 'start-fork'
     [java] executionId = 'default'
     [java]  groupId = 'test'
     [java] artifactId = 'test-plugin'
     [java] goal = 'validate'
     [java] executionId = 'default'
     [java]  groupId = 'test'
     [java] artifactId = 'test-plugin'
     [java] goal = 'generate-sources'
     [java] executionId = 'default'
     [java]  groupId = 'org.apache.maven.plugins.internal'
     [java] artifactId = 'maven-state-management'
     [java] goal = 'end-fork'
     [java] executionId = 'default'
     [java]  groupId = 'org.apache.maven.plugins'
     [java] artifactId = 'maven-eclipse-plugin'
     [java] goal = 'eclipse'
     [java] executionId = 'default'
     [java]  groupId = 'org.apache.maven.plugins.internal'
     [java] artifactId = 'maven-state-management'
     [java] goal = 'clear-fork-context'
     [java] executionId = 'default']
     [java] 
     [java] Actual execution plan:
     [java] [groupId = 'org.apache.maven.plugins.internal'
     [java] artifactId = 'maven-state-management'
     [java] goal = 'start-fork'
     [java] executionId = 'default'
     [java]  groupId = 'test'
     [java] artifactId = 'test-plugin'
     [java] goal = 'validate'
     [java] executionId = 'default'
     [java]  groupId = 'test'
     [java] artifactId = 'test-plugin'
     [java] goal = 'generate-sources'
     [java] executionId = 'default'
     [java]  groupId = 'org.apache.maven.plugins.internal'
     [java] artifactId = 'maven-state-management'
     [java] goal = 'end-fork'
     [java] executionId = 'default'
     [java]  groupId = 'org.apache.maven.plugins'
     [java] artifactId = 'maven-eclipse-plugin'
     [java] goal = 'eclipse'
     [java] executionId = 'default'
     [java]  groupId = 'org.apache.maven.plugins.internal'
     [java] artifactId = 'maven-state-management'
     [java] goal = 'clear-fork-context'
     [java] executionId = 'default']
     [java] 
     [java] 
     [java] Expected execution plan:
     [java] [groupId = 'test'
     [java] artifactId = 'test-plugin'
     [java] goal = 'validate'
     [java] executionId = 'default'
     [java]  groupId = 'test'
     [java] artifactId = 'test-plugin'
     [java] goal = 'generate-sources'
     [java] executionId = 'default'
     [java]  groupId = 'org.apache.maven.plugins.internal'
     [java] artifactId = 'maven-state-management'
     [java] goal = 'start-fork'
     [java] executionId = 'default'
     [java]  groupId = 'test'
     [java] artifactId = 'test-plugin'
     [java] goal = 'validate'
     [java] executionId = 'default'
     [java]  groupId = 'test'
     [java] artifactId = 'test-plugin'
     [java] goal = 'generate-sources'
     [java] executionId = 'default'
     [java]  groupId = 'org.apache.maven.plugins.internal'
     [java] artifactId = 'maven-state-management'
     [java] goal = 'end-fork'
     [java] executionId = 'default'
     [java]  groupId = 'org.apache.maven.plugins'
     [java] artifactId = 'maven-assembly-plugin'
     [java] goal = 'assembly'
     [java] executionId = 'default'
     [java]  groupId = 'org.apache.maven.plugins.internal'
     [java] artifactId = 'maven-state-management'
     [java] goal = 'clear-fork-context'
     [java] executionId = 'default']
     [java] 
     [java] Actual execution plan:
     [java] [groupId = 'test'
     [java] artifactId = 'test-plugin'
     [java] goal = 'validate'
     [java] executionId = 'default'
     [java]  groupId = 'test'
     [java] artifactId = 'test-plugin'
     [java] goal = 'generate-sources'
     [java] executionId = 'default'
     [java]  groupId = 'org.apache.maven.plugins.internal'
     [java] artifactId = 'maven-state-management'
     [java] goal = 'start-fork'
     [java] executionId = 'default'
     [java]  groupId = 'test'
     [java] artifactId = 'test-plugin'
     [java] goal = 'validate'
     [java] executionId = 'default'
     [java]  groupId = 'test'
     [java] artifactId = 'test-plugin'
     [java] goal = 'generate-sources'
     [java] executionId = 'default'
     [java]  groupId = 'org.apache.maven.plugins.internal'
     [java] artifactId = 'maven-state-management'
     [java] goal = 'end-fork'
     [java] executionId = 'default'
     [java]  groupId = 'org.apache.maven.plugins'
     [java] artifactId = 'maven-assembly-plugin'
     [java] goal = 'assembly'
     [java] executionId = 'default'
     [java]  groupId = 'org.apache.maven.plugins.internal'
     [java] artifactId = 'maven-state-management'
     [java] goal = 'clear-fork-context'
     [java] executionId = 'default']
     [java] Tests run: 2, Failures: 0, Errors: 0, Skipped: 0, Time elapsed: 0.053 sec
     [java] Running org.apache.maven.execution.DefaultMavenRealmManagerTest
     [java] [DEBUG] Importing: org.apache.maven.core.test.MyArtifactFactory
     [java] with role: org.apache.maven.artifact.factory.ArtifactFactory
     [java] and hint: test
     [java] from extension realm: /extensions/org.group:artifact-ext:1/thread:1
     [java] to project realm: /projects/org.group:artifact-project1:2/thread:1
     [java] [DEBUG] Importing: org.apache.maven.core.test.MyArtifactFactory
     [java] with role: org.apache.maven.artifact.factory.ArtifactFactory
     [java] and hint: test
     [java] from extension realm: /extensions/org.group:artifact-ext:1/thread:1
     [java] to project realm: /projects/org.group:artifact-project1:2/thread:1
     [java] Tests run: 1, Failures: 0, Errors: 0, Skipped: 0, Time elapsed: 0.138 sec
     [java] Running org.apache.maven.execution.ProjectSorterTest
     [java] Tests run: 5, Failures: 0, Errors: 0, Skipped: 0, Time elapsed: 0.03 sec
     [java] Running org.apache.maven.settings.SettingsUtilsTest
     [java] Tests run: 1, Failures: 0, Errors: 0, Skipped: 0, Time elapsed: 0.007 sec
     [java] Running org.apache.maven.lifecycle.plan.DefaultBuildPlannerTest
     [java] [DEBUG] Importing: org.apache.maven.artifact.handler.DefaultArtifactHandler
     [java] with role: org.apache.maven.artifact.handler.ArtifactHandler
     [java] and hint: test
     [java] from extension realm: /extensions/group:artifact:1/thread:1
     [java] to project realm: /projects/group:project:1/thread:1
     [java] [DEBUG] Importing: org.apache.maven.lifecycle.mapping.DefaultLifecycleMapping
     [java] with role: org.apache.maven.lifecycle.mapping.LifecycleMapping
     [java] and hint: test
     [java] from extension realm: /extensions/group:artifact:1/thread:1
     [java] to project realm: /projects/group:project:1/thread:1
     [java] Tests run: 2, Failures: 0, Errors: 0, Skipped: 0, Time elapsed: 0.565 sec
     [java] Running org.apache.maven.lifecycle.binding.BindingUtilsTest
     [java] Tests run: 2, Failures: 0, Errors: 0, Skipped: 0, Time elapsed: 0.006 sec
     [java] Running org.apache.maven.settings.validation.DefaultSettingsValidatorTest
     [java] Tests run: 1, Failures: 0, Errors: 0, Skipped: 0, Time elapsed: 0.007 sec
     [java] Running org.apache.maven.lifecycle.binding.DefaultLifecycleBindingManagerTest
     [java] [DEBUG] Importing: org.apache.maven.artifact.handler.DefaultArtifactHandler
     [java] with role: org.apache.maven.artifact.handler.ArtifactHandler
     [java] and hint: test
     [java] from extension realm: /extensions/group:artifact:1/thread:1
     [java] to project realm: /projects/group:project:1/thread:1
     [java] [DEBUG] Importing: org.apache.maven.lifecycle.mapping.DefaultLifecycleMapping
     [java] with role: org.apache.maven.lifecycle.mapping.LifecycleMapping
     [java] and hint: test
     [java] from extension realm: /extensions/group:artifact:1/thread:1
     [java] to project realm: /projects/group:project:1/thread:1
     [java] Tests run: 5, Failures: 0, Errors: 0, Skipped: 0, Time elapsed: 0.651 sec
     [java] Running org.apache.maven.plugin.PluginParameterExpressionEvaluatorTest
     [java] Result: Component Descriptor: role: 'null', implementation: 'null', role hint:
'default'
     [java] ---
     [java] Result: [group:artifact:jar:1:compile]
     [java] Result: {group:artifact=group:artifact:jar:1:compile}
     [java] Result: my-plugin
     [java] Tests run: 16, Failures: 0, Errors: 0, Skipped: 0, Time elapsed: 0.811 sec
     [java] Running org.apache.maven.lifecycle.LegacyLifecycleMappingParserTest
     [java] Tests run: 3, Failures: 0, Errors: 0, Skipped: 0, Time elapsed: 0.193 sec
     [java] Running org.apache.maven.errors.DefaultCoreErrorReporterTest
     [java] 
     [java] Maven encountered an error while loading a plugin for use in your build.
     [java] 
     [java] Original task invocation:test
     [java] 
     [java] While building project:
     [java] No project is in use.
     [java] 
     [java] 
     [java] Error message:
     [java] Test message
     [java] Tests run: 1, Failures: 0, Errors: 0, Skipped: 0, Time elapsed: 0.016 sec
     [java] Running org.apache.maven.lifecycle.binding.DefaultMojoBindingFactoryTest
     [java] Tests run: 4, Failures: 0, Errors: 0, Skipped: 0, Time elapsed: 0.154 sec
     [java] 
     [java] Results :
     [java] 
     [java] Tests in error: 
     [java]   testBuildExtensionListener(org.apache.maven.listeners.BuildExtensionListenerTest)
     [java] 
     [java] Tests run: 44, Failures: 0, Errors: 1, Skipped: 0
     [java] 
     [java] [INFO] 
     [java] [INFO] 
     [java] [INFO] ------------------------------------------------------------------------
     [java] [INFO] Reactor Summary:
     [java] [INFO] ------------------------------------------------------------------------
     [java] [INFO] Apache Maven .......................................... SUCCESS [4.328s]
     [java] [INFO] Maven Lifecycle Model ................................. SUCCESS [7.244s]
     [java] [INFO] Maven Reporting API ................................... SUCCESS [1.795s]
     [java] [INFO] Maven Model ........................................... SUCCESS [8.625s]
     [java] [INFO] Maven Compat .......................................... SUCCESS [24.323s]
     [java] [INFO] Maven Plugin API ...................................... SUCCESS [4.421s]
     [java] [INFO] Maven Project Builder ................................. SUCCESS [4.748s]
     [java] [INFO] Maven Project Builder ................................. SUCCESS [18.127s]
     [java] [INFO] Maven Mercury ......................................... SUCCESS [3.154s]
     [java] [INFO] Maven Core ............................................ FAILED [21.841s]
     [java] [INFO] Maven Toolchains ...................................... NOT BUILT
     [java] [INFO] Maven Embedder ........................................ NOT BUILT
     [java] [INFO] Maven Distribution .................................... NOT BUILT
     [java] [INFO] ------------------------------------------------------------------------
     [java] [ERROR] 
     [java] There are test failures.
     [java] 
     [java] Please refer to /zonestorage/hudson/home/hudson/hudson/jobs/Maven-2.1.x-with-bootstrap/workspace/trunk/maven-core/target/surefire-reports
for the individual test results.null
     [java] Error stacktrace:
     [java] org.apache.maven.ProjectBuildFailureException: Build for project: org.apache.maven:maven-core:jar:3.0-SNAPSHOT
failed during execution of mojo: org.apache.maven.plugins:maven-surefire-plugin:2.4.2:test
     [java] 	at org.apache.maven.lifecycle.DefaultLifecycleExecutor.executeTaskSegmentForProject(DefaultLifecycleExecutor.java:287)
     [java] 	at org.apache.maven.lifecycle.DefaultLifecycleExecutor.executeTaskSegments(DefaultLifecycleExecutor.java:201)
     [java] 	at org.apache.maven.lifecycle.DefaultLifecycleExecutor.execute(DefaultLifecycleExecutor.java:164)
     [java] 	at org.apache.maven.DefaultMaven.execute(DefaultMaven.java:207)
     [java] 	at org.apache.maven.embedder.MavenEmbedder.execute(MavenEmbedder.java:851)
     [java] 	at org.apache.maven.cli.MavenCli.doMain(MavenCli.java:169)
     [java] 	at org.apache.maven.cli.MavenCli.main(MavenCli.java:63)
     [java] 	at org.apache.maven.cli.MavenCli.main(MavenCli.java:52)
     [java] Caused by: org.apache.maven.plugin.MojoFailureException: There are test failures.
     [java] 
     [java] Please refer to /zonestorage/hudson/home/hudson/hudson/jobs/Maven-2.1.x-with-bootstrap/workspace/trunk/maven-core/target/surefire-reports
for the individual test results.
     [java] 	at org.apache.maven.plugin.surefire.SurefirePlugin.execute(SurefirePlugin.java:530)
     [java] 	at org.apache.maven.plugin.DefaultPluginManager.executeMojo(DefaultPluginManager.java:631)
     [java] 	at org.apache.maven.lifecycle.DefaultLifecycleExecutor.executeGoalAndHandleFailures(DefaultLifecycleExecutor.java:492)
     [java] 	at org.apache.maven.lifecycle.DefaultLifecycleExecutor.executeTaskSegmentForProject(DefaultLifecycleExecutor.java:259)
     [java] 	... 7 more
     [java] 
     [java] [INFO] ------------------------------------------------------------------------
     [java] [INFO] BUILD FAILED
     [java] [INFO] ------------------------------------------------------------------------
     [java] [INFO] Total time: 1 minute 54 seconds
     [java] [INFO] Finished at: Mon Dec 22 22:19:55 UTC 2008
     [java] [INFO] Final Memory: 36M/196M
     [java] [INFO] ------------------------------------------------------------------------

BUILD FAILED
/zonestorage/hudson/home/hudson/hudson/jobs/Maven-2.1.x-with-bootstrap/workspace/trunk/build.xml:194:
Java returned: 1

Total time: 2 minutes 43 seconds


Mime
View raw message