maven-notifications mailing list archives

Site index · List index
Message view « Date » · « Thread »
Top « Date » · « Thread »
From Hudson <Hud...@sonatype.org>
Subject Build failed in Hudson: plugins-IT-with-maven-2.0.x » Maven JAR Plugin #580
Date Fri, 19 Dec 2008 06:37:58 GMT
See http://ci.sonatype.org/job/plugins-IT-with-maven-2.0.x/org.apache.maven.plugins$maven-jar-plugin/580/changes

------------------------------------------
[INFO] ------------------------------------------------------------------------
[INFO] Building Maven JAR Plugin
[INFO]    task-segment: [clean, deploy]
[INFO] ------------------------------------------------------------------------
[INFO] [clean:clean]
[INFO] Deleting directory http://ci.sonatype.org/job/plugins-IT-with-maven-2.0.x/org.apache.maven.plugins$maven-jar-plugin/ws/target

[INFO] snapshot org.apache.maven:maven-archiver:2.4-SNAPSHOT: checking for updates from central
[INFO] snapshot org.apache.maven:maven-archiver:2.4-SNAPSHOT: checking for updates from apache.snapshots
Downloading: http://localhost:8081/content/groups/public/org/apache/maven/maven-archiver/2.4-SNAPSHOT/maven-archiver-2.4-20081214.225330-858.pom
3K downloaded
Downloading: http://localhost:8081/content/groups/public/org/codehaus/plexus/plexus-interpolation/1.5/plexus-interpolation-1.5.pom
2K downloaded
Downloading: http://localhost:8081/content/groups/public/org/apache/maven/maven-project/2.0.7/maven-project-2.0.7.jar
113K downloaded
Downloading: http://localhost:8081/content/groups/public/org/apache/maven/maven-settings/2.0.7/maven-settings-2.0.7.jar
47K downloaded
Downloading: http://localhost:8081/content/groups/public/org/apache/maven/maven-model/2.0.7/maven-model-2.0.7.jar
84K downloaded
Downloading: http://localhost:8081/content/groups/public/org/apache/maven/maven-profile/2.0.7/maven-profile-2.0.7.jar
34K downloaded
Downloading: http://localhost:8081/content/groups/public/org/apache/maven/maven-artifact-manager/2.0.7/maven-artifact-manager-2.0.7.jar
55K downloaded
Downloading: http://localhost:8081/content/groups/public/org/apache/maven/maven-repository-metadata/2.0.7/maven-repository-metadata-2.0.7.jar
23K downloaded
Downloading: http://localhost:8081/content/groups/public/org/apache/maven/maven-artifact/2.0.7/maven-artifact-2.0.7.jar
85K downloaded
Downloading: http://localhost:8081/content/groups/public/org/apache/maven/maven-plugin-registry/2.0.7/maven-plugin-registry-2.0.7.jar
28K downloaded
Downloading: http://localhost:8081/content/groups/public/org/apache/maven/maven-archiver/2.4-SNAPSHOT/maven-archiver-2.4-20081214.225330-858.jar
19K downloaded
Downloading: http://localhost:8081/content/groups/public/org/codehaus/plexus/plexus-interpolation/1.5/plexus-interpolation-1.5.jar
40K downloaded
[INFO] [enforcer:enforce {execution: ensure-no-container-api}]
[INFO] [plugin:helpmojo {execution: generated-helpmojo}]
[INFO] Using 2 extractors.
[INFO] Applying extractor for language: java
[INFO] Extractor for language: java found 4 mojo descriptors.
[INFO] Applying extractor for language: bsh
[INFO] Extractor for language: bsh found 0 mojo descriptors.
[INFO] [plugin:descriptor]
[INFO] Using 2 extractors.
[INFO] Applying extractor for language: java
[INFO] Extractor for language: java found 5 mojo descriptors.
[INFO] Applying extractor for language: bsh
[INFO] Extractor for language: bsh found 0 mojo descriptors.
[INFO] [remote-resources:process {execution: default}]
[INFO] [resources:resources]
[INFO] Using encoding: 'UTF-8' to copy filtered resources.
[INFO] [compiler:compile]
[INFO] Compiling 6 source files to http://ci.sonatype.org/job/plugins-IT-with-maven-2.0.x/org.apache.maven.plugins$maven-jar-plugin/ws/target/classes

[INFO] [resources:testResources]
[INFO] Using encoding: 'UTF-8' to copy filtered resources.
[INFO] [compiler:testCompile]
[INFO] Compiling 4 source files to http://ci.sonatype.org/job/plugins-IT-with-maven-2.0.x/org.apache.maven.plugins$maven-jar-plugin/ws/target/test-classes

[INFO] [surefire:test]
[INFO] Surefire report directory: http://ci.sonatype.org/job/plugins-IT-with-maven-2.0.x/org.apache.maven.plugins$maven-jar-plugin/ws/target/surefire-reports


-------------------------------------------------------
 T E S T S
-------------------------------------------------------
Running org.apache.maven.plugin.jar.JarSignVerifyMojoTest
[debug] jarsigner executable=[/opt/java/sdk/Sun/jdk1.5.0_12/jre/../bin/jarsigner]
[debug] Executing: /bin/sh -c "cd /tmp && /opt/java/sdk/Sun/jdk1.5.0_12/jre/../bin/jarsigner
-verify /tmp/signed/file-version.jar"
[info] jar verified.
[debug] jarsigner executable=[/opt/java/sdk/Sun/jdk1.5.0_12/jre/../bin/jarsigner]
[debug] Executing: /bin/sh -c "cd /tmp && /opt/java/sdk/Sun/jdk1.5.0_12/jre/../bin/jarsigner
-verify -verbose -certs /tmp/signed/file-version.jar"
[info] jar verified.
[debug] jarsigner executable=[/opt/java/sdk/Sun/jdk1.5.0_12/jre/../bin/jarsigner]
[debug] Executing: /bin/sh -c "cd /tmp && /opt/java/sdk/Sun/jdk1.5.0_12/jre/../bin/jarsigner
-verify /tmp/signed/file-version.jar"
[debug] jarsigner executable=[/opt/java/sdk/Sun/jdk1.5.0_12/jre/../bin/jarsigner]
[debug] Executing: /bin/sh -c "cd /tmp && /opt/java/sdk/Sun/jdk1.5.0_12/jre/../bin/jarsigner
-verify /tmp/signed/file-version.jar"
[info] jar is unsigned.
[debug] jarsigner executable=[/opt/java/sdk/Sun/jdk1.5.0_12/jre/../bin/jarsigner]
[debug] Executing: /bin/sh -c "cd /tmp && /opt/java/sdk/Sun/jdk1.5.0_12/jre/../bin/jarsigner
-verify /tmp/signed/file-version.jar"
Tests run: 6, Failures: 0, Errors: 0, Skipped: 0, Time elapsed: 0.069 sec
Running org.apache.maven.plugin.jar.JarSignMojoTest
[debug] jarsigner executable=[/opt/java/sdk/Sun/jdk1.5.0_12/jre/../bin/jarsigner]
[debug] mdkirs: false /tmp
[debug] jarsigner executable=[/opt/java/sdk/Sun/jdk1.5.0_12/jre/../bin/jarsigner]
[debug] mdkirs: false /tmp
[debug] jarsigner executable=[/opt/java/sdk/Sun/jdk1.5.0_12/jre/../bin/jarsigner]
[debug] mdkirs: false /tmp
[debug] jarsigner executable=[/opt/java/sdk/Sun/jdk1.5.0_12/jre/../bin/jarsigner]
[debug] Executing: /bin/sh -c "cd /tmp && /opt/java/sdk/Sun/jdk1.5.0_12/jre/../bin/jarsigner
-verify /tmp/signed.jar"
[info] jar verified.
[debug] jarsigner executable=[/opt/java/sdk/Sun/jdk1.5.0_12/jre/../bin/jarsigner]
[debug] Signing JAR in-place (overwritting original JAR).
[debug] jarsigner executable=[/opt/java/sdk/Sun/jdk1.5.0_12/jre/../bin/jarsigner]
[debug] Executing: /bin/sh -c "cd /tmp && /opt/java/sdk/Sun/jdk1.5.0_12/jre/../bin/jarsigner
-verify /tmp/null.jar"
[info] jar verified.
[debug] jarsigner executable=[/opt/java/sdk/Sun/jdk1.5.0_12/jre/../bin/jarsigner]
[debug] mdkirs: false /tmp
[info] JAR /tmp/signed.jar is already signed. Skipping.
[debug] jarsigner executable=[/opt/java/sdk/Sun/jdk1.5.0_12/jre/../bin/jarsigner]
[debug] mdkirs: false /tmp
Tests run: 6, Failures: 0, Errors: 0, Skipped: 0, Time elapsed: 0.04 sec
Running org.apache.maven.plugin.jar.JarMojoTest
Tests run: 1, Failures: 0, Errors: 0, Skipped: 0, Time elapsed: 0.473 sec

Results :

Tests run: 13, Failures: 0, Errors: 0, Skipped: 0

[HUDSON] Recording test results
[INFO] [jar:jar]
[INFO] Building jar: http://ci.sonatype.org/job/plugins-IT-with-maven-2.0.x/org.apache.maven.plugins$maven-jar-plugin/ws/target/maven-jar-plugin-2.3-SNAPSHOT.jar

[INFO] [plugin:addPluginArtifactMetadata]
[INFO] [invoker:install {execution: integration-test}]
[INFO] Installing http://ci.sonatype.org/job/plugins-IT-with-maven-2.0.x/org.apache.maven.plugins$maven-jar-plugin/ws/pom.xml
 to http://ci.sonatype.org/job/plugins-IT-with-maven-2.0.x/org.apache.maven.plugins$maven-jar-plugin/ws/target/local-repo/org/apache/maven/plugins/maven-jar-plugin/2.3-SNAPSHOT/maven-jar-plugin-2.3-SNAPSHOT.pom

[INFO] Installing http://ci.sonatype.org/job/plugins-IT-with-maven-2.0.x/org.apache.maven.plugins$maven-jar-plugin/ws/target/maven-jar-plugin-2.3-SNAPSHOT.jar
 to http://ci.sonatype.org/job/plugins-IT-with-maven-2.0.x/org.apache.maven.plugins$maven-jar-plugin/ws/target/local-repo/org/apache/maven/plugins/maven-jar-plugin/2.3-SNAPSHOT/maven-jar-plugin-2.3-SNAPSHOT.jar

[INFO] [invoker:run {execution: integration-test}]
[INFO] Building: MJAR-80-fullcontent/pom.xml
[INFO] ...SUCCESS.
[INFO] Building: MJAR-70-recreation/pom.xml
[INFO] ...FAILED[verify script returned false].
[INFO] Building: MJAR-30-excludes/pom.xml
[INFO] ...SUCCESS.
[INFO] Building: mjar-90/pom.xml
[INFO] ...SUCCESS.
[INFO] Building: MJAR-75/pom.xml
[INFO] ...FAILED[code=1]. See http://ci.sonatype.org/job/plugins-IT-with-maven-2.0.x/org.apache.maven.plugins$maven-jar-plugin/ws/target/it/MJAR-75/build.log
 for details.
[INFO] Building: MJAR-60/pom.xml
[INFO] ...SUCCESS.
[INFO] Building: MJAR-30-fullcontent/pom.xml
[INFO] ...SUCCESS.
[INFO] Building: MJAR-30-include/pom.xml
[INFO] ...SUCCESS.
[INFO] Building: manifest-content/pom.xml
[INFO] ...SUCCESS.
[INFO] Building: project-004/pom.xml
[INFO] ...SUCCESS.
[INFO] Building: MJAR-80-include/pom.xml
[INFO] ...SUCCESS.
[INFO] Building: mjar-71-02/pom.xml
[INFO] ...SUCCESS.
[INFO] Building: MJAR-70-no-recreation/pom.xml
[INFO] ...FAILED[verify script returned false].
[INFO] Building: MJAR-82/pom.xml
[INFO] ...SUCCESS.
[INFO] Building: mjar-71-01/pom.xml
[INFO] ...SUCCESS.
[INFO] Building: MJAR-80-exclude/pom.xml
[INFO] ...SUCCESS.
[INFO] 

---------------------------------------
Execution Summary:
Builds Passing: 13
Builds Failing: 3
---------------------------------------

The following builds failed:

*  MJAR-70-recreation/pom.xml
*  MJAR-75/pom.xml
*  MJAR-70-no-recreation/pom.xml

[HUDSON] Archiving http://ci.sonatype.org/job/plugins-IT-with-maven-2.0.x/org.apache.maven.plugins$maven-jar-plugin/ws/pom.xml
 to /home/j2ee-hudson/.hudson/jobs/plugins-IT-with-maven-2.0.x/modules/org.apache.maven.plugins$maven-jar-plugin/builds/2008-12-19_00-04-27/archive/org.apache.maven.plugins/maven-jar-plugin/2.3-SNAPSHOT/pom.xml
[HUDSON] Archiving http://ci.sonatype.org/job/plugins-IT-with-maven-2.0.x/org.apache.maven.plugins$maven-jar-plugin/ws/target/maven-jar-plugin-2.3-SNAPSHOT.jar
 to /home/j2ee-hudson/.hudson/jobs/plugins-IT-with-maven-2.0.x/modules/org.apache.maven.plugins$maven-jar-plugin/builds/2008-12-19_00-04-27/archive/org.apache.maven.plugins/maven-jar-plugin/2.3-SNAPSHOT/maven-jar-plugin-2.3-SNAPSHOT.jar


Mime
View raw message