maven-notifications mailing list archives: November 2008

Site index · List index
Message listThread · Author · Date
Hudson Hudson build became unstable: plugins-CI-with-maven-2.0.x » Maven Assembly Plugin #619 Sat, 01 Nov, 17:17
[continuum] BUILD ERROR: Maven Integration Testing - Maven Integration Test Plugin :: Loadable - default maven2 buildDefinition
Contin...@vmbuild.apache.org   [continuum] BUILD ERROR: Maven Integration Testing - Maven Integration Test Plugin :: Loadable - default maven2 buildDefinition Sat, 01 Nov, 18:23
Contin...@vmbuild.apache.org   [continuum] BUILD ERROR: Maven Integration Testing - Maven Integration Test Plugin :: Loadable - default maven2 buildDefinition Sat, 01 Nov, 20:33
Contin...@vmbuild.apache.org   [continuum] BUILD ERROR: Maven Integration Testing - Maven Integration Test Plugin :: Loadable - default maven2 buildDefinition Sat, 01 Nov, 23:22
Contin...@vmbuild.apache.org   [continuum] BUILD ERROR: Maven Integration Testing - Maven Integration Test Plugin :: Loadable - default maven2 buildDefinition Sun, 02 Nov, 01:25
Contin...@vmbuild.apache.org   [continuum] BUILD ERROR: Maven Integration Testing - Maven Integration Test Plugin :: Loadable - default maven2 buildDefinition Sun, 02 Nov, 03:25
Contin...@vmbuild.apache.org   [continuum] BUILD ERROR: Maven Integration Testing - Maven Integration Test Plugin :: Loadable - default maven2 buildDefinition Sun, 02 Nov, 04:25
Contin...@vmbuild.apache.org   [continuum] BUILD ERROR: Maven Integration Testing - Maven Integration Test Plugin :: Loadable - default maven2 buildDefinition Sun, 02 Nov, 05:21
Contin...@vmbuild.apache.org   [continuum] BUILD ERROR: Maven Integration Testing - Maven Integration Test Plugin :: Loadable - default maven2 buildDefinition Sun, 02 Nov, 06:15
Contin...@vmbuild.apache.org   [continuum] BUILD ERROR: Maven Integration Testing - Maven Integration Test Plugin :: Loadable - default maven2 buildDefinition Sun, 02 Nov, 07:24
Contin...@vmbuild.apache.org   [continuum] BUILD ERROR: Maven Integration Testing - Maven Integration Test Plugin :: Loadable - default maven2 buildDefinition Sun, 02 Nov, 09:29
Contin...@vmbuild.apache.org   [continuum] BUILD ERROR: Maven Integration Testing - Maven Integration Test Plugin :: Loadable - default maven2 buildDefinition Sun, 02 Nov, 10:24
Contin...@vmbuild.apache.org   [continuum] BUILD ERROR: Maven Integration Testing - Maven Integration Test Plugin :: Loadable - default maven2 buildDefinition Sun, 02 Nov, 11:26
Contin...@vmbuild.apache.org   [continuum] BUILD ERROR: Maven Integration Testing - Maven Integration Test Plugin :: Loadable - default maven2 buildDefinition Sun, 02 Nov, 12:17
Contin...@vmbuild.apache.org   [continuum] BUILD ERROR: Maven Integration Testing - Maven Integration Test Plugin :: Loadable - default maven2 buildDefinition Sun, 02 Nov, 13:22
Contin...@vmbuild.apache.org   [continuum] BUILD ERROR: Maven Integration Testing - Maven Integration Test Plugin :: Loadable - default maven2 buildDefinition Sun, 02 Nov, 15:08
Contin...@vmbuild.apache.org   [continuum] BUILD ERROR: Maven Integration Testing - Maven Integration Test Plugin :: Loadable - default maven2 buildDefinition Sun, 02 Nov, 16:38
Contin...@vmbuild.apache.org   [continuum] BUILD ERROR: Maven Integration Testing - Maven Integration Test Plugin :: Loadable - default maven2 buildDefinition Sun, 02 Nov, 17:31
Contin...@vmbuild.apache.org   [continuum] BUILD ERROR: Maven Integration Testing - Maven Integration Test Plugin :: Loadable - default maven2 buildDefinition Sun, 02 Nov, 18:27
Contin...@vmbuild.apache.org   [continuum] BUILD ERROR: Maven Integration Testing - Maven Integration Test Plugin :: Loadable - default maven2 buildDefinition Sun, 02 Nov, 19:23
Contin...@vmbuild.apache.org   [continuum] BUILD ERROR: Maven Integration Testing - Maven Integration Test Plugin :: Loadable - default maven2 buildDefinition Sun, 02 Nov, 20:16
Contin...@vmbuild.apache.org   [continuum] BUILD ERROR: Maven Integration Testing - Maven Integration Test Plugin :: Loadable - default maven2 buildDefinition Sun, 02 Nov, 21:24
Contin...@vmbuild.apache.org   [continuum] BUILD ERROR: Maven Integration Testing - Maven Integration Test Plugin :: Loadable - default maven2 buildDefinition Sun, 02 Nov, 23:24
Contin...@vmbuild.apache.org   [continuum] BUILD ERROR: Maven Integration Testing - Maven Integration Test Plugin :: Loadable - default maven2 buildDefinition Mon, 03 Nov, 01:28
Contin...@vmbuild.apache.org   [continuum] BUILD ERROR: Maven Integration Testing - Maven Integration Test Plugin :: Loadable - default maven2 buildDefinition Mon, 03 Nov, 02:30
Contin...@vmbuild.apache.org   [continuum] BUILD ERROR: Maven Integration Testing - Maven Integration Test Plugin :: Loadable - default maven2 buildDefinition Mon, 03 Nov, 03:30
Contin...@vmbuild.apache.org   [continuum] BUILD ERROR: Maven Integration Testing - Maven Integration Test Plugin :: Loadable - default maven2 buildDefinition Mon, 03 Nov, 04:21
Contin...@vmbuild.apache.org   [continuum] BUILD ERROR: Maven Integration Testing - Maven Integration Test Plugin :: Loadable - default maven2 buildDefinition Mon, 03 Nov, 05:22
Contin...@vmbuild.apache.org   [continuum] BUILD ERROR: Maven Integration Testing - Maven Integration Test Plugin :: Loadable - default maven2 buildDefinition Mon, 03 Nov, 06:20
Contin...@vmbuild.apache.org   [continuum] BUILD ERROR: Maven Integration Testing - Maven Integration Test Plugin :: Loadable - default maven2 buildDefinition Mon, 03 Nov, 07:21
Contin...@vmbuild.apache.org   [continuum] BUILD ERROR: Maven Integration Testing - Maven Integration Test Plugin :: Loadable - default maven2 buildDefinition Mon, 03 Nov, 08:24
Contin...@vmbuild.apache.org   [continuum] BUILD ERROR: Maven Integration Testing - Maven Integration Test Plugin :: Loadable - default maven2 buildDefinition Mon, 03 Nov, 09:20
Contin...@vmbuild.apache.org   [continuum] BUILD ERROR: Maven Integration Testing - Maven Integration Test Plugin :: Loadable - default maven2 buildDefinition Mon, 03 Nov, 10:17
Contin...@vmbuild.apache.org   [continuum] BUILD ERROR: Maven Integration Testing - Maven Integration Test Plugin :: Loadable - default maven2 buildDefinition Mon, 03 Nov, 11:23
Contin...@vmbuild.apache.org   [continuum] BUILD ERROR: Maven Integration Testing - Maven Integration Test Plugin :: Loadable - default maven2 buildDefinition Mon, 03 Nov, 12:24
Contin...@vmbuild.apache.org   [continuum] BUILD ERROR: Maven Integration Testing - Maven Integration Test Plugin :: Loadable - default maven2 buildDefinition Mon, 03 Nov, 13:19
Contin...@vmbuild.apache.org   [continuum] BUILD ERROR: Maven Integration Testing - Maven Integration Test Plugin :: Loadable - default maven2 buildDefinition Mon, 03 Nov, 14:18
Contin...@vmbuild.apache.org   [continuum] BUILD ERROR: Maven Integration Testing - Maven Integration Test Plugin :: Loadable - default maven2 buildDefinition Mon, 03 Nov, 15:38
Contin...@vmbuild.apache.org   [continuum] BUILD ERROR: Maven Integration Testing - Maven Integration Test Plugin :: Loadable - default maven2 buildDefinition Mon, 03 Nov, 17:24
Contin...@vmbuild.apache.org   [continuum] BUILD ERROR: Maven Integration Testing - Maven Integration Test Plugin :: Loadable - default maven2 buildDefinition Mon, 03 Nov, 18:18
Contin...@vmbuild.apache.org   [continuum] BUILD ERROR: Maven Integration Testing - Maven Integration Test Plugin :: Loadable - default maven2 buildDefinition Mon, 03 Nov, 19:22
Contin...@vmbuild.apache.org   [continuum] BUILD ERROR: Maven Integration Testing - Maven Integration Test Plugin :: Loadable - default maven2 buildDefinition Mon, 03 Nov, 20:23
Contin...@vmbuild.apache.org   [continuum] BUILD ERROR: Maven Integration Testing - Maven Integration Test Plugin :: Loadable - default maven2 buildDefinition Mon, 03 Nov, 21:19
Contin...@vmbuild.apache.org   [continuum] BUILD ERROR: Maven Integration Testing - Maven Integration Test Plugin :: Loadable - default maven2 buildDefinition Mon, 03 Nov, 22:21
Contin...@vmbuild.apache.org   [continuum] BUILD ERROR: Maven Integration Testing - Maven Integration Test Plugin :: Loadable - default maven2 buildDefinition Mon, 03 Nov, 23:57
Contin...@vmbuild.apache.org   [continuum] BUILD ERROR: Maven Integration Testing - Maven Integration Test Plugin :: Loadable - default maven2 buildDefinition Tue, 04 Nov, 01:45
Contin...@vmbuild.apache.org   [continuum] BUILD ERROR: Maven Integration Testing - Maven Integration Test Plugin :: Loadable - default maven2 buildDefinition Tue, 04 Nov, 02:56
Contin...@vmbuild.apache.org   [continuum] BUILD ERROR: Maven Integration Testing - Maven Integration Test Plugin :: Loadable - default maven2 buildDefinition Tue, 04 Nov, 03:46
Contin...@vmbuild.apache.org   [continuum] BUILD ERROR: Maven Integration Testing - Maven Integration Test Plugin :: Loadable - default maven2 buildDefinition Tue, 04 Nov, 04:32
Contin...@vmbuild.apache.org   [continuum] BUILD ERROR: Maven Integration Testing - Maven Integration Test Plugin :: Loadable - default maven2 buildDefinition Tue, 04 Nov, 05:30
Contin...@vmbuild.apache.org   [continuum] BUILD ERROR: Maven Integration Testing - Maven Integration Test Plugin :: Loadable - default maven2 buildDefinition Tue, 04 Nov, 06:27
Contin...@vmbuild.apache.org   [continuum] BUILD ERROR: Maven Integration Testing - Maven Integration Test Plugin :: Loadable - default maven2 buildDefinition Tue, 04 Nov, 07:27
Contin...@vmbuild.apache.org   [continuum] BUILD ERROR: Maven Integration Testing - Maven Integration Test Plugin :: Loadable - default maven2 buildDefinition Tue, 04 Nov, 08:20
Contin...@vmbuild.apache.org   [continuum] BUILD ERROR: Maven Integration Testing - Maven Integration Test Plugin :: Loadable - default maven2 buildDefinition Tue, 04 Nov, 09:19
Contin...@vmbuild.apache.org   [continuum] BUILD ERROR: Maven Integration Testing - Maven Integration Test Plugin :: Loadable - default maven2 buildDefinition Tue, 04 Nov, 10:21
Contin...@vmbuild.apache.org   [continuum] BUILD ERROR: Maven Integration Testing - Maven Integration Test Plugin :: Loadable - default maven2 buildDefinition Tue, 04 Nov, 11:24
Build failed in Hudson: plugins-IT-with-maven-2.0.x » Maven JAR Plugin #553
Hudson   Build failed in Hudson: plugins-IT-with-maven-2.0.x » Maven JAR Plugin #553 Sun, 02 Nov, 05:50
Hudson     Build failed in Hudson: plugins-IT-with-maven-2.0.x » Maven JAR Plugin #554 Mon, 03 Nov, 06:51
Hudson       Build failed in Hudson: plugins-IT-with-maven-2.0.x » Maven JAR Plugin #555 Tue, 04 Nov, 06:52
Hudson         Build failed in Hudson: plugins-IT-with-maven-2.0.x » Maven JAR Plugin #556 Wed, 05 Nov, 06:51
Hudson           Build failed in Hudson: plugins-IT-with-maven-2.0.x » Maven JAR Plugin #557 Thu, 06 Nov, 06:50
Hudson             Build failed in Hudson: plugins-IT-with-maven-2.0.x » Maven JAR Plugin #558 Fri, 07 Nov, 06:55
Hudson               Build failed in Hudson: plugins-IT-with-maven-2.0.x » Maven JAR Plugin #559 Sat, 08 Nov, 06:49
Hudson                 Build failed in Hudson: plugins-IT-with-maven-2.0.x » Maven JAR Plugin #560 Mon, 10 Nov, 06:50
Hudson                   Build failed in Hudson: plugins-IT-with-maven-2.0.x » Maven JAR Plugin #561 Fri, 14 Nov, 06:48
Hudson                     Build failed in Hudson: plugins-IT-with-maven-2.0.x » Maven JAR Plugin #562 Sat, 15 Nov, 06:52
Hudson                       Build failed in Hudson: plugins-IT-with-maven-2.0.x » Maven JAR Plugin #563 Sun, 16 Nov, 06:53
Hudson                         Build failed in Hudson: plugins-IT-with-maven-2.0.x » Maven JAR Plugin #564 Mon, 17 Nov, 06:55
Hudson                           Build failed in Hudson: plugins-IT-with-maven-2.0.x » Maven JAR Plugin #565 Tue, 18 Nov, 06:54
Hudson                             Build failed in Hudson: plugins-IT-with-maven-2.0.x » Maven JAR Plugin #566 Wed, 19 Nov, 06:51
Hudson                               Build failed in Hudson: plugins-IT-with-maven-2.0.x » Maven JAR Plugin #567 Thu, 20 Nov, 06:50
Hudson                                 Build failed in Hudson: plugins-IT-with-maven-2.0.x » Maven JAR Plugin #568 Fri, 21 Nov, 06:48
Hudson                                   Build failed in Hudson: plugins-IT-with-maven-2.0.x » Maven JAR Plugin #569 Tue, 25 Nov, 06:48
Hudson                                     Build failed in Hudson: plugins-IT-with-maven-2.0.x » Maven JAR Plugin #570 Wed, 26 Nov, 06:45
Hudson                                       Build failed in Hudson: plugins-IT-with-maven-2.0.x » Maven JAR Plugin #571 Fri, 28 Nov, 06:45
Build failed in Hudson: plugins-IT-with-maven-2.0.x » Maven AntRun Plugin #553
Hudson   Build failed in Hudson: plugins-IT-with-maven-2.0.x » Maven AntRun Plugin #553 Sun, 02 Nov, 05:50
Hudson     Build failed in Hudson: plugins-IT-with-maven-2.0.x » Maven AntRun Plugin #554 Mon, 03 Nov, 06:51
Hudson       Build failed in Hudson: plugins-IT-with-maven-2.0.x » Maven AntRun Plugin #555 Tue, 04 Nov, 06:52
Hudson         Build failed in Hudson: plugins-IT-with-maven-2.0.x » Maven AntRun Plugin #556 Wed, 05 Nov, 06:51
Hudson           Build failed in Hudson: plugins-IT-with-maven-2.0.x » Maven AntRun Plugin #557 Thu, 06 Nov, 06:50
Hudson             Build failed in Hudson: plugins-IT-with-maven-2.0.x » Maven AntRun Plugin #558 Fri, 07 Nov, 06:55
Hudson               Build failed in Hudson: plugins-IT-with-maven-2.0.x » Maven AntRun Plugin #559 Sat, 08 Nov, 06:49
Hudson                 Build failed in Hudson: plugins-IT-with-maven-2.0.x » Maven AntRun Plugin #560 Mon, 10 Nov, 06:50
Hudson                   Build failed in Hudson: plugins-IT-with-maven-2.0.x » Maven AntRun Plugin #561 Fri, 14 Nov, 06:48
Hudson                     Hudson build is back to normal: plugins-IT-with-maven-2.0.x » Maven AntRun Plugin #562 Sat, 15 Nov, 06:52
Build failed in Hudson: plugins-IT-with-maven-2.0.x » Maven Resources Plugin #553
Hudson   Build failed in Hudson: plugins-IT-with-maven-2.0.x » Maven Resources Plugin #553 Sun, 02 Nov, 05:50
Hudson     Build failed in Hudson: plugins-IT-with-maven-2.0.x » Maven Resources Plugin #554 Mon, 03 Nov, 06:51
Hudson       Build failed in Hudson: plugins-IT-with-maven-2.0.x » Maven Resources Plugin #555 Tue, 04 Nov, 06:52
Hudson         Build failed in Hudson: plugins-IT-with-maven-2.0.x » Maven Resources Plugin #556 Wed, 05 Nov, 06:51
Hudson           Build failed in Hudson: plugins-IT-with-maven-2.0.x » Maven Resources Plugin #557 Thu, 06 Nov, 06:50
Hudson             Build failed in Hudson: plugins-IT-with-maven-2.0.x » Maven Resources Plugin #558 Fri, 07 Nov, 06:55
Hudson               Build failed in Hudson: plugins-IT-with-maven-2.0.x » Maven Resources Plugin #559 Sat, 08 Nov, 06:49
Hudson                 Build failed in Hudson: plugins-IT-with-maven-2.0.x » Maven Resources Plugin #560 Mon, 10 Nov, 06:50
Hudson                   Build failed in Hudson: plugins-IT-with-maven-2.0.x » Maven Resources Plugin #561 Fri, 14 Nov, 06:48
Hudson                     Build failed in Hudson: plugins-IT-with-maven-2.0.x » Maven Resources Plugin #562 Sat, 15 Nov, 06:52
Hudson                       Build failed in Hudson: plugins-IT-with-maven-2.0.x » Maven Resources Plugin #563 Sun, 16 Nov, 06:53
Hudson                         Hudson build is back to normal: plugins-IT-with-maven-2.0.x » Maven Resources Plugin #564 Mon, 17 Nov, 06:55
Hudson Build failed in Hudson: plugins-IT-with-maven-2.0.x » Maven Assembly Plugin #553 Sun, 02 Nov, 05:50
Hudson   Build failed in Hudson: plugins-IT-with-maven-2.0.x » Maven Assembly Plugin #554 Mon, 03 Nov, 06:51
Hudson     Build failed in Hudson: plugins-IT-with-maven-2.0.x » Maven Assembly Plugin #555 Tue, 04 Nov, 06:52
Hudson       Build failed in Hudson: plugins-IT-with-maven-2.0.x » Maven Assembly Plugin #556 Wed, 05 Nov, 06:51
Hudson         Build failed in Hudson: plugins-IT-with-maven-2.0.x » Maven Assembly Plugin #557 Thu, 06 Nov, 06:50
Hudson           Build failed in Hudson: plugins-IT-with-maven-2.0.x » Maven Assembly Plugin #558 Fri, 07 Nov, 06:55
Hudson             Build failed in Hudson: plugins-IT-with-maven-2.0.x » Maven Assembly Plugin #559 Sat, 08 Nov, 06:49
Hudson               Build failed in Hudson: plugins-IT-with-maven-2.0.x » Maven Assembly Plugin #560 Mon, 10 Nov, 06:50
Hudson                 Build failed in Hudson: plugins-IT-with-maven-2.0.x » Maven Assembly Plugin #561 Fri, 14 Nov, 06:48
Hudson                   Build failed in Hudson: plugins-IT-with-maven-2.0.x » Maven Assembly Plugin #562 Sat, 15 Nov, 06:52
Hudson                     Build failed in Hudson: plugins-IT-with-maven-2.0.x » Maven Assembly Plugin #563 Sun, 16 Nov, 06:53
Hudson                       Build failed in Hudson: plugins-IT-with-maven-2.0.x » Maven Assembly Plugin #564 Mon, 17 Nov, 06:55
Hudson                         Build failed in Hudson: plugins-IT-with-maven-2.0.x » Maven Assembly Plugin #565 Tue, 18 Nov, 06:54
Hudson                           Build failed in Hudson: plugins-IT-with-maven-2.0.x » Maven Assembly Plugin #566 Wed, 19 Nov, 06:51
Hudson                             Build failed in Hudson: plugins-IT-with-maven-2.0.x » Maven Assembly Plugin #567 Thu, 20 Nov, 06:51
Hudson                               Build failed in Hudson: plugins-IT-with-maven-2.0.x » Maven Assembly Plugin #568 Fri, 21 Nov, 06:48
Hudson                                 Build failed in Hudson: plugins-IT-with-maven-2.0.x » Maven Assembly Plugin #569 Tue, 25 Nov, 06:48
Hudson                                   Build failed in Hudson: plugins-IT-with-maven-2.0.x » Maven Assembly Plugin #570 Wed, 26 Nov, 06:45
Hudson                                     Build failed in Hudson: plugins-IT-with-maven-2.0.x » Maven Assembly Plugin #571 Fri, 28 Nov, 06:45
Build failed in Hudson: plugins-IT-with-maven-2.0.x » Maven WAR Plugin #553
Hudson   Build failed in Hudson: plugins-IT-with-maven-2.0.x » Maven WAR Plugin #553 Sun, 02 Nov, 05:50
Hudson     Build failed in Hudson: plugins-IT-with-maven-2.0.x » Maven WAR Plugin #554 Mon, 03 Nov, 06:51
Hudson       Build failed in Hudson: plugins-IT-with-maven-2.0.x » Maven WAR Plugin #555 Tue, 04 Nov, 06:52
Hudson         Build failed in Hudson: plugins-IT-with-maven-2.0.x » Maven WAR Plugin #556 Wed, 05 Nov, 06:51
Hudson           Build failed in Hudson: plugins-IT-with-maven-2.0.x » Maven WAR Plugin #557 Thu, 06 Nov, 06:50
Hudson             Build failed in Hudson: plugins-IT-with-maven-2.0.x » Maven WAR Plugin #558 Fri, 07 Nov, 06:55
Hudson               Build failed in Hudson: plugins-IT-with-maven-2.0.x » Maven WAR Plugin #559 Sat, 08 Nov, 06:49
Hudson                 Build failed in Hudson: plugins-IT-with-maven-2.0.x » Maven WAR Plugin #560 Mon, 10 Nov, 06:50
Hudson                   Build failed in Hudson: plugins-IT-with-maven-2.0.x » Maven WAR Plugin #561 Fri, 14 Nov, 06:48
Hudson                     Build failed in Hudson: plugins-IT-with-maven-2.0.x » Maven WAR Plugin #562 Sat, 15 Nov, 06:52
Hudson                       Build failed in Hudson: plugins-IT-with-maven-2.0.x » Maven WAR Plugin #563 Sun, 16 Nov, 06:53
Hudson                         Build failed in Hudson: plugins-IT-with-maven-2.0.x » Maven WAR Plugin #564 Mon, 17 Nov, 06:55
Hudson                           Build failed in Hudson: plugins-IT-with-maven-2.0.x » Maven WAR Plugin #565 Tue, 18 Nov, 06:54
Hudson                             Build failed in Hudson: plugins-IT-with-maven-2.0.x » Maven WAR Plugin #566 Wed, 19 Nov, 06:51
Hudson                               Build failed in Hudson: plugins-IT-with-maven-2.0.x » Maven WAR Plugin #567 Thu, 20 Nov, 06:51
Hudson                                 Build failed in Hudson: plugins-IT-with-maven-2.0.x » Maven WAR Plugin #568 Fri, 21 Nov, 06:48
Hudson                                   Build failed in Hudson: plugins-IT-with-maven-2.0.x » Maven WAR Plugin #569 Tue, 25 Nov, 06:48
Hudson                                     Build failed in Hudson: plugins-IT-with-maven-2.0.x » Maven WAR Plugin #570 Wed, 26 Nov, 06:45
Hudson                                       Build failed in Hudson: plugins-IT-with-maven-2.0.x » Maven WAR Plugin #571 Fri, 28 Nov, 06:45
Hudson Build failed in Hudson: maven-core-integration-testing » 1.5,jeos1 #37 Sun, 02 Nov, 22:03
Hudson   Build failed in Hudson: maven-core-integration-testing » 1.5,jeos1 #38 Mon, 03 Nov, 02:02
Hudson     Hudson build is back to normal: maven-core-integration-testing » 1.5,jeos1 #39 Tue, 04 Nov, 14:03
Build failed in Hudson: Maven-2.1.x-with-bootstrap #105
Apache Hudson Server   Build failed in Hudson: Maven-2.1.x-with-bootstrap #105 Mon, 03 Nov, 06:02
Apache Hudson Server     Build failed in Hudson: Maven-2.1.x-with-bootstrap #106 Wed, 05 Nov, 22:20
Apache Hudson Server       Build failed in Hudson: Maven-2.1.x-with-bootstrap #107 Thu, 06 Nov, 00:22
Apache Hudson Server         Build failed in Hudson: Maven-2.1.x-with-bootstrap #108 Thu, 06 Nov, 16:21
Apache Hudson Server           Build failed in Hudson: Maven-2.1.x-with-bootstrap #109 Mon, 10 Nov, 07:21
Apache Hudson Server             Build failed in Hudson: Maven-2.1.x-with-bootstrap #110 Mon, 10 Nov, 08:22
Apache Hudson Server               Build failed in Hudson: Maven-2.1.x-with-bootstrap #111 Mon, 10 Nov, 16:20
Apache Hudson Server                 Build failed in Hudson: Maven-2.1.x-with-bootstrap #112 Tue, 11 Nov, 15:21
Apache Hudson Server                   Build failed in Hudson: Maven-2.1.x-with-bootstrap #113 Tue, 11 Nov, 21:27
Apache Hudson Server                     Build failed in Hudson: Maven-2.1.x-with-bootstrap #114 Tue, 11 Nov, 23:01
Apache Hudson Server                       Build failed in Hudson: Maven-2.1.x-with-bootstrap #115 Wed, 12 Nov, 19:52
Apache Hudson Server                         Build failed in Hudson: Maven-2.1.x-with-bootstrap #116 Wed, 12 Nov, 23:03
Apache Hudson Server                           Build failed in Hudson: Maven-2.1.x-with-bootstrap #117 Fri, 14 Nov, 17:21
Apache Hudson Server                             Build failed in Hudson: Maven-2.1.x-with-bootstrap #118 Fri, 14 Nov, 20:32
Apache Hudson Server                               Build failed in Hudson: Maven-2.1.x-with-bootstrap #119 Sat, 15 Nov, 23:29
Apache Hudson Server                                 Build failed in Hudson: Maven-2.1.x-with-bootstrap #120 Sun, 16 Nov, 20:32
Apache Hudson Server                                   Build failed in Hudson: Maven-2.1.x-with-bootstrap #121 Mon, 17 Nov, 04:17
Apache Hudson Server                                     Build failed in Hudson: Maven-2.1.x-with-bootstrap #122 Mon, 17 Nov, 07:23
Apache Hudson Server                                       Build failed in Hudson: Maven-2.1.x-with-bootstrap #123 Mon, 17 Nov, 18:17
Apache Hudson Server                                         Build failed in Hudson: Maven-2.1.x-with-bootstrap #124 Mon, 17 Nov, 21:23
Apache Hudson Server                                           Build failed in Hudson: Maven-2.1.x-with-bootstrap #125 Tue, 18 Nov, 01:20
Apache Hudson Server                                             Build failed in Hudson: Maven-2.1.x-with-bootstrap #126 Tue, 18 Nov, 03:17
Apache Hudson Server                                               Build failed in Hudson: Maven-2.1.x-with-bootstrap #127 Tue, 18 Nov, 04:17
Apache Hudson Server                                                 Build failed in Hudson: Maven-2.1.x-with-bootstrap #128 Tue, 18 Nov, 18:18
Apache Hudson Server                                                   Build failed in Hudson: Maven-2.1.x-with-bootstrap #129 Wed, 19 Nov, 04:24
Apache Hudson Server                                                     Build failed in Hudson: Maven-2.1.x-with-bootstrap #130 Thu, 20 Nov, 01:42
Apache Hudson Server                                                       Build failed in Hudson: Maven-2.1.x-with-bootstrap #131 Thu, 20 Nov, 16:17
Apache Hudson Server                                                         Build failed in Hudson: Maven-2.1.x-with-bootstrap #132 Thu, 20 Nov, 18:53
Apache Hudson Server                                                           Build failed in Hudson: Maven-2.1.x-with-bootstrap #133 Fri, 21 Nov, 00:20
Apache Hudson Server                                                             Build failed in Hudson: Maven-2.1.x-with-bootstrap #134 Fri, 21 Nov, 05:32
Apache Hudson Server                                                               Build failed in Hudson: Maven-2.1.x-with-bootstrap #135 Fri, 21 Nov, 07:29
Apache Hudson Server                                                                 Build failed in Hudson: Maven-2.1.x-with-bootstrap #136 Fri, 21 Nov, 21:17
Apache Hudson Server                                                                   Build failed in Hudson: Maven-2.1.x-with-bootstrap #137 Fri, 21 Nov, 22:17
Apache Hudson Server                                                                     Build failed in Hudson: Maven-2.1.x-with-bootstrap #138 Sat, 22 Nov, 01:17
Apache Hudson Server                                                                       Build failed in Hudson: Maven-2.1.x-with-bootstrap #139 Sat, 22 Nov, 16:29
Apache Hudson Server                                                                         Build failed in Hudson: Maven-2.1.x-with-bootstrap #140 Sat, 22 Nov, 22:17
Apache Hudson Server                                                                           Build failed in Hudson: Maven-2.1.x-with-bootstrap #141 Sat, 22 Nov, 23:17
Apache Hudson Server                                                                             Build failed in Hudson: Maven-2.1.x-with-bootstrap #142 Sun, 23 Nov, 19:25
Apache Hudson Server                                                                               Build failed in Hudson: Maven-2.1.x-with-bootstrap #143 Sun, 23 Nov, 23:14
Apache Hudson Server                                                                                 Build failed in Hudson: Maven-2.1.x-with-bootstrap #144 Tue, 25 Nov, 14:39
Apache Hudson Server                                                                                   Build failed in Hudson: Maven-2.1.x-with-bootstrap #145 Tue, 25 Nov, 16:18
Apache Hudson Server                                                                                     Build failed in Hudson: Maven-2.1.x-with-bootstrap #146 Tue, 25 Nov, 17:18
Apache Hudson Server                                                                                       Build failed in Hudson: Maven-2.1.x-with-bootstrap #147 Thu, 27 Nov, 02:39
Apache Hudson Server                                                                                         Build failed in Hudson: Maven-2.1.x-with-bootstrap #148 Thu, 27 Nov, 05:17
Apache Hudson Server                                                                                           Build failed in Hudson: Maven-2.1.x-with-bootstrap #149 Thu, 27 Nov, 06:17
Apache Hudson Server                                                                                             Build failed in Hudson: Maven-2.1.x-with-bootstrap #150 Thu, 27 Nov, 07:37
Apache Hudson Server                                                                                               Build failed in Hudson: Maven-2.1.x-with-bootstrap #151 Thu, 27 Nov, 09:35
Apache Hudson Server                                                                                                 Build failed in Hudson: Maven-2.1.x-with-bootstrap #152 Thu, 27 Nov, 18:17
Apache Hudson Server                                                                                                   Build failed in Hudson: Maven-2.1.x-with-bootstrap #153 Thu, 27 Nov, 19:32
Apache Hudson Server                                                                                                     Build failed in Hudson: Maven-2.1.x-with-bootstrap #154 Thu, 27 Nov, 21:18
Apache Hudson Server                                                                                                       Build failed in Hudson: Maven-2.1.x-with-bootstrap #155 Thu, 27 Nov, 23:19
Apache Hudson Server                                                                                                         Build failed in Hudson: Maven-2.1.x-with-bootstrap #156 Fri, 28 Nov, 04:17
Apache Hudson Server                                                                                                           Build failed in Hudson: Maven-2.1.x-with-bootstrap #157 Fri, 28 Nov, 05:18
Apache Hudson Server                                                                                                             Build failed in Hudson: Maven-2.1.x-with-bootstrap #158 Fri, 28 Nov, 06:17
Apache Hudson Server                                                                                                               Build failed in Hudson: Maven-2.1.x-with-bootstrap #159 Fri, 28 Nov, 22:17
Apache Hudson Server                                                                                                                 Build failed in Hudson: Maven-2.1.x-with-bootstrap #160 Sat, 29 Nov, 02:28
Apache Hudson Server                                                                                                                   Build failed in Hudson: Maven-2.1.x-with-bootstrap #161 Sat, 29 Nov, 03:17
Apache Hudson Server                                                                                                                     Build failed in Hudson: Maven-2.1.x-with-bootstrap #162 Sat, 29 Nov, 05:17
Apache Hudson Server                                                                                                                       Build failed in Hudson: Maven-2.1.x-with-bootstrap #163 Sat, 29 Nov, 06:52
Apache Hudson Server                                                                                                                         Build failed in Hudson: Maven-2.1.x-with-bootstrap #164 Sat, 29 Nov, 19:03
Apache Hudson Server                                                                                                                           Build failed in Hudson: Maven-2.1.x-with-bootstrap #165 Sat, 29 Nov, 20:17
Apache Hudson Server                                                                                                                             Build failed in Hudson: Maven-2.1.x-with-bootstrap #166 Sat, 29 Nov, 21:17
Apache Hudson Server                                                                                                                               Build failed in Hudson: Maven-2.1.x-with-bootstrap #167 Sat, 29 Nov, 22:19
Apache Hudson Server                                                                                                                                 Build failed in Hudson: Maven-2.1.x-with-bootstrap #168 Sun, 30 Nov, 00:23
Apache Hudson Server                                                                                                                                   Build failed in Hudson: Maven-2.1.x-with-bootstrap #169 Sun, 30 Nov, 02:20
Apache Hudson Server                                                                                                                                     Build failed in Hudson: Maven-2.1.x-with-bootstrap #170 Sun, 30 Nov, 06:51
Apache Hudson Server                                                                                                                                       Build failed in Hudson: Maven-2.1.x-with-bootstrap #171 Sun, 30 Nov, 17:17
Apache Hudson Server                                                                                                                                         Build failed in Hudson: Maven-2.1.x-with-bootstrap #172 Sun, 30 Nov, 20:17
Apache Hudson Server                                                                                                                                           Build failed in Hudson: Maven-2.1.x-with-bootstrap #173 Sun, 30 Nov, 21:17
Apache Hudson Server                                                                                                                                             Build failed in Hudson: Maven-2.1.x-with-bootstrap #174 Sun, 30 Nov, 22:17
Hudson Build failed in Hudson: mercury #132 Tue, 04 Nov, 02:49
Hudson   Hudson build is back to normal: mercury #133 Tue, 04 Nov, 22:49
[continuum] BUILD FAILURE: Maven 2.0.x Branch - Integration Test Executor - default maven2 buildDefinition
Contin...@vmbuild.apache.org   [continuum] BUILD FAILURE: Maven 2.0.x Branch - Integration Test Executor - default maven2 buildDefinition Tue, 04 Nov, 15:35
Contin...@vmbuild.apache.org   [continuum] BUILD FAILURE: Maven 2.0.x Branch - Integration Test Executor - default maven2 buildDefinition Tue, 04 Nov, 20:29
Contin...@vmbuild.apache.org   [continuum] BUILD FAILURE: Maven 2.0.x Branch - Integration Test Executor - default maven2 buildDefinition Wed, 05 Nov, 03:59
Contin...@vmbuild.apache.org   [continuum] BUILD FAILURE: Maven 2.0.x Branch - Integration Test Executor - default maven2 buildDefinition Wed, 05 Nov, 21:19
Contin...@vmbuild.apache.org   [continuum] BUILD FAILURE: Maven 2.0.x Branch - Integration Test Executor - default maven2 buildDefinition Wed, 05 Nov, 23:22
Contin...@vmbuild.apache.org   [continuum] BUILD FAILURE: Maven 2.0.x Branch - Integration Test Executor - default maven2 buildDefinition Fri, 07 Nov, 17:42
Contin...@vmbuild.apache.org   [continuum] BUILD FAILURE: Maven 2.0.x Branch - Integration Test Executor - default maven2 buildDefinition Fri, 07 Nov, 21:12
Contin...@vmbuild.apache.org   [continuum] BUILD FAILURE: Maven 2.0.x Branch - Integration Test Executor - default maven2 buildDefinition Sat, 08 Nov, 00:25
Contin...@vmbuild.apache.org   [continuum] BUILD FAILURE: Maven 2.0.x Branch - Integration Test Executor - default maven2 buildDefinition Sat, 08 Nov, 03:47
Contin...@vmbuild.apache.org   [continuum] BUILD FAILURE: Maven 2.0.x Branch - Integration Test Executor - default maven2 buildDefinition Sun, 09 Nov, 21:30
Contin...@vmbuild.apache.org   [continuum] BUILD FAILURE: Maven 2.0.x Branch - Integration Test Executor - default maven2 buildDefinition Sun, 09 Nov, 23:30
Contin...@vmbuild.apache.org   [continuum] BUILD FAILURE: Maven 2.0.x Branch - Integration Test Executor - default maven2 buildDefinition Mon, 10 Nov, 01:33
Contin...@vmbuild.apache.org   [continuum] BUILD FAILURE: Maven 2.0.x Branch - Integration Test Executor - default maven2 buildDefinition Tue, 11 Nov, 18:27
Contin...@vmbuild.apache.org   [continuum] BUILD FAILURE: Maven 2.0.x Branch - Integration Test Executor - default maven2 buildDefinition Tue, 11 Nov, 20:42
Contin...@vmbuild.apache.org   [continuum] BUILD FAILURE: Maven 2.0.x Branch - Integration Test Executor - default maven2 buildDefinition Tue, 11 Nov, 23:04
Contin...@vmbuild.apache.org   [continuum] BUILD FAILURE: Maven 2.0.x Branch - Integration Test Executor - default maven2 buildDefinition Wed, 12 Nov, 02:30
Contin...@vmbuild.apache.org   [continuum] BUILD FAILURE: Maven 2.0.x Branch - Integration Test Executor - default maven2 buildDefinition Thu, 13 Nov, 00:49
Contin...@vmbuild.apache.org   [continuum] BUILD FAILURE: Maven 2.0.x Branch - Integration Test Executor - default maven2 buildDefinition Thu, 13 Nov, 03:45
Contin...@vmbuild.apache.org   [continuum] BUILD FAILURE: Maven 2.0.x Branch - Integration Test Executor - default maven2 buildDefinition Fri, 14 Nov, 14:22
Contin...@vmbuild.apache.org   [continuum] BUILD FAILURE: Maven 2.0.x Branch - Integration Test Executor - default maven2 buildDefinition Fri, 14 Nov, 16:53
Contin...@vmbuild.apache.org   [continuum] BUILD FAILURE: Maven 2.0.x Branch - Integration Test Executor - default maven2 buildDefinition Fri, 14 Nov, 20:58
Contin...@vmbuild.apache.org   [continuum] BUILD FAILURE: Maven 2.0.x Branch - Integration Test Executor - default maven2 buildDefinition Sat, 15 Nov, 02:36
Contin...@vmbuild.apache.org   [continuum] BUILD FAILURE: Maven 2.0.x Branch - Integration Test Executor - default maven2 buildDefinition Sat, 15 Nov, 14:39
Contin...@vmbuild.apache.org   [continuum] BUILD FAILURE: Maven 2.0.x Branch - Integration Test Executor - default maven2 buildDefinition Sat, 15 Nov, 17:10
Contin...@vmbuild.apache.org   [continuum] BUILD FAILURE: Maven 2.0.x Branch - Integration Test Executor - default maven2 buildDefinition Sat, 15 Nov, 19:26
Contin...@vmbuild.apache.org   [continuum] BUILD FAILURE: Maven 2.0.x Branch - Integration Test Executor - default maven2 buildDefinition Sat, 15 Nov, 21:33
Contin...@vmbuild.apache.org   [continuum] BUILD FAILURE: Maven 2.0.x Branch - Integration Test Executor - default maven2 buildDefinition Sat, 15 Nov, 23:26
Contin...@vmbuild.apache.org   [continuum] BUILD FAILURE: Maven 2.0.x Branch - Integration Test Executor - default maven2 buildDefinition Sun, 16 Nov, 01:25
Contin...@vmbuild.apache.org   [continuum] BUILD FAILURE: Maven 2.0.x Branch - Integration Test Executor - default maven2 buildDefinition Mon, 17 Nov, 21:22
Contin...@vmbuild.apache.org   [continuum] BUILD FAILURE: Maven 2.0.x Branch - Integration Test Executor - default maven2 buildDefinition Tue, 18 Nov, 20:17
Contin...@vmbuild.apache.org   [continuum] BUILD FAILURE: Maven 2.0.x Branch - Integration Test Executor - default maven2 buildDefinition Tue, 18 Nov, 22:16
Contin...@vmbuild.apache.org   [continuum] BUILD FAILURE: Maven 2.0.x Branch - Integration Test Executor - default maven2 buildDefinition Wed, 19 Nov, 01:17
Contin...@vmbuild.apache.org   [continuum] BUILD FAILURE: Maven 2.0.x Branch - Integration Test Executor - default maven2 buildDefinition Wed, 19 Nov, 04:04
Contin...@vmbuild.apache.org   [continuum] BUILD FAILURE: Maven 2.0.x Branch - Integration Test Executor - default maven2 buildDefinition Thu, 20 Nov, 17:30
Contin...@vmbuild.apache.org   [continuum] BUILD FAILURE: Maven 2.0.x Branch - Integration Test Executor - default maven2 buildDefinition Thu, 20 Nov, 19:32
Contin...@vmbuild.apache.org   [continuum] BUILD FAILURE: Maven 2.0.x Branch - Integration Test Executor - default maven2 buildDefinition Thu, 20 Nov, 23:03
Contin...@vmbuild.apache.org   [continuum] BUILD FAILURE: Maven 2.0.x Branch - Integration Test Executor - default maven2 buildDefinition Sat, 22 Nov, 21:01
Contin...@vmbuild.apache.org   [continuum] BUILD FAILURE: Maven 2.0.x Branch - Integration Test Executor - default maven2 buildDefinition Sun, 23 Nov, 18:11
Contin...@vmbuild.apache.org   [continuum] BUILD FAILURE: Maven 2.0.x Branch - Integration Test Executor - default maven2 buildDefinition Sun, 23 Nov, 20:20
Contin...@vmbuild.apache.org   [continuum] BUILD FAILURE: Maven 2.0.x Branch - Integration Test Executor - default maven2 buildDefinition Sun, 23 Nov, 23:07
Contin...@vmbuild.apache.org   [continuum] BUILD FAILURE: Maven 2.0.x Branch - Integration Test Executor - default maven2 buildDefinition Mon, 24 Nov, 01:39
Contin...@vmbuild.apache.org   [continuum] BUILD FAILURE: Maven 2.0.x Branch - Integration Test Executor - default maven2 buildDefinition Mon, 24 Nov, 04:00
Contin...@vmbuild.apache.org   [continuum] BUILD FAILURE: Maven 2.0.x Branch - Integration Test Executor - default maven2 buildDefinition Mon, 24 Nov, 06:48
Contin...@vmbuild.apache.org   [continuum] BUILD FAILURE: Maven 2.0.x Branch - Integration Test Executor - default maven2 buildDefinition Mon, 24 Nov, 09:14
Contin...@vmbuild.apache.org   [continuum] BUILD FAILURE: Maven 2.0.x Branch - Integration Test Executor - default maven2 buildDefinition Mon, 24 Nov, 11:13
Contin...@vmbuild.apache.org   [continuum] BUILD FAILURE: Maven 2.0.x Branch - Integration Test Executor - default maven2 buildDefinition Tue, 25 Nov, 03:38
Contin...@vmbuild.apache.org   [continuum] BUILD FAILURE: Maven 2.0.x Branch - Integration Test Executor - default maven2 buildDefinition Tue, 25 Nov, 05:45
Contin...@vmbuild.apache.org   [continuum] BUILD FAILURE: Maven 2.0.x Branch - Integration Test Executor - default maven2 buildDefinition Tue, 25 Nov, 08:58
Contin...@vmbuild.apache.org   [continuum] BUILD FAILURE: Maven 2.0.x Branch - Integration Test Executor - default maven2 buildDefinition Tue, 25 Nov, 13:07
[continuum] BUILD FAILURE: Maven Integration Testing - Maven Integration Tests - default maven2 buildDefinition
Contin...@vmbuild.apache.org   [continuum] BUILD FAILURE: Maven Integration Testing - Maven Integration Tests - default maven2 buildDefinition Tue, 04 Nov, 20:42
Contin...@vmbuild.apache.org   [continuum] BUILD FAILURE: Maven Integration Testing - Maven Integration Tests - default maven2 buildDefinition Tue, 04 Nov, 22:59
Hudson Build failed in Hudson: maven-core-integration-testing » 1.5,jeos1 #41 Tue, 04 Nov, 22:02
Hudson   Build failed in Hudson: maven-core-integration-testing » 1.5,jeos1 #42 Wed, 05 Nov, 02:01
Hudson     Hudson build is back to normal: maven-core-integration-testing » 1.5,jeos1 #43 Wed, 05 Nov, 22:07
Contin...@vmbuild.apache.org [continuum] BUILD SUCCESSFUL: Maven Integration Testing - Maven Integration Tests - default maven2 buildDefinition Wed, 05 Nov, 00:53
Hudson Hudson build is back to stable: plugins-CI-with-maven-2.0.x » Maven Javadoc Plugin #626 Wed, 05 Nov, 02:19
Hudson Hudson build became unstable: plugins-CI-with-maven-2.0.x » Maven Changes Report Plugin #626 Wed, 05 Nov, 02:19
Hudson Build failed in Hudson: mercury #135 Wed, 05 Nov, 06:48
Hudson   Build failed in Hudson: mercury #136 Thu, 06 Nov, 02:48
Hudson     Hudson build is back to normal: mercury #137 Thu, 06 Nov, 06:49
Hudson Hudson build is back to stable: plugins-IT-with-maven-2.0.x » Maven Javadoc Plugin #556 Wed, 05 Nov, 06:51
Hudson Build failed in Hudson: maven-core-integration-testing » 1.5,jeos1 #45 Fri, 07 Nov, 18:10
Hudson   Hudson build is back to normal: maven-core-integration-testing » 1.5,jeos1 #46 Fri, 07 Nov, 22:03
Hudson Build failed in Hudson: mercury #142 Mon, 10 Nov, 10:48
Hudson Build failed in Hudson: scm » Maven SCM #177 Tue, 11 Nov, 02:38
Hudson Build failed in Hudson: mercury #144 Wed, 12 Nov, 15:04
Hudson   Build failed in Hudson: mercury #145 Wed, 12 Nov, 22:47
Hudson     Hudson build is back to normal: mercury #146 Fri, 14 Nov, 06:51
[continuum] BUILD ERROR: Maven Integration Testing - Maven Integration Test Plugin :: Envar - default maven2 buildDefinition
Contin...@vmbuild.apache.org   [continuum] BUILD ERROR: Maven Integration Testing - Maven Integration Test Plugin :: Envar - default maven2 buildDefinition Wed, 19 Nov, 01:26
Contin...@vmbuild.apache.org   [continuum] BUILD ERROR: Maven Integration Testing - Maven Integration Test Plugin :: Envar - default maven2 buildDefinition Wed, 19 Nov, 04:09
Contin...@vmbuild.apache.org   [continuum] BUILD ERROR: Maven Integration Testing - Maven Integration Test Plugin :: Envar - default maven2 buildDefinition Wed, 19 Nov, 05:17
Contin...@vmbuild.apache.org   [continuum] BUILD ERROR: Maven Integration Testing - Maven Integration Test Plugin :: Envar - default maven2 buildDefinition Wed, 19 Nov, 06:20
Contin...@vmbuild.apache.org   [continuum] BUILD ERROR: Maven Integration Testing - Maven Integration Test Plugin :: Envar - default maven2 buildDefinition Wed, 19 Nov, 08:02
Contin...@vmbuild.apache.org   [continuum] BUILD ERROR: Maven Integration Testing - Maven Integration Test Plugin :: Envar - default maven2 buildDefinition Wed, 19 Nov, 09:45
Contin...@vmbuild.apache.org   [continuum] BUILD ERROR: Maven Integration Testing - Maven Integration Test Plugin :: Envar - default maven2 buildDefinition Wed, 19 Nov, 11:10
Contin...@vmbuild.apache.org [continuum] BUILD FAILURE: Maven Plugins - Maven Changes Report Plugin - default maven2 buildDefinition Mon, 24 Nov, 11:18
Contin...@vmbuild.apache.org [continuum] BUILD SUCCESSFUL: Maven 2.0.x Branch - Integration Test Executor - default maven2 buildDefinition Tue, 25 Nov, 15:28
Contin...@vmbuild.apache.org [continuum] BUILD ERROR: Maven Integration Testing - Maven Integration Test Plugin :: Interpolated POM Configuration - default maven2 buildDefinition Fri, 28 Nov, 23:00
Message listThread · Author · Date
Box list
Sep 201513
Aug 2015194
Jul 2015361
Jun 2015274
May 2015197
Apr 2015367
Mar 2015273
Feb 2015179
Jan 2015399
Dec 2014420
Nov 2014618
Oct 2014426
Sep 2014304
Aug 2014246
Jul 2014317
Jun 2014341
May 2014161
Apr 2014146
Mar 2014336
Feb 2014308
Jan 2014189
Dec 2013319
Nov 2013274
Oct 2013167
Sep 2013486
Aug 2013263
Jul 2013726
Jun 2013722
May 2013378
Apr 2013313
Mar 2013467
Feb 2013520
Jan 20131437
Dec 20121778
Nov 2012775
Oct 20121224
Sep 2012791
Aug 2012362
Jul 2012232
Jun 2012149
May 2012189
Apr 2012115
Mar 201257
Feb 2012155
Jan 2012170
Dec 2011244
Nov 2011187
Oct 2011139
Sep 2011190
Aug 2011276
Jul 201194
Jun 20114
Apr 201162
Mar 201176
Feb 201154
Jan 201185
Dec 201079
Nov 201061
Oct 201058
Sep 20101
Aug 201057
Jul 201037
Jun 201020
May 201075
Apr 201053
Mar 201012
Feb 201030
Jan 201071
Dec 2009104
Nov 200919
Oct 200931
Sep 2009193
Aug 2009268
Jul 2009193
Jun 2009147
May 200975
Apr 200979
Mar 2009134
Feb 2009657
Jan 200983
Dec 2008349
Nov 2008288
Oct 2008986
Sep 2008842
Aug 2008707
Jul 2008887
Jun 2008167
May 200821
Apr 2008231
Mar 2008438
Feb 2008317
Jan 2008205
Dec 2007185
Nov 2007532
Oct 2007439
Sep 2007699
Aug 20071294
Jul 2007351
Jun 20072211
May 2007273
Apr 2007262
Mar 2007534
Feb 20071648
Jan 20072359
Dec 2006575
Nov 2006357
Oct 2006642
Sep 2006660
Aug 20061662
Jul 20061320
Jun 2006473
May 20064700
Apr 20061113
Mar 20061048