maven-notifications mailing list archives

Site index · List index
Message view « Date » · « Thread »
Top « Date » · « Thread »
From Hudson <Hud...@sonatype.org>
Subject Build failed in Hudson: plugins-IT-with-maven-2.0.x » Maven Assembly Plugin #553
Date Sun, 02 Nov 2008 05:50:58 GMT
See http://ci.sonatype.org/job/plugins-IT-with-maven-2.0.x/org.apache.maven.plugins$maven-assembly-plugin/553/changes

------------------------------------------
[...truncated 501 lines...]
[INFO] Downloading: http://localhost:8081/content/groups/public/org/codehaus/plexus/plexus-digest/1.0/plexus-digest-1.0.jar
[INFO] 11K downloaded
[INFO] [INFO] [install:install]
[INFO] [INFO] Installing http://ci.sonatype.org/job/plugins-IT-with-maven-2.0.x/org.apache.maven.plugins$maven-assembly-plugin/ws/target/it/it-project-parent/interpolated-pom.xml
 to http://ci.sonatype.org/job/plugins-IT-with-maven-2.0.x/org.apache.maven.plugins$maven-assembly-plugin/ws/target/local-repository/org/apache/maven/plugin/assembly/test/it-project-parent/1/it-project-parent-1.pom

[INFO] [INFO] ------------------------------------------------------------------------
[INFO] [INFO] BUILD SUCCESSFUL
[INFO] [INFO] ------------------------------------------------------------------------
[INFO] [INFO] Total time: 5 seconds
[INFO] [INFO] Finished at: Sun Nov 02 00:17:42 CDT 2008
[INFO] [INFO] Final Memory: 14M/101M
[INFO] [INFO] ------------------------------------------------------------------------
[INFO] [invoker:run {execution: integration-test}]
[INFO] Building: forking-tests/assembly-assembly-with-module-binaries/pom.xml
[INFO] ...FAILED[code=1]. See http://ci.sonatype.org/job/plugins-IT-with-maven-2.0.x/org.apache.maven.plugins$maven-assembly-plugin/ws/target/it/projects/forking-tests/assembly-assembly-with-module-binaries/build.log
 for details.
[INFO] Building: forking-tests/assembly-attached-with-module-binaries/pom.xml
[INFO] ...FAILED[code=1]. See http://ci.sonatype.org/job/plugins-IT-with-maven-2.0.x/org.apache.maven.plugins$maven-assembly-plugin/ws/target/it/projects/forking-tests/assembly-attached-with-module-binaries/build.log
 for details.
[INFO] Building: descriptor-refs/jar-with-dependencies/deps-unpacked-to-root-dir/pom.xml
[INFO] ...SUCCESS.
[INFO] Building: descriptor-refs/jar-with-dependencies/component-descriptors-merged/pom.xml
[INFO] ...SUCCESS.
[INFO] Building: descriptor-refs/src/src-dir-copied/pom.xml
[INFO] ...SUCCESS.
[INFO] Building: descriptor-refs/project/multimodule-sources-copied/pom.xml
[INFO] ...SUCCESS.
[INFO] Building: descriptor-refs/project/sources-copied/pom.xml
[INFO] ...SUCCESS.
[INFO] Building: descriptor-refs/bin/jars-in-archive-root/pom.xml
[INFO] ...SUCCESS.
[INFO] Building: file-modes/fileItem-fileMode/pom.xml
[INFO] ...FAILED[code=1]. See http://ci.sonatype.org/job/plugins-IT-with-maven-2.0.x/org.apache.maven.plugins$maven-assembly-plugin/ws/target/it/projects/file-modes/fileItem-fileMode/build.log
 for details.
[INFO] Building: file-modes/file-set-fileMode/pom.xml
[INFO] ...FAILED[code=1]. See http://ci.sonatype.org/job/plugins-IT-with-maven-2.0.x/org.apache.maven.plugins$maven-assembly-plugin/ws/target/it/projects/file-modes/file-set-fileMode/build.log
 for details.
[INFO] Building: mojo-tests/single-twice-in-multimodule-hierarchy/pom.xml
[INFO] ...FAILED[code=1]. See http://ci.sonatype.org/job/plugins-IT-with-maven-2.0.x/org.apache.maven.plugins$maven-assembly-plugin/ws/target/it/projects/mojo-tests/single-twice-in-multimodule-hierarchy/build.log
 for details.
[INFO] Building: mojo-tests/single-in-one-project-hierarchy/pom.xml
[INFO] ...FAILED[code=1]. See http://ci.sonatype.org/job/plugins-IT-with-maven-2.0.x/org.apache.maven.plugins$maven-assembly-plugin/ws/target/it/projects/mojo-tests/single-in-one-project-hierarchy/build.log
 for details.
[INFO] Building: mojo-tests/single-twice-in-one-project-hierarchy/pom.xml
[INFO] ...FAILED[code=1]. See http://ci.sonatype.org/job/plugins-IT-with-maven-2.0.x/org.apache.maven.plugins$maven-assembly-plugin/ws/target/it/projects/mojo-tests/single-twice-in-one-project-hierarchy/build.log
 for details.
[INFO] Building: multimodule/massembly-298/pom.xml
[INFO] ...FAILED[code=1]. See http://ci.sonatype.org/job/plugins-IT-with-maven-2.0.x/org.apache.maven.plugins$maven-assembly-plugin/ws/target/it/projects/multimodule/massembly-298/build.log
 for details.
[INFO] Building: multimodule/two-level-multimodule-dontIncludeSubModules/pom.xml
[INFO] ...FAILED[code=1]. See http://ci.sonatype.org/job/plugins-IT-with-maven-2.0.x/org.apache.maven.plugins$maven-assembly-plugin/ws/target/it/projects/multimodule/two-level-multimodule-dontIncludeSubModules/build.log
 for details.
[INFO] Building: multimodule/two-level-multimodule/pom.xml
[INFO] ...FAILED[code=1]. See http://ci.sonatype.org/job/plugins-IT-with-maven-2.0.x/org.apache.maven.plugins$maven-assembly-plugin/ws/target/it/projects/multimodule/two-level-multimodule/build.log
 for details.
[INFO] Building: multimodule/twoLevel-includeSubModules-excludeSubModuleSourceDirs/pom.xml
[INFO] ...FAILED[code=1]. See http://ci.sonatype.org/job/plugins-IT-with-maven-2.0.x/org.apache.maven.plugins$maven-assembly-plugin/ws/target/it/projects/multimodule/twoLevel-includeSubModules-excludeSubModuleSourceDirs/build.log
 for details.
[INFO] Building: multimodule/two-levels-includeBaseDirectory-withBinaries/pom.xml
[INFO] ...FAILED[code=1]. See http://ci.sonatype.org/job/plugins-IT-with-maven-2.0.x/org.apache.maven.plugins$maven-assembly-plugin/ws/target/it/projects/multimodule/two-levels-includeBaseDirectory-withBinaries/build.log
 for details.
[INFO] Building: multimodule/two-levels-includeBaseDirectory-withSources/pom.xml
[INFO] ...FAILED[code=1]. See http://ci.sonatype.org/job/plugins-IT-with-maven-2.0.x/org.apache.maven.plugins$maven-assembly-plugin/ws/target/it/projects/multimodule/two-levels-includeBaseDirectory-withSources/build.log
 for details.
[INFO] Building: multimodule/twoLevel-dontIncludeSubModules-artifactIdExprOutDir/pom.xml
[INFO] ...FAILED[code=1]. See http://ci.sonatype.org/job/plugins-IT-with-maven-2.0.x/org.apache.maven.plugins$maven-assembly-plugin/ws/target/it/projects/multimodule/twoLevel-dontIncludeSubModules-artifactIdExprOutDir/build.log
 for details.
[INFO] Building: container-descriptors/custom-handler-withFileEntries/pom.xml
[INFO] ...FAILED[code=1]. See http://ci.sonatype.org/job/plugins-IT-with-maven-2.0.x/org.apache.maven.plugins$maven-assembly-plugin/ws/target/it/projects/container-descriptors/custom-handler-withFileEntries/build.log
 for details.
[INFO] Building: container-descriptors/custom-handler-withMixedEntries/pom.xml
[INFO] ...FAILED[code=1]. See http://ci.sonatype.org/job/plugins-IT-with-maven-2.0.x/org.apache.maven.plugins$maven-assembly-plugin/ws/target/it/projects/container-descriptors/custom-handler-withMixedEntries/build.log
 for details.
[INFO] Building: container-descriptors/custom-containerDescriptorHandler/pom.xml
[INFO] ...FAILED[code=1]. See http://ci.sonatype.org/job/plugins-IT-with-maven-2.0.x/org.apache.maven.plugins$maven-assembly-plugin/ws/target/it/projects/container-descriptors/custom-containerDescriptorHandler/build.log
 for details.
[INFO] Building: dependency-sets/include-project-artifact/pom.xml
[INFO] ...FAILED[code=1]. See http://ci.sonatype.org/job/plugins-IT-with-maven-2.0.x/org.apache.maven.plugins$maven-assembly-plugin/ws/target/it/projects/dependency-sets/include-project-artifact/build.log
 for details.
[INFO] Building: dependency-sets/dependencySet-nonTransitive/pom.xml
[INFO] ...FAILED[code=1]. See http://ci.sonatype.org/job/plugins-IT-with-maven-2.0.x/org.apache.maven.plugins$maven-assembly-plugin/ws/target/it/projects/dependency-sets/dependencySet-nonTransitive/build.log
 for details.
[INFO] Building: dependency-sets/dependencySet-unpacked/pom.xml
[INFO] ...FAILED[code=1]. See http://ci.sonatype.org/job/plugins-IT-with-maven-2.0.x/org.apache.maven.plugins$maven-assembly-plugin/ws/target/it/projects/dependency-sets/dependencySet-unpacked/build.log
 for details.
[INFO] Building: dependency-sets/massembly-201/pom.xml
[INFO] ...FAILED[code=1]. See http://ci.sonatype.org/job/plugins-IT-with-maven-2.0.x/org.apache.maven.plugins$maven-assembly-plugin/ws/target/it/projects/dependency-sets/massembly-201/build.log
 for details.
[INFO] Building: dependency-sets/using-moduleSet-implied-depSet/pom.xml
[INFO] ...FAILED[code=1]. See http://ci.sonatype.org/job/plugins-IT-with-maven-2.0.x/org.apache.maven.plugins$maven-assembly-plugin/ws/target/it/projects/dependency-sets/using-moduleSet-implied-depSet/build.log
 for details.
[INFO] Building: dependency-sets/include-provided/pom.xml
[INFO] ...FAILED[code=1]. See http://ci.sonatype.org/job/plugins-IT-with-maven-2.0.x/org.apache.maven.plugins$maven-assembly-plugin/ws/target/it/projects/dependency-sets/include-provided/build.log
 for details.
[INFO] Building: dependency-sets/dep-with-transitive-filter/pom.xml
[INFO] ...FAILED[code=1]. See http://ci.sonatype.org/job/plugins-IT-with-maven-2.0.x/org.apache.maven.plugins$maven-assembly-plugin/ws/target/it/projects/dependency-sets/dep-with-transitive-filter/build.log
 for details.
[INFO] Building: dependency-sets/outputFileNameMappingWithUnpack/pom.xml
[INFO] ...FAILED[code=1]. See http://ci.sonatype.org/job/plugins-IT-with-maven-2.0.x/org.apache.maven.plugins$maven-assembly-plugin/ws/target/it/projects/dependency-sets/outputFileNameMappingWithUnpack/build.log
 for details.
[INFO] Building: dependency-sets/massembly-235/pom.xml
[INFO] ...FAILED[code=1]. See http://ci.sonatype.org/job/plugins-IT-with-maven-2.0.x/org.apache.maven.plugins$maven-assembly-plugin/ws/target/it/projects/dependency-sets/massembly-235/build.log
 for details.
[INFO] Building: dependency-sets/dependencySet-matchScope/pom.xml
[INFO] ...FAILED[code=1]. See http://ci.sonatype.org/job/plugins-IT-with-maven-2.0.x/org.apache.maven.plugins$maven-assembly-plugin/ws/target/it/projects/dependency-sets/dependencySet-matchScope/build.log
 for details.
[INFO] Building: dependency-sets/dependencySet-unpackedSubsetsTwice/pom.xml
[INFO] ...FAILED[code=1]. See http://ci.sonatype.org/job/plugins-IT-with-maven-2.0.x/org.apache.maven.plugins$maven-assembly-plugin/ws/target/it/projects/dependency-sets/dependencySet-unpackedSubsetsTwice/build.log
 for details.
[INFO] Building: dependency-sets/massembly-232/pom.xml
[INFO] ...FAILED[code=1]. See http://ci.sonatype.org/job/plugins-IT-with-maven-2.0.x/org.apache.maven.plugins$maven-assembly-plugin/ws/target/it/projects/dependency-sets/massembly-232/build.log
 for details.
[INFO] Building: dependency-sets/dependencySet-projectArtifactNotIncluded/pom.xml
[INFO] ...FAILED[code=1]. See http://ci.sonatype.org/job/plugins-IT-with-maven-2.0.x/org.apache.maven.plugins$maven-assembly-plugin/ws/target/it/projects/dependency-sets/dependencySet-projectArtifactNotIncluded/build.log
 for details.
[INFO] Building: dependency-sets/multiple-wildcard-includes/pom.xml
[INFO] ...FAILED[code=1]. See http://ci.sonatype.org/job/plugins-IT-with-maven-2.0.x/org.apache.maven.plugins$maven-assembly-plugin/ws/target/it/projects/dependency-sets/multiple-wildcard-includes/build.log
 for details.
[INFO] Building: dependency-sets/dependencySet-withExecutedProject/pom.xml
[INFO] ...FAILED[code=1]. See http://ci.sonatype.org/job/plugins-IT-with-maven-2.0.x/org.apache.maven.plugins$maven-assembly-plugin/ws/target/it/projects/dependency-sets/dependencySet-withExecutedProject/build.log
 for details.
[INFO] Building: dependency-sets/dependencySet-unpackedExcludingMetaInf/pom.xml
[INFO] ...FAILED[code=1]. See http://ci.sonatype.org/job/plugins-IT-with-maven-2.0.x/org.apache.maven.plugins$maven-assembly-plugin/ws/target/it/projects/dependency-sets/dependencySet-unpackedExcludingMetaInf/build.log
 for details.
[INFO] Building: dependency-sets/including-sar-dependency/pom.xml
[INFO] ...FAILED[code=1]. See http://ci.sonatype.org/job/plugins-IT-with-maven-2.0.x/org.apache.maven.plugins$maven-assembly-plugin/ws/target/it/projects/dependency-sets/including-sar-dependency/build.log
 for details.
[INFO] Building: dependency-sets/massembly-345/pom.xml
[INFO] ...FAILED[code=1]. See http://ci.sonatype.org/job/plugins-IT-with-maven-2.0.x/org.apache.maven.plugins$maven-assembly-plugin/ws/target/it/projects/dependency-sets/massembly-345/build.log
 for details.
[INFO] Building: dependency-sets/dependencySet-notUnpacked/pom.xml
[INFO] ...FAILED[code=1]. See http://ci.sonatype.org/job/plugins-IT-with-maven-2.0.x/org.apache.maven.plugins$maven-assembly-plugin/ws/target/it/projects/dependency-sets/dependencySet-notUnpacked/build.log
 for details.
[INFO] Building: dependency-sets/massembly-99/pom.xml
[INFO] ...FAILED[code=1]. See http://ci.sonatype.org/job/plugins-IT-with-maven-2.0.x/org.apache.maven.plugins$maven-assembly-plugin/ws/target/it/projects/dependency-sets/massembly-99/build.log
 for details.
[INFO] Building: dependency-sets/including-pom-dependency/pom.xml
[INFO] ...FAILED[code=1]. See http://ci.sonatype.org/job/plugins-IT-with-maven-2.0.x/org.apache.maven.plugins$maven-assembly-plugin/ws/target/it/projects/dependency-sets/including-pom-dependency/build.log
 for details.
[INFO] Building: dependency-sets/include-project-attachments/pom.xml
[INFO] ...FAILED[code=1]. See http://ci.sonatype.org/job/plugins-IT-with-maven-2.0.x/org.apache.maven.plugins$maven-assembly-plugin/ws/target/it/projects/dependency-sets/include-project-attachments/build.log
 for details.
[INFO] Building: basic-features/assemblyDescriptor-artifact/pom.xml
[INFO] ...FAILED[code=1]. See http://ci.sonatype.org/job/plugins-IT-with-maven-2.0.x/org.apache.maven.plugins$maven-assembly-plugin/ws/target/it/projects/basic-features/assemblyDescriptor-artifact/build.log
 for details.
[INFO] Building: basic-features/descriptorDirectoryScan/pom.xml
[INFO] ...FAILED[code=1]. See http://ci.sonatype.org/job/plugins-IT-with-maven-2.0.x/org.apache.maven.plugins$maven-assembly-plugin/ws/target/it/projects/basic-features/descriptorDirectoryScan/build.log
 for details.
[INFO] Building: basic-features/file-sameName/pom.xml
[INFO] ...FAILED[code=1]. See http://ci.sonatype.org/job/plugins-IT-with-maven-2.0.x/org.apache.maven.plugins$maven-assembly-plugin/ws/target/it/projects/basic-features/file-sameName/build.log
 for details.
[INFO] Building: basic-features/outputFileNameMapping-withArtifactBaseVersion/pom.xml
[INFO] ...FAILED[code=1]. See http://ci.sonatype.org/job/plugins-IT-with-maven-2.0.x/org.apache.maven.plugins$maven-assembly-plugin/ws/target/it/projects/basic-features/outputFileNameMapping-withArtifactBaseVersion/build.log
 for details.
[INFO] Building: basic-features/massembly-351-projectPrefixInterp/pom.xml
[INFO] ...FAILED[code=1]. See http://ci.sonatype.org/job/plugins-IT-with-maven-2.0.x/org.apache.maven.plugins$maven-assembly-plugin/ws/target/it/projects/basic-features/massembly-351-projectPrefixInterp/build.log
 for details.
[INFO] Building: basic-features/outputFileNameMapping-simple/pom.xml
[INFO] ...FAILED[code=1]. See http://ci.sonatype.org/job/plugins-IT-with-maven-2.0.x/org.apache.maven.plugins$maven-assembly-plugin/ws/target/it/projects/basic-features/outputFileNameMapping-simple/build.log
 for details.
[INFO] Building: basic-features/file-copyIntoTopDir/pom.xml
[INFO] ...FAILED[code=1]. See http://ci.sonatype.org/job/plugins-IT-with-maven-2.0.x/org.apache.maven.plugins$maven-assembly-plugin/ws/target/it/projects/basic-features/file-copyIntoTopDir/build.log
 for details.
[INFO] Building: basic-features/massembly-256-pomPropertiesInterp/pom.xml
[INFO] ...FAILED[code=1]. See http://ci.sonatype.org/job/plugins-IT-with-maven-2.0.x/org.apache.maven.plugins$maven-assembly-plugin/ws/target/it/projects/basic-features/massembly-256-pomPropertiesInterp/build.log
 for details.
[INFO] Building: file-sets/include-parent-dir/pom.xml
[INFO] ...FAILED[code=1]. See http://ci.sonatype.org/job/plugins-IT-with-maven-2.0.x/org.apache.maven.plugins$maven-assembly-plugin/ws/target/it/projects/file-sets/include-parent-dir/build.log
 for details.
[INFO] Building: file-sets/excluding-svn-dirs/pom.xml
[INFO] ...FAILED[code=1]. See http://ci.sonatype.org/job/plugins-IT-with-maven-2.0.x/org.apache.maven.plugins$maven-assembly-plugin/ws/target/it/projects/file-sets/excluding-svn-dirs/build.log
 for details.
[INFO] Building: file-sets/default-excludes-unspecified/pom.xml
[INFO] ...FAILED[code=1]. See http://ci.sonatype.org/job/plugins-IT-with-maven-2.0.x/org.apache.maven.plugins$maven-assembly-plugin/ws/target/it/projects/file-sets/default-excludes-unspecified/build.log
 for details.
[INFO] Building: file-sets/filtered-multimodule/pom.xml
[INFO] ...FAILED[code=1]. See http://ci.sonatype.org/job/plugins-IT-with-maven-2.0.x/org.apache.maven.plugins$maven-assembly-plugin/ws/target/it/projects/file-sets/filtered-multimodule/build.log
 for details.
[INFO] Building: file-sets/filtered-module-sources/pom.xml
[INFO] ...FAILED[code=1]. See http://ci.sonatype.org/job/plugins-IT-with-maven-2.0.x/org.apache.maven.plugins$maven-assembly-plugin/ws/target/it/projects/file-sets/filtered-module-sources/build.log
 for details.
[INFO] Building: file-sets/multimodule-unix-lineEndings/pom.xml
[INFO] ...FAILED[code=1]. See http://ci.sonatype.org/job/plugins-IT-with-maven-2.0.x/org.apache.maven.plugins$maven-assembly-plugin/ws/target/it/projects/file-sets/multimodule-unix-lineEndings/build.log
 for details.
[INFO] Building: file-sets/use-default-excludes/pom.xml
[INFO] ...FAILED[code=1]. See http://ci.sonatype.org/job/plugins-IT-with-maven-2.0.x/org.apache.maven.plugins$maven-assembly-plugin/ws/target/it/projects/file-sets/use-default-excludes/build.log
 for details.
[INFO] Building: file-sets/dont-use-default-excludes/pom.xml
[INFO] ...FAILED[code=1]. See http://ci.sonatype.org/job/plugins-IT-with-maven-2.0.x/org.apache.maven.plugins$maven-assembly-plugin/ws/target/it/projects/file-sets/dont-use-default-excludes/build.log
 for details.
[INFO] Building: file-sets/include-base-directory/pom.xml
[INFO] ...FAILED[code=1]. See http://ci.sonatype.org/job/plugins-IT-with-maven-2.0.x/org.apache.maven.plugins$maven-assembly-plugin/ws/target/it/projects/file-sets/include-base-directory/build.log
 for details.
[INFO] Building: file-sets/default-directory-unspecified/pom.xml
[INFO] ...FAILED[code=1]. See http://ci.sonatype.org/job/plugins-IT-with-maven-2.0.x/org.apache.maven.plugins$maven-assembly-plugin/ws/target/it/projects/file-sets/default-directory-unspecified/build.log
 for details.
[INFO] Building: file-sets/multimodule-win-lineEndings/pom.xml
[INFO] ...FAILED[code=1]. See http://ci.sonatype.org/job/plugins-IT-with-maven-2.0.x/org.apache.maven.plugins$maven-assembly-plugin/ws/target/it/projects/file-sets/multimodule-win-lineEndings/build.log
 for details.
[INFO] Building: filtering-feature/filtersDefinedInAssemblyPluginConfig/pom.xml
[INFO] ...FAILED[code=1]. See http://ci.sonatype.org/job/plugins-IT-with-maven-2.0.x/org.apache.maven.plugins$maven-assembly-plugin/ws/target/it/projects/filtering-feature/filtersDefinedInAssemblyPluginConfig/build.log
 for details.
[INFO] Building: repositories/massembly-196/pom.xml
[INFO] ...FAILED[code=1]. See http://ci.sonatype.org/job/plugins-IT-with-maven-2.0.x/org.apache.maven.plugins$maven-assembly-plugin/ws/target/it/projects/repositories/massembly-196/build.log
 for details.
[INFO] Building: repositories/basic-repository/pom.xml
[INFO] ...FAILED[code=1]. See http://ci.sonatype.org/job/plugins-IT-with-maven-2.0.x/org.apache.maven.plugins$maven-assembly-plugin/ws/target/it/projects/repositories/basic-repository/build.log
 for details.
[INFO] Building: mojo-configuration/massembly-291/pom.xml
[INFO] ...FAILED[code=1]. See http://ci.sonatype.org/job/plugins-IT-with-maven-2.0.x/org.apache.maven.plugins$maven-assembly-plugin/ws/target/it/projects/mojo-configuration/massembly-291/build.log
 for details.
[INFO] Building: mojo-configuration/manifest-with-customEntry/pom.xml
[INFO] ...FAILED[code=1]. See http://ci.sonatype.org/job/plugins-IT-with-maven-2.0.x/org.apache.maven.plugins$maven-assembly-plugin/ws/target/it/projects/mojo-configuration/manifest-with-customEntry/build.log
 for details.
[INFO] Building: mojo-configuration/manifest-with-mainClass/pom.xml
[INFO] ...FAILED[code=1]. See http://ci.sonatype.org/job/plugins-IT-with-maven-2.0.x/org.apache.maven.plugins$maven-assembly-plugin/ws/target/it/projects/mojo-configuration/manifest-with-mainClass/build.log
 for details.
[INFO] Building: mojo-configuration/massembly-301/pom.xml
[INFO] ...FAILED[code=1]. See http://ci.sonatype.org/job/plugins-IT-with-maven-2.0.x/org.apache.maven.plugins$maven-assembly-plugin/ws/target/it/projects/mojo-configuration/massembly-301/build.log
 for details.
[INFO] Building: mojo-configuration/no-appendAssemblyId-no-classifier/pom.xml
[INFO] ...FAILED[code=1]. See http://ci.sonatype.org/job/plugins-IT-with-maven-2.0.x/org.apache.maven.plugins$maven-assembly-plugin/ws/target/it/projects/mojo-configuration/no-appendAssemblyId-no-classifier/build.log
 for details.
[INFO] Building: mojo-configuration/ignoreDirFormatExtensions/pom.xml
[INFO] ...FAILED[code=1]. See http://ci.sonatype.org/job/plugins-IT-with-maven-2.0.x/org.apache.maven.plugins$maven-assembly-plugin/ws/target/it/projects/mojo-configuration/ignoreDirFormatExtensions/build.log
 for details.
[INFO] Building: mojo-configuration/skipAssemblyCLIPropertySet/pom.xml
[INFO] ...SUCCESS.
[INFO] Building: bugs/massembly-190/pom.xml
[INFO] ...FAILED[code=1]. See http://ci.sonatype.org/job/plugins-IT-with-maven-2.0.x/org.apache.maven.plugins$maven-assembly-plugin/ws/target/it/projects/bugs/massembly-190/build.log
 for details.
[INFO] Building: bugs/massembly-285/pom.xml
[INFO] ...FAILED[code=1]. See http://ci.sonatype.org/job/plugins-IT-with-maven-2.0.x/org.apache.maven.plugins$maven-assembly-plugin/ws/target/it/projects/bugs/massembly-285/build.log
 for details.
[INFO] Building: bugs/massembly-306/pom.xml
[INFO] ...FAILED[code=1]. See http://ci.sonatype.org/job/plugins-IT-with-maven-2.0.x/org.apache.maven.plugins$maven-assembly-plugin/ws/target/it/projects/bugs/massembly-306/build.log
 for details.
[INFO] 

---------------------------------------
Execution Summary:
Builds Passing: 7
Builds Failing: 70
---------------------------------------

The following builds failed:

*  forking-tests/assembly-assembly-with-module-binaries/pom.xml
*  forking-tests/assembly-attached-with-module-binaries/pom.xml
*  file-modes/fileItem-fileMode/pom.xml
*  file-modes/file-set-fileMode/pom.xml
*  mojo-tests/single-twice-in-multimodule-hierarchy/pom.xml
*  mojo-tests/single-in-one-project-hierarchy/pom.xml
*  mojo-tests/single-twice-in-one-project-hierarchy/pom.xml
*  multimodule/massembly-298/pom.xml
*  multimodule/two-level-multimodule-dontIncludeSubModules/pom.xml
*  multimodule/two-level-multimodule/pom.xml
*  multimodule/twoLevel-includeSubModules-excludeSubModuleSourceDirs/pom.xml
*  multimodule/two-levels-includeBaseDirectory-withBinaries/pom.xml
*  multimodule/two-levels-includeBaseDirectory-withSources/pom.xml
*  multimodule/twoLevel-dontIncludeSubModules-artifactIdExprOutDir/pom.xml
*  container-descriptors/custom-handler-withFileEntries/pom.xml
*  container-descriptors/custom-handler-withMixedEntries/pom.xml
*  container-descriptors/custom-containerDescriptorHandler/pom.xml
*  dependency-sets/include-project-artifact/pom.xml
*  dependency-sets/dependencySet-nonTransitive/pom.xml
*  dependency-sets/dependencySet-unpacked/pom.xml
*  dependency-sets/massembly-201/pom.xml
*  dependency-sets/using-moduleSet-implied-depSet/pom.xml
*  dependency-sets/include-provided/pom.xml
*  dependency-sets/dep-with-transitive-filter/pom.xml
*  dependency-sets/outputFileNameMappingWithUnpack/pom.xml
*  dependency-sets/massembly-235/pom.xml
*  dependency-sets/dependencySet-matchScope/pom.xml
*  dependency-sets/dependencySet-unpackedSubsetsTwice/pom.xml
*  dependency-sets/massembly-232/pom.xml
*  dependency-sets/dependencySet-projectArtifactNotIncluded/pom.xml
*  dependency-sets/multiple-wildcard-includes/pom.xml
*  dependency-sets/dependencySet-withExecutedProject/pom.xml
*  dependency-sets/dependencySet-unpackedExcludingMetaInf/pom.xml
*  dependency-sets/including-sar-dependency/pom.xml
*  dependency-sets/massembly-345/pom.xml
*  dependency-sets/dependencySet-notUnpacked/pom.xml
*  dependency-sets/massembly-99/pom.xml
*  dependency-sets/including-pom-dependency/pom.xml
*  dependency-sets/include-project-attachments/pom.xml
*  basic-features/assemblyDescriptor-artifact/pom.xml
*  basic-features/descriptorDirectoryScan/pom.xml
*  basic-features/file-sameName/pom.xml
*  basic-features/outputFileNameMapping-withArtifactBaseVersion/pom.xml
*  basic-features/massembly-351-projectPrefixInterp/pom.xml
*  basic-features/outputFileNameMapping-simple/pom.xml
*  basic-features/file-copyIntoTopDir/pom.xml
*  basic-features/massembly-256-pomPropertiesInterp/pom.xml
*  file-sets/include-parent-dir/pom.xml
*  file-sets/excluding-svn-dirs/pom.xml
*  file-sets/default-excludes-unspecified/pom.xml
*  file-sets/filtered-multimodule/pom.xml
*  file-sets/filtered-module-sources/pom.xml
*  file-sets/multimodule-unix-lineEndings/pom.xml
*  file-sets/use-default-excludes/pom.xml
*  file-sets/dont-use-default-excludes/pom.xml
*  file-sets/include-base-directory/pom.xml
*  file-sets/default-directory-unspecified/pom.xml
*  file-sets/multimodule-win-lineEndings/pom.xml
*  filtering-feature/filtersDefinedInAssemblyPluginConfig/pom.xml
*  repositories/massembly-196/pom.xml
*  repositories/basic-repository/pom.xml
*  mojo-configuration/massembly-291/pom.xml
*  mojo-configuration/manifest-with-customEntry/pom.xml
*  mojo-configuration/manifest-with-mainClass/pom.xml
*  mojo-configuration/massembly-301/pom.xml
*  mojo-configuration/no-appendAssemblyId-no-classifier/pom.xml
*  mojo-configuration/ignoreDirFormatExtensions/pom.xml
*  bugs/massembly-190/pom.xml
*  bugs/massembly-285/pom.xml
*  bugs/massembly-306/pom.xml

[HUDSON] Archiving http://ci.sonatype.org/job/plugins-IT-with-maven-2.0.x/org.apache.maven.plugins$maven-assembly-plugin/ws/pom.xml
 to /home/j2ee-hudson/.hudson/jobs/plugins-IT-with-maven-2.0.x/modules/org.apache.maven.plugins$maven-assembly-plugin/builds/2008-11-02_00-09-52/archive/org.apache.maven.plugins/maven-assembly-plugin/2.2-beta-3-SNAPSHOT/pom.xml
[HUDSON] Archiving http://ci.sonatype.org/job/plugins-IT-with-maven-2.0.x/org.apache.maven.plugins$maven-assembly-plugin/ws/target/maven-assembly-plugin-2.2-beta-3-SNAPSHOT.jar
 to /home/j2ee-hudson/.hudson/jobs/plugins-IT-with-maven-2.0.x/modules/org.apache.maven.plugins$maven-assembly-plugin/builds/2008-11-02_00-09-52/archive/org.apache.maven.plugins/maven-assembly-plugin/2.2-beta-3-SNAPSHOT/maven-assembly-plugin-2.2-beta-3-SNAPSHOT.jar


Mime
View raw message