maven-notifications mailing list archives: October 2008

Site index · List index
Message list1 · 2 · 3 · 4 · 5 · 6 · 7 · 8 · 9 · 10 · Next »Thread · Author · Date
[continuum] BUILD FAILURE: Maven 2.0.x Branch - Integration Test Executor - default maven2 buildDefinition
Contin...@vmbuild.apache.org   [continuum] BUILD FAILURE: Maven 2.0.x Branch - Integration Test Executor - default maven2 buildDefinition Wed, 01 Oct, 00:26
Contin...@vmbuild.apache.org   [continuum] BUILD FAILURE: Maven 2.0.x Branch - Integration Test Executor - default maven2 buildDefinition Wed, 01 Oct, 04:31
Contin...@vmbuild.apache.org   [continuum] BUILD FAILURE: Maven 2.0.x Branch - Integration Test Executor - default maven2 buildDefinition Wed, 01 Oct, 05:53
Contin...@vmbuild.apache.org   [continuum] BUILD FAILURE: Maven 2.0.x Branch - Integration Test Executor - default maven2 buildDefinition Wed, 01 Oct, 23:31
Contin...@vmbuild.apache.org   [continuum] BUILD FAILURE: Maven 2.0.x Branch - Integration Test Executor - default maven2 buildDefinition Fri, 03 Oct, 05:48
Contin...@vmbuild.apache.org   [continuum] BUILD FAILURE: Maven 2.0.x Branch - Integration Test Executor - default maven2 buildDefinition Fri, 03 Oct, 21:43
Contin...@vmbuild.apache.org   [continuum] BUILD FAILURE: Maven 2.0.x Branch - Integration Test Executor - default maven2 buildDefinition Sat, 04 Oct, 18:45
Contin...@vmbuild.apache.org   [continuum] BUILD FAILURE: Maven 2.0.x Branch - Integration Test Executor - default maven2 buildDefinition Sat, 04 Oct, 19:52
Contin...@vmbuild.apache.org   [continuum] BUILD FAILURE: Maven 2.0.x Branch - Integration Test Executor - default maven2 buildDefinition Sat, 04 Oct, 21:42
Contin...@vmbuild.apache.org   [continuum] BUILD FAILURE: Maven 2.0.x Branch - Integration Test Executor - default maven2 buildDefinition Tue, 07 Oct, 14:42
Contin...@vmbuild.apache.org   [continuum] BUILD FAILURE: Maven 2.0.x Branch - Integration Test Executor - default maven2 buildDefinition Tue, 07 Oct, 18:47
Contin...@vmbuild.apache.org   [continuum] BUILD FAILURE: Maven 2.0.x Branch - Integration Test Executor - default maven2 buildDefinition Tue, 07 Oct, 20:10
Contin...@vmbuild.apache.org   [continuum] BUILD FAILURE: Maven 2.0.x Branch - Integration Test Executor - default maven2 buildDefinition Tue, 07 Oct, 23:42
Contin...@vmbuild.apache.org   [continuum] BUILD FAILURE: Maven 2.0.x Branch - Integration Test Executor - default maven2 buildDefinition Fri, 10 Oct, 08:15
Contin...@vmbuild.apache.org   [continuum] BUILD FAILURE: Maven 2.0.x Branch - Integration Test Executor - default maven2 buildDefinition Fri, 10 Oct, 12:39
Contin...@vmbuild.apache.org   [continuum] BUILD FAILURE: Maven 2.0.x Branch - Integration Test Executor - default maven2 buildDefinition Fri, 10 Oct, 18:41
Contin...@vmbuild.apache.org   [continuum] BUILD FAILURE: Maven 2.0.x Branch - Integration Test Executor - default maven2 buildDefinition Fri, 10 Oct, 20:47
Contin...@vmbuild.apache.org   [continuum] BUILD FAILURE: Maven 2.0.x Branch - Integration Test Executor - default maven2 buildDefinition Fri, 10 Oct, 22:32
Contin...@vmbuild.apache.org   [continuum] BUILD FAILURE: Maven 2.0.x Branch - Integration Test Executor - default maven2 buildDefinition Sat, 11 Oct, 00:21
Contin...@vmbuild.apache.org   [continuum] BUILD FAILURE: Maven 2.0.x Branch - Integration Test Executor - default maven2 buildDefinition Sat, 11 Oct, 18:44
Contin...@vmbuild.apache.org   [continuum] BUILD FAILURE: Maven 2.0.x Branch - Integration Test Executor - default maven2 buildDefinition Sat, 11 Oct, 19:57
Contin...@vmbuild.apache.org   [continuum] BUILD FAILURE: Maven 2.0.x Branch - Integration Test Executor - default maven2 buildDefinition Sat, 11 Oct, 22:45
Contin...@vmbuild.apache.org   [continuum] BUILD FAILURE: Maven 2.0.x Branch - Integration Test Executor - default maven2 buildDefinition Sun, 12 Oct, 11:41
Contin...@vmbuild.apache.org   [continuum] BUILD FAILURE: Maven 2.0.x Branch - Integration Test Executor - default maven2 buildDefinition Sun, 12 Oct, 16:42
Contin...@vmbuild.apache.org   [continuum] BUILD FAILURE: Maven 2.0.x Branch - Integration Test Executor - default maven2 buildDefinition Sun, 12 Oct, 17:58
Contin...@vmbuild.apache.org   [continuum] BUILD FAILURE: Maven 2.0.x Branch - Integration Test Executor - default maven2 buildDefinition Sun, 12 Oct, 22:45
Contin...@vmbuild.apache.org   [continuum] BUILD FAILURE: Maven 2.0.x Branch - Integration Test Executor - default maven2 buildDefinition Tue, 14 Oct, 14:48
Contin...@vmbuild.apache.org   [continuum] BUILD FAILURE: Maven 2.0.x Branch - Integration Test Executor - default maven2 buildDefinition Tue, 14 Oct, 18:42
Contin...@vmbuild.apache.org   [continuum] BUILD FAILURE: Maven 2.0.x Branch - Integration Test Executor - default maven2 buildDefinition Tue, 14 Oct, 22:43
Contin...@vmbuild.apache.org   [continuum] BUILD FAILURE: Maven 2.0.x Branch - Integration Test Executor - default maven2 buildDefinition Wed, 15 Oct, 09:42
Contin...@vmbuild.apache.org   [continuum] BUILD FAILURE: Maven 2.0.x Branch - Integration Test Executor - default maven2 buildDefinition Wed, 15 Oct, 21:19
Contin...@vmbuild.apache.org   [continuum] BUILD FAILURE: Maven 2.0.x Branch - Integration Test Executor - default maven2 buildDefinition Wed, 15 Oct, 22:31
Contin...@vmbuild.apache.org   [continuum] BUILD FAILURE: Maven 2.0.x Branch - Integration Test Executor - default maven2 buildDefinition Thu, 16 Oct, 06:19
Contin...@vmbuild.apache.org   [continuum] BUILD FAILURE: Maven 2.0.x Branch - Integration Test Executor - default maven2 buildDefinition Thu, 16 Oct, 08:16
Contin...@vmbuild.apache.org   [continuum] BUILD FAILURE: Maven 2.0.x Branch - Integration Test Executor - default maven2 buildDefinition Thu, 16 Oct, 10:10
Contin...@vmbuild.apache.org   [continuum] BUILD FAILURE: Maven 2.0.x Branch - Integration Test Executor - default maven2 buildDefinition Thu, 16 Oct, 11:54
Contin...@vmbuild.apache.org   [continuum] BUILD FAILURE: Maven 2.0.x Branch - Integration Test Executor - default maven2 buildDefinition Thu, 16 Oct, 13:20
Contin...@vmbuild.apache.org   [continuum] BUILD FAILURE: Maven 2.0.x Branch - Integration Test Executor - default maven2 buildDefinition Thu, 16 Oct, 15:18
Contin...@vmbuild.apache.org   [continuum] BUILD FAILURE: Maven 2.0.x Branch - Integration Test Executor - default maven2 buildDefinition Thu, 16 Oct, 20:45
Contin...@vmbuild.apache.org   [continuum] BUILD FAILURE: Maven 2.0.x Branch - Integration Test Executor - default maven2 buildDefinition Fri, 17 Oct, 10:45
Contin...@vmbuild.apache.org   [continuum] BUILD FAILURE: Maven 2.0.x Branch - Integration Test Executor - default maven2 buildDefinition Tue, 21 Oct, 20:04
Contin...@vmbuild.apache.org   [continuum] BUILD FAILURE: Maven 2.0.x Branch - Integration Test Executor - default maven2 buildDefinition Tue, 21 Oct, 21:56
Contin...@vmbuild.apache.org   [continuum] BUILD FAILURE: Maven 2.0.x Branch - Integration Test Executor - default maven2 buildDefinition Tue, 21 Oct, 23:25
Contin...@vmbuild.apache.org   [continuum] BUILD FAILURE: Maven 2.0.x Branch - Integration Test Executor - default maven2 buildDefinition Wed, 22 Oct, 19:06
Contin...@vmbuild.apache.org   [continuum] BUILD FAILURE: Maven 2.0.x Branch - Integration Test Executor - default maven2 buildDefinition Fri, 24 Oct, 13:04
Contin...@vmbuild.apache.org   [continuum] BUILD FAILURE: Maven 2.0.x Branch - Integration Test Executor - default maven2 buildDefinition Fri, 24 Oct, 15:13
Contin...@vmbuild.apache.org   [continuum] BUILD FAILURE: Maven 2.0.x Branch - Integration Test Executor - default maven2 buildDefinition Fri, 24 Oct, 17:05
Contin...@vmbuild.apache.org   [continuum] BUILD FAILURE: Maven 2.0.x Branch - Integration Test Executor - default maven2 buildDefinition Fri, 24 Oct, 19:01
Contin...@vmbuild.apache.org   [continuum] BUILD FAILURE: Maven 2.0.x Branch - Integration Test Executor - default maven2 buildDefinition Sat, 25 Oct, 19:19
Contin...@vmbuild.apache.org   [continuum] BUILD FAILURE: Maven 2.0.x Branch - Integration Test Executor - default maven2 buildDefinition Sat, 25 Oct, 21:33
Contin...@vmbuild.apache.org   [continuum] BUILD FAILURE: Maven 2.0.x Branch - Integration Test Executor - default maven2 buildDefinition Sun, 26 Oct, 00:32
Contin...@vmbuild.apache.org   [continuum] BUILD FAILURE: Maven 2.0.x Branch - Integration Test Executor - default maven2 buildDefinition Sun, 26 Oct, 02:32
Contin...@vmbuild.apache.org   [continuum] BUILD FAILURE: Maven 2.0.x Branch - Integration Test Executor - default maven2 buildDefinition Sun, 26 Oct, 12:04
Contin...@vmbuild.apache.org   [continuum] BUILD FAILURE: Maven 2.0.x Branch - Integration Test Executor - default maven2 buildDefinition Sun, 26 Oct, 15:18
Contin...@vmbuild.apache.org   [continuum] BUILD FAILURE: Maven 2.0.x Branch - Integration Test Executor - default maven2 buildDefinition Sun, 26 Oct, 17:09
Contin...@vmbuild.apache.org   [continuum] BUILD FAILURE: Maven 2.0.x Branch - Integration Test Executor - default maven2 buildDefinition Sun, 26 Oct, 20:05
Contin...@vmbuild.apache.org   [continuum] BUILD FAILURE: Maven 2.0.x Branch - Integration Test Executor - default maven2 buildDefinition Sun, 26 Oct, 22:04
Contin...@vmbuild.apache.org   [continuum] BUILD FAILURE: Maven 2.0.x Branch - Integration Test Executor - default maven2 buildDefinition Tue, 28 Oct, 01:11
Contin...@vmbuild.apache.org   [continuum] BUILD FAILURE: Maven 2.0.x Branch - Integration Test Executor - default maven2 buildDefinition Tue, 28 Oct, 10:17
Contin...@vmbuild.apache.org   [continuum] BUILD FAILURE: Maven 2.0.x Branch - Integration Test Executor - default maven2 buildDefinition Tue, 28 Oct, 11:41
Build failed in Hudson: mercury #89
Hudson   Build failed in Hudson: mercury #89 Wed, 01 Oct, 01:49
Hudson     Build failed in Hudson: mercury #90 Wed, 01 Oct, 17:48
Hudson       Build failed in Hudson: mercury #91 Wed, 01 Oct, 18:53
Hudson         Build failed in Hudson: mercury #92 Wed, 01 Oct, 19:17
Hudson           Build failed in Hudson: mercury #93 Wed, 01 Oct, 19:59
Hudson             Build failed in Hudson: mercury #94 Wed, 01 Oct, 21:58
Hudson               Hudson build is back to normal: mercury #95 Wed, 01 Oct, 23:03
Contin...@vmbuild.apache.org [continuum] BUILD FAILURE: NMaven - Apache NMaven: maven-dotnet-parent - default maven2 buildDefinition Wed, 01 Oct, 03:48
Contin...@vmbuild.apache.org [continuum] BUILD FAILURE: NMaven - Apache NMaven: core-integration-tests - default maven2 buildDefinition Wed, 01 Oct, 03:48
Contin...@vmbuild.apache.org [continuum] BUILD FAILURE: NMaven - Apache NMaven: dotnet-archetypes - default maven2 buildDefinition Wed, 01 Oct, 03:49
Contin...@vmbuild.apache.org [continuum] BUILD FAILURE: NMaven - Apache NMaven: maven-archetype-dotnet-class-library - default maven2 buildDefinition Wed, 01 Oct, 03:49
Contin...@vmbuild.apache.org [continuum] BUILD FAILURE: NMaven - Apache NMaven: maven-archetype-dotnet-console-application - default maven2 buildDefinition Wed, 01 Oct, 03:50
[continuum] BUILD SUCCESSFUL: NMaven - Apache NMaven: maven-dotnet-parent - default maven2 buildDefinition
Contin...@vmbuild.apache.org   [continuum] BUILD SUCCESSFUL: NMaven - Apache NMaven: maven-dotnet-parent - default maven2 buildDefinition Wed, 01 Oct, 03:51
Contin...@vmbuild.apache.org   [continuum] BUILD SUCCESSFUL: NMaven - Apache NMaven: maven-dotnet-parent - default maven2 buildDefinition Fri, 03 Oct, 01:53
[continuum] BUILD SUCCESSFUL: NMaven - Apache NMaven: core-integration-tests - default maven2 buildDefinition
Contin...@vmbuild.apache.org   [continuum] BUILD SUCCESSFUL: NMaven - Apache NMaven: core-integration-tests - default maven2 buildDefinition Wed, 01 Oct, 03:53
Contin...@vmbuild.apache.org   [continuum] BUILD SUCCESSFUL: NMaven - Apache NMaven: core-integration-tests - default maven2 buildDefinition Fri, 03 Oct, 01:42
[continuum] BUILD SUCCESSFUL: NMaven - Apache NMaven: dotnet-archetypes - default maven2 buildDefinition
Contin...@vmbuild.apache.org   [continuum] BUILD SUCCESSFUL: NMaven - Apache NMaven: dotnet-archetypes - default maven2 buildDefinition Wed, 01 Oct, 03:53
Contin...@vmbuild.apache.org   [continuum] BUILD SUCCESSFUL: NMaven - Apache NMaven: dotnet-archetypes - default maven2 buildDefinition Fri, 03 Oct, 01:42
[continuum] BUILD SUCCESSFUL: NMaven - Apache NMaven: maven-archetype-dotnet-class-library - default maven2 buildDefinition
Contin...@vmbuild.apache.org   [continuum] BUILD SUCCESSFUL: NMaven - Apache NMaven: maven-archetype-dotnet-class-library - default maven2 buildDefinition Wed, 01 Oct, 03:54
Contin...@vmbuild.apache.org   [continuum] BUILD SUCCESSFUL: NMaven - Apache NMaven: maven-archetype-dotnet-class-library - default maven2 buildDefinition Fri, 03 Oct, 01:43
[continuum] BUILD SUCCESSFUL: NMaven - Apache NMaven: maven-archetype-dotnet-console-application - default maven2 buildDefinition
Contin...@vmbuild.apache.org   [continuum] BUILD SUCCESSFUL: NMaven - Apache NMaven: maven-archetype-dotnet-console-application - default maven2 buildDefinition Wed, 01 Oct, 03:54
Contin...@vmbuild.apache.org   [continuum] BUILD SUCCESSFUL: NMaven - Apache NMaven: maven-archetype-dotnet-console-application - default maven2 buildDefinition Fri, 03 Oct, 01:43
[continuum] BUILD SUCCESSFUL: NMaven - Apache NMaven: maven-archetype-dotnet-windows-application - default maven2 buildDefinition
Contin...@vmbuild.apache.org   [continuum] BUILD SUCCESSFUL: NMaven - Apache NMaven: maven-archetype-dotnet-windows-application - default maven2 buildDefinition Wed, 01 Oct, 03:55
Contin...@vmbuild.apache.org   [continuum] BUILD SUCCESSFUL: NMaven - Apache NMaven: maven-archetype-dotnet-windows-application - default maven2 buildDefinition Fri, 03 Oct, 01:44
[continuum] BUILD SUCCESSFUL: NMaven - Apache NMaven: maven-archetype-dotnet-windows-control - default maven2 buildDefinition
Contin...@vmbuild.apache.org   [continuum] BUILD SUCCESSFUL: NMaven - Apache NMaven: maven-archetype-dotnet-windows-control - default maven2 buildDefinition Wed, 01 Oct, 03:55
Contin...@vmbuild.apache.org   [continuum] BUILD SUCCESSFUL: NMaven - Apache NMaven: maven-archetype-dotnet-windows-control - default maven2 buildDefinition Fri, 03 Oct, 01:44
[continuum] BUILD SUCCESSFUL: NMaven - Apache NMaven: maven-dotnet-components - default maven2 buildDefinition
Contin...@vmbuild.apache.org   [continuum] BUILD SUCCESSFUL: NMaven - Apache NMaven: maven-dotnet-components - default maven2 buildDefinition Wed, 01 Oct, 03:56
Contin...@vmbuild.apache.org   [continuum] BUILD SUCCESSFUL: NMaven - Apache NMaven: maven-dotnet-components - default maven2 buildDefinition Fri, 03 Oct, 01:46
[continuum] BUILD SUCCESSFUL: NMaven - Apache NMaven: maven-dotnet-core - default maven2 buildDefinition
Contin...@vmbuild.apache.org   [continuum] BUILD SUCCESSFUL: NMaven - Apache NMaven: maven-dotnet-core - default maven2 buildDefinition Wed, 01 Oct, 03:56
Contin...@vmbuild.apache.org   [continuum] BUILD SUCCESSFUL: NMaven - Apache NMaven: maven-dotnet-core - default maven2 buildDefinition Fri, 03 Oct, 01:47
[continuum] BUILD SUCCESSFUL: NMaven - Apache NMaven: maven-dotnet-assembler - default maven2 buildDefinition
Contin...@vmbuild.apache.org   [continuum] BUILD SUCCESSFUL: NMaven - Apache NMaven: maven-dotnet-assembler - default maven2 buildDefinition Wed, 01 Oct, 03:57
Contin...@vmbuild.apache.org   [continuum] BUILD SUCCESSFUL: NMaven - Apache NMaven: maven-dotnet-assembler - default maven2 buildDefinition Fri, 03 Oct, 01:45
[continuum] BUILD SUCCESSFUL: NMaven - Apache NMaven: maven-dotnet-compiler - default maven2 buildDefinition
Contin...@vmbuild.apache.org   [continuum] BUILD SUCCESSFUL: NMaven - Apache NMaven: maven-dotnet-compiler - default maven2 buildDefinition Wed, 01 Oct, 03:58
Contin...@vmbuild.apache.org   [continuum] BUILD SUCCESSFUL: NMaven - Apache NMaven: maven-dotnet-compiler - default maven2 buildDefinition Fri, 03 Oct, 01:45
[continuum] BUILD SUCCESSFUL: NMaven - Apache NMaven: maven-dotnet-extensions - default maven2 buildDefinition
Contin...@vmbuild.apache.org   [continuum] BUILD SUCCESSFUL: NMaven - Apache NMaven: maven-dotnet-extensions - default maven2 buildDefinition Wed, 01 Oct, 03:58
Contin...@vmbuild.apache.org   [continuum] BUILD SUCCESSFUL: NMaven - Apache NMaven: maven-dotnet-extensions - default maven2 buildDefinition Fri, 03 Oct, 01:52
[continuum] BUILD SUCCESSFUL: NMaven - Apache NMaven: maven-dotnet-toolchain - default maven2 buildDefinition
Contin...@vmbuild.apache.org   [continuum] BUILD SUCCESSFUL: NMaven - Apache NMaven: maven-dotnet-toolchain - default maven2 buildDefinition Wed, 01 Oct, 03:59
Contin...@vmbuild.apache.org   [continuum] BUILD SUCCESSFUL: NMaven - Apache NMaven: maven-dotnet-toolchain - default maven2 buildDefinition Fri, 03 Oct, 01:55
[continuum] BUILD SUCCESSFUL: NMaven - Apache NMaven: maven-dotnet-plugins - default maven2 buildDefinition
Contin...@vmbuild.apache.org   [continuum] BUILD SUCCESSFUL: NMaven - Apache NMaven: maven-dotnet-plugins - default maven2 buildDefinition Wed, 01 Oct, 03:59
Contin...@vmbuild.apache.org   [continuum] BUILD SUCCESSFUL: NMaven - Apache NMaven: maven-dotnet-plugins - default maven2 buildDefinition Fri, 03 Oct, 01:54
[continuum] BUILD SUCCESSFUL: NMaven - Apache NMaven: maven-dotnet-compiler-plugin - default maven2 buildDefinition
Contin...@vmbuild.apache.org   [continuum] BUILD SUCCESSFUL: NMaven - Apache NMaven: maven-dotnet-compiler-plugin - default maven2 buildDefinition Wed, 01 Oct, 04:00
Contin...@vmbuild.apache.org   [continuum] BUILD SUCCESSFUL: NMaven - Apache NMaven: maven-dotnet-compiler-plugin - default maven2 buildDefinition Fri, 03 Oct, 01:46
[continuum] BUILD SUCCESSFUL: NMaven - Apache NMaven: maven-dotnet-test-plugin - default maven2 buildDefinition
Contin...@vmbuild.apache.org   [continuum] BUILD SUCCESSFUL: NMaven - Apache NMaven: maven-dotnet-test-plugin - default maven2 buildDefinition Wed, 01 Oct, 04:00
Contin...@vmbuild.apache.org   [continuum] BUILD SUCCESSFUL: NMaven - Apache NMaven: maven-dotnet-test-plugin - default maven2 buildDefinition Fri, 03 Oct, 01:54
[continuum] BUILD ERROR: NMaven - Apache NMaven: maven-dotnet-core-it-runner - default maven2 buildDefinition
Contin...@vmbuild.apache.org   [continuum] BUILD ERROR: NMaven - Apache NMaven: maven-dotnet-core-it-runner - default maven2 buildDefinition Wed, 01 Oct, 04:01
Contin...@vmbuild.apache.org   [continuum] BUILD ERROR: NMaven - Apache NMaven: maven-dotnet-core-it-runner - default maven2 buildDefinition Thu, 02 Oct, 23:04
[continuum] BUILD SUCCESSFUL: NMaven - Apache NMaven: maven-dotnet-plugin-api - default maven2 buildDefinition
Contin...@vmbuild.apache.org   [continuum] BUILD SUCCESSFUL: NMaven - Apache NMaven: maven-dotnet-plugin-api - default maven2 buildDefinition Wed, 01 Oct, 04:01
Contin...@vmbuild.apache.org   [continuum] BUILD SUCCESSFUL: NMaven - Apache NMaven: maven-dotnet-plugin-api - default maven2 buildDefinition Fri, 03 Oct, 01:53
[continuum] BUILD SUCCESSFUL: NMaven - Apache NMaven: maven-dotnet-wix-plugin - default maven2 buildDefinition
Contin...@vmbuild.apache.org   [continuum] BUILD SUCCESSFUL: NMaven - Apache NMaven: maven-dotnet-wix-plugin - default maven2 buildDefinition Wed, 01 Oct, 04:02
Contin...@vmbuild.apache.org   [continuum] BUILD SUCCESSFUL: NMaven - Apache NMaven: maven-dotnet-wix-plugin - default maven2 buildDefinition Fri, 03 Oct, 01:56
[continuum] BUILD SUCCESSFUL: Maven Integration Testing - Maven Integration Test Plugin :: Dependency Resolution - default maven2 buildDefinition
Contin...@vmbuild.apache.org   [continuum] BUILD SUCCESSFUL: Maven Integration Testing - Maven Integration Test Plugin :: Dependency Resolution - default maven2 buildDefinition Wed, 01 Oct, 04:02
Contin...@vmbuild.apache.org   [continuum] BUILD SUCCESSFUL: Maven Integration Testing - Maven Integration Test Plugin :: Dependency Resolution - default maven2 buildDefinition Fri, 10 Oct, 08:34
[continuum] BUILD SUCCESSFUL: NMaven - Apache NMaven: maven-dotnet-core-it-runner - default maven2 buildDefinition
Contin...@vmbuild.apache.org   [continuum] BUILD SUCCESSFUL: NMaven - Apache NMaven: maven-dotnet-core-it-runner - default maven2 buildDefinition Wed, 01 Oct, 04:31
Contin...@vmbuild.apache.org   [continuum] BUILD SUCCESSFUL: NMaven - Apache NMaven: maven-dotnet-core-it-runner - default maven2 buildDefinition Wed, 01 Oct, 06:58
[continuum] BUILD FAILURE: NMaven - Apache NMaven: maven-dotnet-core-it-runner - default maven2 buildDefinition
Contin...@vmbuild.apache.org   [continuum] BUILD FAILURE: NMaven - Apache NMaven: maven-dotnet-core-it-runner - default maven2 buildDefinition Wed, 01 Oct, 04:48
Contin...@vmbuild.apache.org   [continuum] BUILD FAILURE: NMaven - Apache NMaven: maven-dotnet-core-it-runner - default maven2 buildDefinition Wed, 01 Oct, 06:28
Contin...@vmbuild.apache.org   [continuum] BUILD FAILURE: NMaven - Apache NMaven: maven-dotnet-core-it-runner - default maven2 buildDefinition Wed, 01 Oct, 06:35
Contin...@vmbuild.apache.org   [continuum] BUILD FAILURE: NMaven - Apache NMaven: maven-dotnet-core-it-runner - default maven2 buildDefinition Wed, 01 Oct, 06:46
Contin...@vmbuild.apache.org   [continuum] BUILD FAILURE: NMaven - Apache NMaven: maven-dotnet-core-it-runner - default maven2 buildDefinition Wed, 01 Oct, 15:21
Contin...@vmbuild.apache.org   [continuum] BUILD FAILURE: NMaven - Apache NMaven: maven-dotnet-core-it-runner - default maven2 buildDefinition Fri, 03 Oct, 01:52
Contin...@vmbuild.apache.org   [continuum] BUILD FAILURE: NMaven - Apache NMaven: maven-dotnet-core-it-runner - default maven2 buildDefinition Fri, 03 Oct, 04:00
Contin...@vmbuild.apache.org   [continuum] BUILD FAILURE: NMaven - Apache NMaven: maven-dotnet-core-it-runner - default maven2 buildDefinition Fri, 03 Oct, 06:43
Contin...@vmbuild.apache.org   [continuum] BUILD FAILURE: NMaven - Apache NMaven: maven-dotnet-core-it-runner - default maven2 buildDefinition Fri, 03 Oct, 08:16
Hudson build is still unstable: maven-shared » Maven Doxia Integration Tools #523
Hudson   Hudson build is still unstable: maven-shared » Maven Doxia Integration Tools #523 Wed, 01 Oct, 05:48
Hudson     Hudson build is still unstable: maven-shared » Maven Doxia Integration Tools #524 Wed, 01 Oct, 13:33
Hudson       Hudson build is still unstable: maven-shared » Maven Doxia Integration Tools #525 Wed, 01 Oct, 14:31
Hudson         Hudson build is still unstable: maven-shared » Maven Doxia Integration Tools #526 Thu, 02 Oct, 01:35
Hudson           Hudson build is back to stable: maven-shared » Maven Doxia Integration Tools #527 Thu, 02 Oct, 13:41
Hudson build is still unstable: maven-shared » Maven Repository Builder #523
Hudson   Hudson build is still unstable: maven-shared » Maven Repository Builder #523 Wed, 01 Oct, 05:48
Hudson     Hudson build is still unstable: maven-shared » Maven Repository Builder #524 Wed, 01 Oct, 13:33
Hudson       Hudson build is still unstable: maven-shared » Maven Repository Builder #525 Wed, 01 Oct, 14:31
Hudson         Hudson build is still unstable: maven-shared » Maven Repository Builder #526 Thu, 02 Oct, 01:35
Hudson           Hudson build is back to stable: maven-shared » Maven Repository Builder #527 Thu, 02 Oct, 13:41
Hudson build is back to normal: plugins-IT-with-maven-2.0.x » Maven WAR Plugin #487
Hudson   Hudson build is back to normal: plugins-IT-with-maven-2.0.x » Maven WAR Plugin #487 Wed, 01 Oct, 07:39
Build failed in Hudson: plugins-IT-with-maven-2.0.x » Maven Site Plugin #487
Hudson   Build failed in Hudson: plugins-IT-with-maven-2.0.x » Maven Site Plugin #487 Wed, 01 Oct, 07:39
Hudson     Hudson build is back to normal: plugins-IT-with-maven-2.0.x » Maven Site Plugin #488 Wed, 01 Oct, 15:56
Build failed in Hudson: Maven-2.1.x-with-bootstrap #84
Apache Hudson Server   Build failed in Hudson: Maven-2.1.x-with-bootstrap #84 Wed, 01 Oct, 13:40
Apache Hudson Server     Build failed in Hudson: Maven-2.1.x-with-bootstrap #85 Wed, 01 Oct, 16:21
Apache Hudson Server       Build failed in Hudson: Maven-2.1.x-with-bootstrap #86 Wed, 01 Oct, 17:21
Apache Hudson Server         Build failed in Hudson: Maven-2.1.x-with-bootstrap #87 Wed, 01 Oct, 19:20
Apache Hudson Server           Build failed in Hudson: Maven-2.1.x-with-bootstrap #88 Thu, 02 Oct, 02:21
Apache Hudson Server             Build failed in Hudson: Maven-2.1.x-with-bootstrap #89 Thu, 02 Oct, 14:21
Apache Hudson Server               Build failed in Hudson: Maven-2.1.x-with-bootstrap #90 Thu, 02 Oct, 18:24
Apache Hudson Server                 Build failed in Hudson: Maven-2.1.x-with-bootstrap #91 Thu, 02 Oct, 20:25
Apache Hudson Server                   Build failed in Hudson: Maven-2.1.x-with-bootstrap #92 Fri, 03 Oct, 01:20
Apache Hudson Server                     Build failed in Hudson: Maven-2.1.x-with-bootstrap #93 Fri, 03 Oct, 23:20
Apache Hudson Server                       Build failed in Hudson: Maven-2.1.x-with-bootstrap #94 Sat, 04 Oct, 17:20
Apache Hudson Server                         Build failed in Hudson: Maven-2.1.x-with-bootstrap #95 Sat, 04 Oct, 21:14
Apache Hudson Server                           Build failed in Hudson: Maven-2.1.x-with-bootstrap #96 Tue, 14 Oct, 10:31
Apache Hudson Server                             Build failed in Hudson: Maven-2.1.x-with-bootstrap #97 Wed, 15 Oct, 07:43
Apache Hudson Server                               Build failed in Hudson: Maven-2.1.x-with-bootstrap #98 Thu, 16 Oct, 08:20
Apache Hudson Server                                 Build failed in Hudson: Maven-2.1.x-with-bootstrap #99 Thu, 16 Oct, 09:52
Apache Hudson Server                                   Build failed in Hudson: Maven-2.1.x-with-bootstrap #100 Mon, 20 Oct, 07:17
Apache Hudson Server                                     Build failed in Hudson: Maven-2.1.x-with-bootstrap #101 Mon, 20 Oct, 08:20
Apache Hudson Server                                       Build failed in Hudson: Maven-2.1.x-with-bootstrap #102 Mon, 20 Oct, 11:45
Apache Hudson Server                                         Build failed in Hudson: Maven-2.1.x-with-bootstrap #103 Mon, 20 Oct, 21:57
Apache Hudson Server                                           Build failed in Hudson: Maven-2.1.x-with-bootstrap #104 Thu, 30 Oct, 22:17
Hudson Build failed in Hudson: plugins-IT-with-maven-2.0.x » Maven Resources Plugin #488 Wed, 01 Oct, 15:56
Hudson   Build failed in Hudson: plugins-IT-with-maven-2.0.x » Maven Resources Plugin #489 Thu, 02 Oct, 05:43
Hudson     Hudson build is back to normal: plugins-IT-with-maven-2.0.x » Maven Resources Plugin #490 Thu, 02 Oct, 14:27
Hudson Build failed in Hudson: mercury #96 Wed, 01 Oct, 23:14
Hudson   Build failed in Hudson: mercury #97 Thu, 02 Oct, 00:00
Hudson     Hudson build is back to normal: mercury #98 Thu, 02 Oct, 00:15
Hudson Hudson build is back to stable: plugins-IT-with-maven-2.0.x » Maven Javadoc Plugin #489 Thu, 02 Oct, 05:43
Hudson Build failed in Hudson: plugins-IT-with-maven-2.0.x » Maven Site Plugin #489 Thu, 02 Oct, 05:43
Hudson   Hudson build is back to normal: plugins-IT-with-maven-2.0.x » Maven Site Plugin #490 Thu, 02 Oct, 14:27
Hudson Hudson build is back to stable: plugins-CI-with-maven-2.0.x » Maven Javadoc Plugin #516 Thu, 02 Oct, 13:47
Hudson Build failed in Hudson: plugins-IT-with-maven-2.0.x » Maven Assembly Plugin #490 Thu, 02 Oct, 14:27
Hudson   Build failed in Hudson: plugins-IT-with-maven-2.0.x » Maven Assembly Plugin #491 Thu, 02 Oct, 15:10
Hudson     Build failed in Hudson: plugins-IT-with-maven-2.0.x » Maven Assembly Plugin #492 Thu, 02 Oct, 16:08
Hudson       Build failed in Hudson: plugins-IT-with-maven-2.0.x » Maven Assembly Plugin #493 Thu, 02 Oct, 16:55
Hudson         Build failed in Hudson: plugins-IT-with-maven-2.0.x » Maven Assembly Plugin #494 Thu, 02 Oct, 17:51
Hudson           Build failed in Hudson: plugins-IT-with-maven-2.0.x » Maven Assembly Plugin #495 Thu, 02 Oct, 18:43
Hudson             Build failed in Hudson: plugins-IT-with-maven-2.0.x » Maven Assembly Plugin #496 Thu, 02 Oct, 19:28
Hudson               Build failed in Hudson: plugins-IT-with-maven-2.0.x » Maven Assembly Plugin #497 Thu, 02 Oct, 20:22
Hudson                 Build failed in Hudson: plugins-IT-with-maven-2.0.x » Maven Assembly Plugin #498 Thu, 02 Oct, 21:18
Hudson                   Build failed in Hudson: plugins-IT-with-maven-2.0.x » Maven Assembly Plugin #499 Thu, 02 Oct, 22:17
Hudson                     Build failed in Hudson: plugins-IT-with-maven-2.0.x » Maven Assembly Plugin #500 Thu, 02 Oct, 23:28
Hudson                       Build failed in Hudson: plugins-IT-with-maven-2.0.x » Maven Assembly Plugin #502 Fri, 03 Oct, 02:43
Hudson                         Build failed in Hudson: plugins-IT-with-maven-2.0.x » Maven Assembly Plugin #503 Fri, 03 Oct, 03:28
Hudson                           Build failed in Hudson: plugins-IT-with-maven-2.0.x » Maven Assembly Plugin #504 Fri, 03 Oct, 04:19
Hudson                             Build failed in Hudson: plugins-IT-with-maven-2.0.x » Maven Assembly Plugin #505 Fri, 03 Oct, 05:06
Hudson                               Hudson build is back to normal: plugins-IT-with-maven-2.0.x » Maven Assembly Plugin #506 Fri, 03 Oct, 06:11
Message list1 · 2 · 3 · 4 · 5 · 6 · 7 · 8 · 9 · 10 · Next »Thread · Author · Date
Box list
Dec 2014398
Nov 2014618
Oct 2014426
Sep 2014304
Aug 2014246
Jul 2014317
Jun 2014341
May 2014161
Apr 2014146
Mar 2014336
Feb 2014308
Jan 2014189
Dec 2013319
Nov 2013274
Oct 2013167
Sep 2013486
Aug 2013263
Jul 2013726
Jun 2013722
May 2013378
Apr 2013313
Mar 2013467
Feb 2013520
Jan 20131437
Dec 20121778
Nov 2012775
Oct 20121224
Sep 2012791
Aug 2012362
Jul 2012232
Jun 2012149
May 2012189
Apr 2012115
Mar 201257
Feb 2012155
Jan 2012170
Dec 2011244
Nov 2011187
Oct 2011139
Sep 2011190
Aug 2011276
Jul 201194
Jun 20114
Apr 201162
Mar 201176
Feb 201154
Jan 201185
Dec 201079
Nov 201061
Oct 201058
Sep 20101
Aug 201057
Jul 201037
Jun 201020
May 201075
Apr 201053
Mar 201012
Feb 201030
Jan 201071
Dec 2009104
Nov 200919
Oct 200931
Sep 2009193
Aug 2009268
Jul 2009193
Jun 2009147
May 200975
Apr 200979
Mar 2009134
Feb 2009657
Jan 200983
Dec 2008349
Nov 2008288
Oct 2008986
Sep 2008842
Aug 2008707
Jul 2008887
Jun 2008167
May 200821
Apr 2008231
Mar 2008438
Feb 2008317
Jan 2008205
Dec 2007185
Nov 2007532
Oct 2007439
Sep 2007699
Aug 20071294
Jul 2007351
Jun 20072211
May 2007273
Apr 2007262
Mar 2007534
Feb 20071648
Jan 20072359
Dec 2006575
Nov 2006357
Oct 2006642
Sep 2006660
Aug 20061662
Jul 20061320
Jun 2006473
May 20064700
Apr 20061113
Mar 20061048