maven-notifications mailing list archives: October 2008

Site index · List index
Message list1 · 2 · 3 · 4 · 5 · 6 · 7 · 8 · 9 · 10 · Next »Thread · Author · Date
Contin...@vmbuild.apache.org [continuum] BUILD FAILURE: Maven 2.0.x Branch - Integration Test Executor - default maven2 buildDefinition Wed, 01 Oct, 00:26
Hudson Build failed in Hudson: mercury #89 Wed, 01 Oct, 01:49
Contin...@vmbuild.apache.org [continuum] BUILD FAILURE: NMaven - Apache NMaven: maven-dotnet-parent - default maven2 buildDefinition Wed, 01 Oct, 03:48
Contin...@vmbuild.apache.org [continuum] BUILD FAILURE: NMaven - Apache NMaven: core-integration-tests - default maven2 buildDefinition Wed, 01 Oct, 03:48
Contin...@vmbuild.apache.org [continuum] BUILD FAILURE: NMaven - Apache NMaven: dotnet-archetypes - default maven2 buildDefinition Wed, 01 Oct, 03:49
Contin...@vmbuild.apache.org [continuum] BUILD FAILURE: NMaven - Apache NMaven: maven-archetype-dotnet-class-library - default maven2 buildDefinition Wed, 01 Oct, 03:49
Contin...@vmbuild.apache.org [continuum] BUILD FAILURE: NMaven - Apache NMaven: maven-archetype-dotnet-console-application - default maven2 buildDefinition Wed, 01 Oct, 03:50
Contin...@vmbuild.apache.org [continuum] BUILD SUCCESSFUL: NMaven - Apache NMaven: maven-dotnet-parent - default maven2 buildDefinition Wed, 01 Oct, 03:51
Contin...@vmbuild.apache.org [continuum] BUILD SUCCESSFUL: NMaven - Apache NMaven: core-integration-tests - default maven2 buildDefinition Wed, 01 Oct, 03:53
Contin...@vmbuild.apache.org [continuum] BUILD SUCCESSFUL: NMaven - Apache NMaven: dotnet-archetypes - default maven2 buildDefinition Wed, 01 Oct, 03:53
Contin...@vmbuild.apache.org [continuum] BUILD SUCCESSFUL: NMaven - Apache NMaven: maven-archetype-dotnet-class-library - default maven2 buildDefinition Wed, 01 Oct, 03:54
Contin...@vmbuild.apache.org [continuum] BUILD SUCCESSFUL: NMaven - Apache NMaven: maven-archetype-dotnet-console-application - default maven2 buildDefinition Wed, 01 Oct, 03:54
Contin...@vmbuild.apache.org [continuum] BUILD SUCCESSFUL: NMaven - Apache NMaven: maven-archetype-dotnet-windows-application - default maven2 buildDefinition Wed, 01 Oct, 03:55
Contin...@vmbuild.apache.org [continuum] BUILD SUCCESSFUL: NMaven - Apache NMaven: maven-archetype-dotnet-windows-control - default maven2 buildDefinition Wed, 01 Oct, 03:55
Contin...@vmbuild.apache.org [continuum] BUILD SUCCESSFUL: NMaven - Apache NMaven: maven-dotnet-components - default maven2 buildDefinition Wed, 01 Oct, 03:56
Contin...@vmbuild.apache.org [continuum] BUILD SUCCESSFUL: NMaven - Apache NMaven: maven-dotnet-core - default maven2 buildDefinition Wed, 01 Oct, 03:56
Contin...@vmbuild.apache.org [continuum] BUILD SUCCESSFUL: NMaven - Apache NMaven: maven-dotnet-assembler - default maven2 buildDefinition Wed, 01 Oct, 03:57
Contin...@vmbuild.apache.org [continuum] BUILD SUCCESSFUL: NMaven - Apache NMaven: maven-dotnet-compiler - default maven2 buildDefinition Wed, 01 Oct, 03:58
Contin...@vmbuild.apache.org [continuum] BUILD SUCCESSFUL: NMaven - Apache NMaven: maven-dotnet-extensions - default maven2 buildDefinition Wed, 01 Oct, 03:58
Contin...@vmbuild.apache.org [continuum] BUILD SUCCESSFUL: NMaven - Apache NMaven: maven-dotnet-toolchain - default maven2 buildDefinition Wed, 01 Oct, 03:59
Contin...@vmbuild.apache.org [continuum] BUILD SUCCESSFUL: NMaven - Apache NMaven: maven-dotnet-plugins - default maven2 buildDefinition Wed, 01 Oct, 03:59
Contin...@vmbuild.apache.org [continuum] BUILD SUCCESSFUL: NMaven - Apache NMaven: maven-dotnet-compiler-plugin - default maven2 buildDefinition Wed, 01 Oct, 04:00
Contin...@vmbuild.apache.org [continuum] BUILD SUCCESSFUL: NMaven - Apache NMaven: maven-dotnet-test-plugin - default maven2 buildDefinition Wed, 01 Oct, 04:00
Contin...@vmbuild.apache.org [continuum] BUILD ERROR: NMaven - Apache NMaven: maven-dotnet-core-it-runner - default maven2 buildDefinition Wed, 01 Oct, 04:01
Contin...@vmbuild.apache.org [continuum] BUILD SUCCESSFUL: NMaven - Apache NMaven: maven-dotnet-plugin-api - default maven2 buildDefinition Wed, 01 Oct, 04:01
Contin...@vmbuild.apache.org [continuum] BUILD SUCCESSFUL: NMaven - Apache NMaven: maven-dotnet-wix-plugin - default maven2 buildDefinition Wed, 01 Oct, 04:02
Contin...@vmbuild.apache.org [continuum] BUILD SUCCESSFUL: Maven Integration Testing - Maven Integration Test Plugin :: Dependency Resolution - default maven2 buildDefinition Wed, 01 Oct, 04:02
Contin...@vmbuild.apache.org [continuum] BUILD FAILURE: Maven 2.0.x Branch - Integration Test Executor - default maven2 buildDefinition Wed, 01 Oct, 04:31
Contin...@vmbuild.apache.org [continuum] BUILD SUCCESSFUL: NMaven - Apache NMaven: maven-dotnet-core-it-runner - default maven2 buildDefinition Wed, 01 Oct, 04:31
Contin...@vmbuild.apache.org [continuum] BUILD FAILURE: NMaven - Apache NMaven: maven-dotnet-core-it-runner - default maven2 buildDefinition Wed, 01 Oct, 04:48
Hudson Hudson build is still unstable: maven-shared » Maven Doxia Integration Tools #523 Wed, 01 Oct, 05:48
Hudson Hudson build is still unstable: maven-shared » Maven Repository Builder #523 Wed, 01 Oct, 05:48
Contin...@vmbuild.apache.org [continuum] BUILD FAILURE: Maven 2.0.x Branch - Integration Test Executor - default maven2 buildDefinition Wed, 01 Oct, 05:53
Contin...@vmbuild.apache.org [continuum] BUILD FAILURE: NMaven - Apache NMaven: maven-dotnet-core-it-runner - default maven2 buildDefinition Wed, 01 Oct, 06:28
Contin...@vmbuild.apache.org [continuum] BUILD FAILURE: NMaven - Apache NMaven: maven-dotnet-core-it-runner - default maven2 buildDefinition Wed, 01 Oct, 06:35
Contin...@vmbuild.apache.org [continuum] BUILD FAILURE: NMaven - Apache NMaven: maven-dotnet-core-it-runner - default maven2 buildDefinition Wed, 01 Oct, 06:46
Contin...@vmbuild.apache.org [continuum] BUILD SUCCESSFUL: NMaven - Apache NMaven: maven-dotnet-core-it-runner - default maven2 buildDefinition Wed, 01 Oct, 06:58
Hudson Build failed in Hudson: plugins-IT-with-maven-2.0.x » Maven Site Plugin #487 Wed, 01 Oct, 07:39
Hudson Hudson build is back to normal: plugins-IT-with-maven-2.0.x » Maven WAR Plugin #487 Wed, 01 Oct, 07:39
Hudson Hudson build is still unstable: maven-shared » Maven Repository Builder #524 Wed, 01 Oct, 13:33
Hudson Hudson build is still unstable: maven-shared » Maven Doxia Integration Tools #524 Wed, 01 Oct, 13:33
Apache Hudson Server Build failed in Hudson: Maven-2.1.x-with-bootstrap #84 Wed, 01 Oct, 13:40
Hudson Hudson build is still unstable: maven-shared » Maven Repository Builder #525 Wed, 01 Oct, 14:31
Hudson Hudson build is still unstable: maven-shared » Maven Doxia Integration Tools #525 Wed, 01 Oct, 14:31
Contin...@vmbuild.apache.org [continuum] BUILD FAILURE: NMaven - Apache NMaven: maven-dotnet-core-it-runner - default maven2 buildDefinition Wed, 01 Oct, 15:21
Hudson Build failed in Hudson: plugins-IT-with-maven-2.0.x » Maven Resources Plugin #488 Wed, 01 Oct, 15:56
Hudson Hudson build is back to normal: plugins-IT-with-maven-2.0.x » Maven Site Plugin #488 Wed, 01 Oct, 15:56
Apache Hudson Server Build failed in Hudson: Maven-2.1.x-with-bootstrap #85 Wed, 01 Oct, 16:21
Apache Hudson Server Build failed in Hudson: Maven-2.1.x-with-bootstrap #86 Wed, 01 Oct, 17:21
Hudson Build failed in Hudson: mercury #90 Wed, 01 Oct, 17:48
Hudson Build failed in Hudson: mercury #91 Wed, 01 Oct, 18:53
Hudson Build failed in Hudson: mercury #92 Wed, 01 Oct, 19:17
Apache Hudson Server Build failed in Hudson: Maven-2.1.x-with-bootstrap #87 Wed, 01 Oct, 19:20
Hudson Build failed in Hudson: mercury #93 Wed, 01 Oct, 19:59
Hudson Build failed in Hudson: mercury #94 Wed, 01 Oct, 21:58
Hudson Hudson build is back to normal: mercury #95 Wed, 01 Oct, 23:03
Hudson Build failed in Hudson: mercury #96 Wed, 01 Oct, 23:14
Contin...@vmbuild.apache.org [continuum] BUILD FAILURE: Maven 2.0.x Branch - Integration Test Executor - default maven2 buildDefinition Wed, 01 Oct, 23:31
Hudson Build failed in Hudson: mercury #97 Thu, 02 Oct, 00:00
Hudson Hudson build is back to normal: mercury #98 Thu, 02 Oct, 00:15
Hudson Hudson build is still unstable: maven-shared » Maven Doxia Integration Tools #526 Thu, 02 Oct, 01:35
Hudson Hudson build is still unstable: maven-shared » Maven Repository Builder #526 Thu, 02 Oct, 01:35
Apache Hudson Server Build failed in Hudson: Maven-2.1.x-with-bootstrap #88 Thu, 02 Oct, 02:21
Hudson Build failed in Hudson: plugins-IT-with-maven-2.0.x » Maven Site Plugin #489 Thu, 02 Oct, 05:43
Hudson Hudson build is back to stable: plugins-IT-with-maven-2.0.x » Maven Javadoc Plugin #489 Thu, 02 Oct, 05:43
Hudson Build failed in Hudson: plugins-IT-with-maven-2.0.x » Maven Resources Plugin #489 Thu, 02 Oct, 05:43
Hudson Hudson build is back to stable: maven-shared » Maven Repository Builder #527 Thu, 02 Oct, 13:41
Hudson Hudson build is back to stable: maven-shared » Maven Doxia Integration Tools #527 Thu, 02 Oct, 13:41
Hudson Hudson build is back to stable: plugins-CI-with-maven-2.0.x » Maven Javadoc Plugin #516 Thu, 02 Oct, 13:47
Apache Hudson Server Build failed in Hudson: Maven-2.1.x-with-bootstrap #89 Thu, 02 Oct, 14:21
Hudson Hudson build is back to normal: plugins-IT-with-maven-2.0.x » Maven Site Plugin #490 Thu, 02 Oct, 14:27
Hudson Build failed in Hudson: plugins-IT-with-maven-2.0.x » Maven Changes Report Plugin #490 Thu, 02 Oct, 14:27
Hudson Build failed in Hudson: plugins-IT-with-maven-2.0.x » Maven Assembly Plugin #490 Thu, 02 Oct, 14:27
Hudson Hudson build is back to normal: plugins-IT-with-maven-2.0.x » Maven Resources Plugin #490 Thu, 02 Oct, 14:27
Hudson Build failed in Hudson: plugins-IT-with-maven-2.0.x » Maven Assembly Plugin #491 Thu, 02 Oct, 15:10
Hudson Build failed in Hudson: plugins-IT-with-maven-2.0.x » Maven Changes Report Plugin #491 Thu, 02 Oct, 15:10
Hudson Build failed in Hudson: plugins-IT-with-maven-2.0.x » Maven Assembly Plugin #492 Thu, 02 Oct, 16:08
Hudson Build failed in Hudson: plugins-IT-with-maven-2.0.x » Maven Changes Report Plugin #492 Thu, 02 Oct, 16:08
Hudson Build failed in Hudson: plugins-IT-with-maven-2.0.x » Maven Assembly Plugin #493 Thu, 02 Oct, 16:55
Hudson Build failed in Hudson: plugins-IT-with-maven-2.0.x » Maven Changes Report Plugin #493 Thu, 02 Oct, 16:55
Hudson Build failed in Hudson: plugins-IT-with-maven-2.0.x » Maven Changes Report Plugin #494 Thu, 02 Oct, 17:51
Hudson Build failed in Hudson: plugins-IT-with-maven-2.0.x » Maven Assembly Plugin #494 Thu, 02 Oct, 17:51
Apache Hudson Server Build failed in Hudson: Maven-2.1.x-with-bootstrap #90 Thu, 02 Oct, 18:24
Hudson Build failed in Hudson: plugins-IT-with-maven-2.0.x » Maven Assembly Plugin #495 Thu, 02 Oct, 18:43
Hudson Build failed in Hudson: plugins-IT-with-maven-2.0.x » Maven Changes Report Plugin #495 Thu, 02 Oct, 18:43
Hudson Build failed in Hudson: plugins-IT-with-maven-2.0.x » Maven Changes Report Plugin #496 Thu, 02 Oct, 19:28
Hudson Build failed in Hudson: plugins-IT-with-maven-2.0.x » Maven Assembly Plugin #496 Thu, 02 Oct, 19:28
Hudson Build failed in Hudson: plugins-IT-with-maven-2.0.x » Maven Assembly Plugin #497 Thu, 02 Oct, 20:22
Hudson Build failed in Hudson: plugins-IT-with-maven-2.0.x » Maven Changes Report Plugin #497 Thu, 02 Oct, 20:22
Apache Hudson Server Build failed in Hudson: Maven-2.1.x-with-bootstrap #91 Thu, 02 Oct, 20:25
Hudson Build failed in Hudson: plugins-IT-with-maven-2.0.x » Maven Assembly Plugin #498 Thu, 02 Oct, 21:18
Hudson Build failed in Hudson: plugins-IT-with-maven-2.0.x » Maven Changes Report Plugin #498 Thu, 02 Oct, 21:18
Hudson Build failed in Hudson: plugins-IT-with-maven-2.0.x » Maven Changes Report Plugin #499 Thu, 02 Oct, 22:17
Hudson Build failed in Hudson: plugins-IT-with-maven-2.0.x » Maven Assembly Plugin #499 Thu, 02 Oct, 22:17
Contin...@vmbuild.apache.org [continuum] BUILD ERROR: NMaven - Apache NMaven: core-integration-tests - default maven2 buildDefinition Thu, 02 Oct, 23:02
Contin...@vmbuild.apache.org [continuum] BUILD ERROR: NMaven - Apache NMaven: dotnet-archetypes - default maven2 buildDefinition Thu, 02 Oct, 23:02
Contin...@vmbuild.apache.org [continuum] BUILD ERROR: NMaven - Apache NMaven: maven-archetype-dotnet-class-library - default maven2 buildDefinition Thu, 02 Oct, 23:02
Contin...@vmbuild.apache.org [continuum] BUILD ERROR: NMaven - Apache NMaven: maven-archetype-dotnet-console-application - default maven2 buildDefinition Thu, 02 Oct, 23:02
Contin...@vmbuild.apache.org [continuum] BUILD ERROR: NMaven - Apache NMaven: maven-archetype-dotnet-windows-application - default maven2 buildDefinition Thu, 02 Oct, 23:03
Contin...@vmbuild.apache.org [continuum] BUILD ERROR: NMaven - Apache NMaven: maven-archetype-dotnet-windows-control - default maven2 buildDefinition Thu, 02 Oct, 23:03
Message list1 · 2 · 3 · 4 · 5 · 6 · 7 · 8 · 9 · 10 · Next »Thread · Author · Date
Box list
Apr 201478
Mar 2014336
Feb 2014308
Jan 2014189
Dec 2013319
Nov 2013274
Oct 2013167
Sep 2013486
Aug 2013263
Jul 2013726
Jun 2013722
May 2013378
Apr 2013313
Mar 2013467
Feb 2013520
Jan 20131437
Dec 20121778
Nov 2012775
Oct 20121224
Sep 2012791
Aug 2012362
Jul 2012232
Jun 2012149
May 2012189
Apr 2012115
Mar 201257
Feb 2012155
Jan 2012170
Dec 2011244
Nov 2011187
Oct 2011139
Sep 2011190
Aug 2011276
Jul 201194
Jun 20114
Apr 201162
Mar 201176
Feb 201154
Jan 201185
Dec 201079
Nov 201061
Oct 201058
Sep 20101
Aug 201057
Jul 201037
Jun 201020
May 201075
Apr 201053
Mar 201012
Feb 201030
Jan 201071
Dec 2009104
Nov 200919
Oct 200931
Sep 2009193
Aug 2009268
Jul 2009193
Jun 2009147
May 200975
Apr 200979
Mar 2009134
Feb 2009657
Jan 200983
Dec 2008349
Nov 2008288
Oct 2008986
Sep 2008842
Aug 2008707
Jul 2008887
Jun 2008167
May 200821
Apr 2008231
Mar 2008438
Feb 2008317
Jan 2008205
Dec 2007185
Nov 2007532
Oct 2007439
Sep 2007699
Aug 20071294
Jul 2007351
Jun 20072211
May 2007273
Apr 2007262
Mar 2007534
Feb 20071648
Jan 20072359
Dec 2006575
Nov 2006357
Oct 2006642
Sep 2006660
Aug 20061662
Jul 20061320
Jun 2006473
May 20064700
Apr 20061113
Mar 20061048