maven-notifications mailing list archives

Site index · List index
Message view « Date » · « Thread »
Top « Date » · « Thread »
From Hudson <Hud...@sonatype.org>
Subject Build failed in Hudson: doxia-sitetools » Doxia Sitetools :: Site Renderer Component #3
Date Fri, 10 Oct 2008 13:47:07 GMT
See http://ci.sonatype.org/job/doxia-sitetools/org.apache.maven.doxia$doxia-site-renderer/3/changes

------------------------------------------
[INFO] ------------------------------------------------------------------------
[INFO] Building Doxia Sitetools :: Site Renderer Component
[INFO]    task-segment: [clean, deploy]
[INFO] ------------------------------------------------------------------------
[INFO] [clean:clean]
[INFO] Deleting directory http://ci.sonatype.org/job/doxia-sitetools/org.apache.maven.doxia$doxia-site-renderer/ws/target

Downloading: http://repository.sonatype.org:8081/content/groups/public/htmlunit/htmlunit/1.13/htmlunit-1.13.pom
9K downloaded
Downloading: http://repository.sonatype.org:8081/content/groups/public/jaxen/jaxen/1.1.1/jaxen-1.1.1.pom
7K downloaded
Downloading: http://repository.sonatype.org:8081/content/groups/public/dom4j/dom4j/1.6.1/dom4j-1.6.1.pom
6K downloaded
Downloading: http://repository.sonatype.org:8081/content/groups/public/xml-apis/xml-apis/1.3.02/xml-apis-1.3.02.pom
357b downloaded
Downloading: http://repository.sonatype.org:8081/content/groups/public/xerces/xercesImpl/2.6.2/xercesImpl-2.6.2.pom
150b downloaded
Downloading: http://repository.sonatype.org:8081/content/groups/public/xom/xom/1.0/xom-1.0.pom
1K downloaded
Downloading: http://repository.sonatype.org:8081/content/groups/public/xerces/xmlParserAPIs/2.6.2/xmlParserAPIs-2.6.2.pom
153b downloaded
Downloading: http://repository.sonatype.org:8081/content/groups/public/xalan/xalan/2.6.0/xalan-2.6.0.pom
491b downloaded
Downloading: http://repository.sonatype.org:8081/content/groups/public/com/ibm/icu/icu4j/2.6.1/icu4j-2.6.1.pom
150b downloaded
Downloading: http://repository.sonatype.org:8081/content/groups/public/commons-httpclient/commons-httpclient/3.0.1/commons-httpclient-3.0.1.pom
7K downloaded
Downloading: http://repository.sonatype.org:8081/content/groups/public/commons-codec/commons-codec/1.2/commons-codec-1.2.pom
3K downloaded
Downloading: http://repository.sonatype.org:8081/content/groups/public/rhino/js/1.6R5/js-1.6R5.pom
786b downloaded
Downloading: http://repository.sonatype.org:8081/content/groups/public/nekohtml/nekohtml/0.9.5/nekohtml-0.9.5.pom
346b downloaded
Downloading: http://repository.sonatype.org:8081/content/groups/public/xerces/xerces/2.4.0/xerces-2.4.0.pom
311b downloaded
Downloading: http://repository.sonatype.org:8081/content/groups/public/xerces/xercesImpl/2.4.0/xercesImpl-2.4.0.pom
150b downloaded
Downloading: http://repository.sonatype.org:8081/content/groups/public/commons-io/commons-io/1.3.1/commons-io-1.3.1.pom
6K downloaded
[INFO] snapshot org.apache.maven.doxia:doxia-module-docbook-simple:1.0-beta-1-SNAPSHOT: checking
for updates from central
[INFO] snapshot org.apache.maven.doxia:doxia-module-docbook-simple:1.0-beta-1-SNAPSHOT: checking
for updates from apache.snapshots
Downloading: http://repository.sonatype.org:8081/content/groups/public/org/apache/maven/doxia/doxia-module-docbook-simple/1.0-beta-1-SNAPSHOT/doxia-module-docbook-simple-1.0-beta-1-20081010.133615-52.pom
2K downloaded
Downloading: http://repository.sonatype.org:8081/content/groups/public/htmlunit/htmlunit/1.13/htmlunit-1.13.jar
439K downloaded
Downloading: http://repository.sonatype.org:8081/content/groups/public/jaxen/jaxen/1.1.1/jaxen-1.1.1.jar
221K downloaded
Downloading: http://repository.sonatype.org:8081/content/groups/public/dom4j/dom4j/1.6.1/dom4j-1.6.1.jar
306K downloaded
Downloading: http://repository.sonatype.org:8081/content/groups/public/xml-apis/xml-apis/1.3.02/xml-apis-1.3.02.jar
189K downloaded
Downloading: http://repository.sonatype.org:8081/content/groups/public/xerces/xercesImpl/2.6.2/xercesImpl-2.6.2.jar
986K downloaded
Downloading: http://repository.sonatype.org:8081/content/groups/public/xom/xom/1.0/xom-1.0.jar
106K downloaded
Downloading: http://repository.sonatype.org:8081/content/groups/public/xerces/xmlParserAPIs/2.6.2/xmlParserAPIs-2.6.2.jar
121K downloaded
Downloading: http://repository.sonatype.org:8081/content/groups/public/xalan/xalan/2.6.0/xalan-2.6.0.jar
3075K downloaded
Downloading: http://repository.sonatype.org:8081/content/groups/public/com/ibm/icu/icu4j/2.6.1/icu4j-2.6.1.jar
2393K downloaded
Downloading: http://repository.sonatype.org:8081/content/groups/public/commons-httpclient/commons-httpclient/3.0.1/commons-httpclient-3.0.1.jar
273K downloaded
Downloading: http://repository.sonatype.org:8081/content/groups/public/commons-logging/commons-logging/1.1/commons-logging-1.1.jar
51K downloaded
Downloading: http://repository.sonatype.org:8081/content/groups/public/rhino/js/1.6R5/js-1.6R5.jar
692K downloaded
Downloading: http://repository.sonatype.org:8081/content/groups/public/nekohtml/nekohtml/0.9.5/nekohtml-0.9.5.jar
103K downloaded
Downloading: http://repository.sonatype.org:8081/content/groups/public/logkit/logkit/1.0.1/logkit-1.0.1.jar
70K downloaded
Downloading: http://repository.sonatype.org:8081/content/groups/public/avalon-framework/avalon-framework/4.1.3/avalon-framework-4.1.3.jar
62K downloaded
Downloading: http://repository.sonatype.org:8081/content/groups/public/javax/servlet/servlet-api/2.3/servlet-api-2.3.jar
76K downloaded
Downloading: http://repository.sonatype.org:8081/content/groups/public/commons-io/commons-io/1.3.1/commons-io-1.3.1.jar
81K downloaded
Downloading: http://repository.sonatype.org:8081/content/groups/public/org/apache/maven/doxia/doxia-module-docbook-simple/1.0-beta-1-SNAPSHOT/doxia-module-docbook-simple-1.0-beta-1-20081010.133615-52.jar
45K downloaded
[INFO] [remote-resources:process {execution: default}]
[INFO] [resources:resources]
[INFO] Using encoding: 'UTF-8' to copy filtered resources.
[INFO] [compiler:compile]
[INFO] Compiling 8 source files to http://ci.sonatype.org/job/doxia-sitetools/org.apache.maven.doxia$doxia-site-renderer/ws/target/classes

[HUDSON] Archiving http://ci.sonatype.org/job/doxia-sitetools/org.apache.maven.doxia$doxia-site-renderer/ws/pom.xml
 to /home/hudson/.hudson/jobs/doxia-sitetools/modules/org.apache.maven.doxia$doxia-site-renderer/builds/2008-10-10_08-46-21/archive/org.apache.maven.doxia/doxia-site-renderer/1.0-beta-1-SNAPSHOT/pom.xml
[INFO] ------------------------------------------------------------------------
[ERROR] BUILD FAILURE
[INFO] ------------------------------------------------------------------------
[INFO] Compilation failure

http://ci.sonatype.org/job/doxia-sitetools/org.apache.maven.doxia$doxia-site-renderer/ws/src/main/java/org/apache/maven/doxia/siterenderer/Renderer.java
:[32,60] package org.apache.maven.doxia.module.xhtml.decoration.render does not exist

http://ci.sonatype.org/job/doxia-sitetools/org.apache.maven.doxia$doxia-site-renderer/ws/src/main/java/org/apache/maven/doxia/siterenderer/sink/SiteRendererSink.java
:[31,60] package org.apache.maven.doxia.module.xhtml.decoration.render does not exist

http://ci.sonatype.org/job/doxia-sitetools/org.apache.maven.doxia$doxia-site-renderer/ws/src/main/java/org/apache/maven/doxia/siterenderer/Renderer.java
:[134,40] cannot find symbol
symbol  : class RenderingContext
location: interface org.apache.maven.doxia.siterenderer.Renderer

http://ci.sonatype.org/job/doxia-sitetools/org.apache.maven.doxia$doxia-site-renderer/ws/src/main/java/org/apache/maven/doxia/siterenderer/sink/SiteRendererSink.java
:[59,29] cannot find symbol
symbol  : class RenderingContext
location: class org.apache.maven.doxia.siterenderer.sink.SiteRendererSink

http://ci.sonatype.org/job/doxia-sitetools/org.apache.maven.doxia$doxia-site-renderer/ws/src/main/java/org/apache/maven/doxia/siterenderer/sink/SiteRendererSink.java
:[68,51] cannot find symbol
symbol  : class RenderingContext
location: class org.apache.maven.doxia.siterenderer.sink.SiteRendererSink

http://ci.sonatype.org/job/doxia-sitetools/org.apache.maven.doxia$doxia-site-renderer/ws/src/main/java/org/apache/maven/doxia/siterenderer/DoxiaDocumentRenderer.java
:[26,60] package org.apache.maven.doxia.module.xhtml.decoration.render does not exist

http://ci.sonatype.org/job/doxia-sitetools/org.apache.maven.doxia$doxia-site-renderer/ws/src/main/java/org/apache/maven/doxia/siterenderer/DocumentRenderer.java
:[26,60] package org.apache.maven.doxia.module.xhtml.decoration.render does not exist

http://ci.sonatype.org/job/doxia-sitetools/org.apache.maven.doxia$doxia-site-renderer/ws/src/main/java/org/apache/maven/doxia/siterenderer/DoxiaDocumentRenderer.java
:[36,12] cannot find symbol
symbol  : class RenderingContext
location: class org.apache.maven.doxia.siterenderer.DoxiaDocumentRenderer

http://ci.sonatype.org/job/doxia-sitetools/org.apache.maven.doxia$doxia-site-renderer/ws/src/main/java/org/apache/maven/doxia/siterenderer/DoxiaDocumentRenderer.java
:[43,34] cannot find symbol
symbol  : class RenderingContext
location: class org.apache.maven.doxia.siterenderer.DoxiaDocumentRenderer

http://ci.sonatype.org/job/doxia-sitetools/org.apache.maven.doxia$doxia-site-renderer/ws/src/main/java/org/apache/maven/doxia/siterenderer/DoxiaDocumentRenderer.java
:[62,11] cannot find symbol
symbol  : class RenderingContext
location: class org.apache.maven.doxia.siterenderer.DoxiaDocumentRenderer

http://ci.sonatype.org/job/doxia-sitetools/org.apache.maven.doxia$doxia-site-renderer/ws/src/main/java/org/apache/maven/doxia/siterenderer/DocumentRenderer.java
:[59,4] cannot find symbol
symbol  : class RenderingContext
location: interface org.apache.maven.doxia.siterenderer.DocumentRenderer

http://ci.sonatype.org/job/doxia-sitetools/org.apache.maven.doxia$doxia-site-renderer/ws/src/main/java/org/apache/maven/doxia/siterenderer/DefaultSiteRenderer.java
:[58,60] package org.apache.maven.doxia.module.xhtml.decoration.render does not exist

http://ci.sonatype.org/job/doxia-sitetools/org.apache.maven.doxia$doxia-site-renderer/ws/src/main/java/org/apache/maven/doxia/siterenderer/DefaultSiteRenderer.java
:[322,32] cannot find symbol
symbol  : class RenderingContext
location: class org.apache.maven.doxia.siterenderer.DefaultSiteRenderer

http://ci.sonatype.org/job/doxia-sitetools/org.apache.maven.doxia$doxia-site-renderer/ws/src/main/java/org/apache/maven/doxia/siterenderer/DefaultSiteRenderer.java
:[220,16] cannot find symbol
symbol  : class RenderingContext
location: class org.apache.maven.doxia.siterenderer.DefaultSiteRenderer

http://ci.sonatype.org/job/doxia-sitetools/org.apache.maven.doxia$doxia-site-renderer/ws/src/main/java/org/apache/maven/doxia/siterenderer/DefaultSiteRenderer.java
:[220,47] cannot find symbol
symbol  : class RenderingContext
location: class org.apache.maven.doxia.siterenderer.DefaultSiteRenderer

http://ci.sonatype.org/job/doxia-sitetools/org.apache.maven.doxia$doxia-site-renderer/ws/src/main/java/org/apache/maven/doxia/siterenderer/DefaultSiteRenderer.java
:[234,20] cannot find symbol
symbol  : class RenderingContext
location: class org.apache.maven.doxia.siterenderer.DefaultSiteRenderer

http://ci.sonatype.org/job/doxia-sitetools/org.apache.maven.doxia$doxia-site-renderer/ws/src/main/java/org/apache/maven/doxia/siterenderer/DefaultSiteRenderer.java
:[250,24] cannot find symbol
symbol  : class RenderingContext
location: class org.apache.maven.doxia.siterenderer.DefaultSiteRenderer

http://ci.sonatype.org/job/doxia-sitetools/org.apache.maven.doxia$doxia-site-renderer/ws/src/main/java/org/apache/maven/doxia/siterenderer/DefaultSiteRenderer.java
:[280,12] cannot find symbol
symbol  : class RenderingContext
location: class org.apache.maven.doxia.siterenderer.DefaultSiteRenderer

http://ci.sonatype.org/job/doxia-sitetools/org.apache.maven.doxia$doxia-site-renderer/ws/src/main/java/org/apache/maven/doxia/siterenderer/DefaultSiteRenderer.java
:[412,8] cannot find symbol
symbol  : class RenderingContext
location: class org.apache.maven.doxia.siterenderer.DefaultSiteRenderer

http://ci.sonatype.org/job/doxia-sitetools/org.apache.maven.doxia$doxia-site-renderer/ws/src/main/java/org/apache/maven/doxia/siterenderer/DefaultSiteRenderer.java
:[412,48] cannot find symbol
symbol  : method getRenderingContext()
location: class org.apache.maven.doxia.siterenderer.sink.SiteRendererSink


[INFO] ------------------------------------------------------------------------
[INFO] Trace
org.apache.maven.BuildFailureException: Compilation failure
	at org.apache.maven.lifecycle.DefaultLifecycleExecutor.executeGoals(DefaultLifecycleExecutor.java:579)
	at org.apache.maven.lifecycle.DefaultLifecycleExecutor.executeGoalWithLifecycle(DefaultLifecycleExecutor.java:499)
	at org.apache.maven.lifecycle.DefaultLifecycleExecutor.executeGoal(DefaultLifecycleExecutor.java:478)
	at org.apache.maven.lifecycle.DefaultLifecycleExecutor.executeGoalAndHandleFailures(DefaultLifecycleExecutor.java:330)
	at org.apache.maven.lifecycle.DefaultLifecycleExecutor.executeTaskSegments(DefaultLifecycleExecutor.java:291)
	at org.apache.maven.lifecycle.DefaultLifecycleExecutor.execute(DefaultLifecycleExecutor.java:142)
	at org.apache.maven.lifecycle.LifecycleExecutorInterceptor.execute(LifecycleExecutorInterceptor.java:42)
	at org.apache.maven.DefaultMaven.doExecute(DefaultMaven.java:336)
	at org.apache.maven.DefaultMaven.execute(DefaultMaven.java:129)
	at org.apache.maven.cli.MavenCli.main(MavenCli.java:287)
	at sun.reflect.NativeMethodAccessorImpl.invoke0(Native Method)
	at sun.reflect.NativeMethodAccessorImpl.invoke(NativeMethodAccessorImpl.java:39)
	at sun.reflect.DelegatingMethodAccessorImpl.invoke(DelegatingMethodAccessorImpl.java:25)
	at java.lang.reflect.Method.invoke(Method.java:597)
	at org.codehaus.classworlds.Launcher.launchEnhanced(Launcher.java:315)
	at org.codehaus.classworlds.Launcher.launch(Launcher.java:255)
	at hudson.maven.agent.Main.launch(Main.java:133)
	at hudson.maven.MavenBuilder.call(MavenBuilder.java:139)
	at hudson.maven.MavenModuleSetBuild$Builder.call(MavenModuleSetBuild.java:543)
	at hudson.maven.MavenModuleSetBuild$Builder.call(MavenModuleSetBuild.java:489)
	at hudson.remoting.UserRequest.perform(UserRequest.java:69)
	at hudson.remoting.UserRequest.perform(UserRequest.java:23)
	at hudson.remoting.Request$2.run(Request.java:213)
	at java.util.concurrent.Executors$RunnableAdapter.call(Executors.java:441)
	at java.util.concurrent.FutureTask$Sync.innerRun(FutureTask.java:303)
	at java.util.concurrent.FutureTask.run(FutureTask.java:138)
	at java.util.concurrent.ThreadPoolExecutor$Worker.runTask(ThreadPoolExecutor.java:885)
	at java.util.concurrent.ThreadPoolExecutor$Worker.run(ThreadPoolExecutor.java:907)
	at java.lang.Thread.run(Thread.java:619)
Caused by: org.apache.maven.plugin.CompilationFailureException: Compilation failure
	at org.apache.maven.plugin.AbstractCompilerMojo.execute(AbstractCompilerMojo.java:516)
	at org.apache.maven.plugin.CompilerMojo.execute(CompilerMojo.java:114)
	at org.apache.maven.plugin.DefaultPluginManager.executeMojo(DefaultPluginManager.java:451)
	at hudson.maven.agent.PluginManagerInterceptor.executeMojo(PluginManagerInterceptor.java:159)
	at org.apache.maven.lifecycle.DefaultLifecycleExecutor.executeGoals(DefaultLifecycleExecutor.java:558)
	... 28 more
[INFO] ------------------------------------------------------------------------
[INFO] Total time: 40 seconds
[INFO] Finished at: Fri Oct 10 08:47:07 CDT 2008
[INFO] Final Memory: 40M/153M
[INFO] ------------------------------------------------------------------------


Mime
View raw message