maven-notifications mailing list archives

Site index · List index
Message view « Date » · « Thread »
Top « Date » · « Thread »
From Hudson <Hud...@sonatype.org>
Subject Build failed in Hudson: plugins-IT-with-maven-2.0.x » Maven JAR Plugin #36
Date Sun, 12 Oct 2008 19:09:46 GMT
See http://ci.sonatype.org/job/plugins-IT-with-maven-2.0.x/org.apache.maven.plugins$maven-jar-plugin/36/changes

------------------------------------------
[INFO] ------------------------------------------------------------------------
[INFO] Building Maven JAR Plugin
[INFO]    task-segment: [clean, deploy]
[INFO] ------------------------------------------------------------------------
[INFO] [clean:clean]
[INFO] Deleting directory http://ci.sonatype.org/job/plugins-IT-with-maven-2.0.x/org.apache.maven.plugins$maven-jar-plugin/ws/target

[INFO] [enforcer:enforce {execution: ensure-no-container-api}]
[INFO] [plugin:helpmojo {execution: generated-helpmojo}]
[INFO] Using 2 extractors.
[INFO] Applying extractor for language: java
[INFO] Extractor for language: java found 4 mojo descriptors.
[INFO] Applying extractor for language: bsh
[INFO] Extractor for language: bsh found 0 mojo descriptors.
[INFO] [plugin:descriptor]
[INFO] Using 2 extractors.
[INFO] Applying extractor for language: java
[INFO] Extractor for language: java found 5 mojo descriptors.
[INFO] Applying extractor for language: bsh
[INFO] Extractor for language: bsh found 0 mojo descriptors.
[INFO] [remote-resources:process {execution: default}]
[INFO] [resources:resources]
[INFO] Using encoding: 'UTF-8' to copy filtered resources.
[INFO] [compiler:compile]
[INFO] Compiling 6 source files to http://ci.sonatype.org/job/plugins-IT-with-maven-2.0.x/org.apache.maven.plugins$maven-jar-plugin/ws/target/classes

[INFO] [resources:testResources]
[INFO] Using encoding: 'UTF-8' to copy filtered resources.
[INFO] [compiler:testCompile]
[INFO] Compiling 4 source files to http://ci.sonatype.org/job/plugins-IT-with-maven-2.0.x/org.apache.maven.plugins$maven-jar-plugin/ws/target/test-classes

[INFO] [surefire:test]
[INFO] Surefire report directory: http://ci.sonatype.org/job/plugins-IT-with-maven-2.0.x/org.apache.maven.plugins$maven-jar-plugin/ws/target/surefire-reports


-------------------------------------------------------
 T E S T S
-------------------------------------------------------
Running org.apache.maven.plugin.jar.JarSignVerifyMojoTest
[debug] jarsigner executable=[/opt/java/sdk/1.5/jre/../bin/jarsigner]
[debug] Executing: /bin/sh -c "cd /tmp && /opt/java/sdk/1.5/jre/../bin/jarsigner -verify
/tmp/signed/file-version.jar"
[info] jar verified.
[debug] jarsigner executable=[/opt/java/sdk/1.5/jre/../bin/jarsigner]
[debug] Executing: /bin/sh -c "cd /tmp && /opt/java/sdk/1.5/jre/../bin/jarsigner -verify
/tmp/signed/file-version.jar"
[debug] jarsigner executable=[/opt/java/sdk/1.5/jre/../bin/jarsigner]
[debug] Executing: /bin/sh -c "cd /tmp && /opt/java/sdk/1.5/jre/../bin/jarsigner -verify
-verbose -certs /tmp/signed/file-version.jar"
[info] jar verified.
[debug] jarsigner executable=[/opt/java/sdk/1.5/jre/../bin/jarsigner]
[debug] Executing: /bin/sh -c "cd /tmp && /opt/java/sdk/1.5/jre/../bin/jarsigner -verify
/tmp/signed/file-version.jar"
[debug] jarsigner executable=[/opt/java/sdk/1.5/jre/../bin/jarsigner]
[debug] Executing: /bin/sh -c "cd /tmp && /opt/java/sdk/1.5/jre/../bin/jarsigner -verify
/tmp/signed/file-version.jar"
[info] jar is unsigned.
Tests run: 6, Failures: 0, Errors: 0, Skipped: 0, Time elapsed: 0.06 sec
Running org.apache.maven.plugin.jar.JarSignMojoTest
[debug] jarsigner executable=[/opt/java/sdk/1.5/jre/../bin/jarsigner]
[debug] mdkirs: false /tmp
[debug] jarsigner executable=[/opt/java/sdk/1.5/jre/../bin/jarsigner]
[debug] mdkirs: false /tmp
[debug] jarsigner executable=[/opt/java/sdk/1.5/jre/../bin/jarsigner]
[debug] Executing: /bin/sh -c "cd /tmp && /opt/java/sdk/1.5/jre/../bin/jarsigner -verify
/tmp/signed.jar"
[info] jar verified.
[debug] jarsigner executable=[/opt/java/sdk/1.5/jre/../bin/jarsigner]
[debug] Signing JAR in-place (overwritting original JAR).
[debug] jarsigner executable=[/opt/java/sdk/1.5/jre/../bin/jarsigner]
[debug] Executing: /bin/sh -c "cd /tmp && /opt/java/sdk/1.5/jre/../bin/jarsigner -verify
/tmp/null.jar"
[info] jar verified.
[debug] jarsigner executable=[/opt/java/sdk/1.5/jre/../bin/jarsigner]
[debug] mdkirs: false /tmp
[info] JAR /tmp/signed.jar is already signed. Skipping.
[debug] jarsigner executable=[/opt/java/sdk/1.5/jre/../bin/jarsigner]
[debug] mdkirs: false /tmp
[debug] jarsigner executable=[/opt/java/sdk/1.5/jre/../bin/jarsigner]
[debug] mdkirs: false /tmp
Tests run: 6, Failures: 0, Errors: 0, Skipped: 0, Time elapsed: 0.053 sec
Running org.apache.maven.plugin.jar.JarMojoTest
Tests run: 1, Failures: 0, Errors: 0, Skipped: 0, Time elapsed: 0.412 sec

Results :

Tests run: 13, Failures: 0, Errors: 0, Skipped: 0

[HUDSON] Recording test results
[INFO] [jar:jar]
[INFO] Building jar: http://ci.sonatype.org/job/plugins-IT-with-maven-2.0.x/org.apache.maven.plugins$maven-jar-plugin/ws/target/maven-jar-plugin-2.3-SNAPSHOT.jar

[INFO] [plugin:addPluginArtifactMetadata]
[INFO] [invoker:install {execution: integration-test}]
[INFO] Installing http://ci.sonatype.org/job/plugins-IT-with-maven-2.0.x/org.apache.maven.plugins$maven-jar-plugin/ws/pom.xml
 to http://ci.sonatype.org/job/plugins-IT-with-maven-2.0.x/org.apache.maven.plugins$maven-jar-plugin/ws/target/local-repo/org/apache/maven/plugins/maven-jar-plugin/2.3-SNAPSHOT/maven-jar-plugin-2.3-SNAPSHOT.pom

[INFO] Installing http://ci.sonatype.org/job/plugins-IT-with-maven-2.0.x/org.apache.maven.plugins$maven-jar-plugin/ws/target/maven-jar-plugin-2.3-SNAPSHOT.jar
 to http://ci.sonatype.org/job/plugins-IT-with-maven-2.0.x/org.apache.maven.plugins$maven-jar-plugin/ws/target/local-repo/org/apache/maven/plugins/maven-jar-plugin/2.3-SNAPSHOT/maven-jar-plugin-2.3-SNAPSHOT.jar

[INFO] Installing /home/hudson/repos/maven-plugins/org/apache/maven/maven-plugin-api/2.0.6/maven-plugin-api-2.0.6.jar
to http://ci.sonatype.org/job/plugins-IT-with-maven-2.0.x/org.apache.maven.plugins$maven-jar-plugin/ws/target/local-repo/org/apache/maven/maven-plugin-api/2.0.6/maven-plugin-api-2.0.6.jar

[INFO] Installing /home/hudson/repos/maven-plugins/org/apache/maven/maven-plugin-api/2.0.6/maven-plugin-api-2.0.6.pom
to http://ci.sonatype.org/job/plugins-IT-with-maven-2.0.x/org.apache.maven.plugins$maven-jar-plugin/ws/target/local-repo/org/apache/maven/maven-plugin-api/2.0.6/maven-plugin-api-2.0.6.pom

[INFO] Installing /home/hudson/repos/maven-plugins/org/apache/maven/maven-project/2.0.7/maven-project-2.0.7.jar
to http://ci.sonatype.org/job/plugins-IT-with-maven-2.0.x/org.apache.maven.plugins$maven-jar-plugin/ws/target/local-repo/org/apache/maven/maven-project/2.0.7/maven-project-2.0.7.jar

[INFO] Installing /home/hudson/repos/maven-plugins/org/apache/maven/maven-project/2.0.7/maven-project-2.0.7.pom
to http://ci.sonatype.org/job/plugins-IT-with-maven-2.0.x/org.apache.maven.plugins$maven-jar-plugin/ws/target/local-repo/org/apache/maven/maven-project/2.0.7/maven-project-2.0.7.pom

[INFO] Installing /home/hudson/repos/maven-plugins/org/apache/maven/maven-settings/2.0.7/maven-settings-2.0.7.jar
to http://ci.sonatype.org/job/plugins-IT-with-maven-2.0.x/org.apache.maven.plugins$maven-jar-plugin/ws/target/local-repo/org/apache/maven/maven-settings/2.0.7/maven-settings-2.0.7.jar

[INFO] Installing /home/hudson/repos/maven-plugins/org/apache/maven/maven-settings/2.0.7/maven-settings-2.0.7.pom
to http://ci.sonatype.org/job/plugins-IT-with-maven-2.0.x/org.apache.maven.plugins$maven-jar-plugin/ws/target/local-repo/org/apache/maven/maven-settings/2.0.7/maven-settings-2.0.7.pom

[INFO] Installing /home/hudson/repos/maven-plugins/org/apache/maven/maven-model/2.0.7/maven-model-2.0.7.jar
to http://ci.sonatype.org/job/plugins-IT-with-maven-2.0.x/org.apache.maven.plugins$maven-jar-plugin/ws/target/local-repo/org/apache/maven/maven-model/2.0.7/maven-model-2.0.7.jar

[INFO] Installing /home/hudson/repos/maven-plugins/org/apache/maven/maven-model/2.0.7/maven-model-2.0.7.pom
to http://ci.sonatype.org/job/plugins-IT-with-maven-2.0.x/org.apache.maven.plugins$maven-jar-plugin/ws/target/local-repo/org/apache/maven/maven-model/2.0.7/maven-model-2.0.7.pom

[INFO] Installing /home/hudson/repos/maven-plugins/org/codehaus/plexus/plexus-utils/1.4.9/plexus-utils-1.4.9.jar
to http://ci.sonatype.org/job/plugins-IT-with-maven-2.0.x/org.apache.maven.plugins$maven-jar-plugin/ws/target/local-repo/org/codehaus/plexus/plexus-utils/1.4.9/plexus-utils-1.4.9.jar

[INFO] Installing /home/hudson/repos/maven-plugins/org/codehaus/plexus/plexus-utils/1.4.9/plexus-utils-1.4.9.pom
to http://ci.sonatype.org/job/plugins-IT-with-maven-2.0.x/org.apache.maven.plugins$maven-jar-plugin/ws/target/local-repo/org/codehaus/plexus/plexus-utils/1.4.9/plexus-utils-1.4.9.pom

[INFO] Installing /home/hudson/repos/maven-plugins/org/codehaus/plexus/plexus-container-default/1.0-alpha-9-stable-1/plexus-container-default-1.0-alpha-9-stable-1.jar
to http://ci.sonatype.org/job/plugins-IT-with-maven-2.0.x/org.apache.maven.plugins$maven-jar-plugin/ws/target/local-repo/org/codehaus/plexus/plexus-container-default/1.0-alpha-9-stable-1/plexus-container-default-1.0-alpha-9-stable-1.jar

[INFO] Installing /home/hudson/repos/maven-plugins/org/codehaus/plexus/plexus-container-default/1.0-alpha-9-stable-1/plexus-container-default-1.0-alpha-9-stable-1.pom
to http://ci.sonatype.org/job/plugins-IT-with-maven-2.0.x/org.apache.maven.plugins$maven-jar-plugin/ws/target/local-repo/org/codehaus/plexus/plexus-container-default/1.0-alpha-9-stable-1/plexus-container-default-1.0-alpha-9-stable-1.pom

[INFO] Installing /home/hudson/repos/maven-plugins/junit/junit/3.8.2/junit-3.8.2.jar to http://ci.sonatype.org/job/plugins-IT-with-maven-2.0.x/org.apache.maven.plugins$maven-jar-plugin/ws/target/local-repo/junit/junit/3.8.2/junit-3.8.2.jar

[INFO] Installing /home/hudson/repos/maven-plugins/junit/junit/3.8.2/junit-3.8.2.pom to http://ci.sonatype.org/job/plugins-IT-with-maven-2.0.x/org.apache.maven.plugins$maven-jar-plugin/ws/target/local-repo/junit/junit/3.8.2/junit-3.8.2.pom

[INFO] Installing /home/hudson/repos/maven-plugins/classworlds/classworlds/1.1-alpha-2/classworlds-1.1-alpha-2.jar
to http://ci.sonatype.org/job/plugins-IT-with-maven-2.0.x/org.apache.maven.plugins$maven-jar-plugin/ws/target/local-repo/classworlds/classworlds/1.1-alpha-2/classworlds-1.1-alpha-2.jar

[INFO] Installing /home/hudson/repos/maven-plugins/classworlds/classworlds/1.1-alpha-2/classworlds-1.1-alpha-2.pom
to http://ci.sonatype.org/job/plugins-IT-with-maven-2.0.x/org.apache.maven.plugins$maven-jar-plugin/ws/target/local-repo/classworlds/classworlds/1.1-alpha-2/classworlds-1.1-alpha-2.pom

[INFO] Installing /home/hudson/repos/maven-plugins/org/apache/maven/maven-profile/2.0.7/maven-profile-2.0.7.jar
to http://ci.sonatype.org/job/plugins-IT-with-maven-2.0.x/org.apache.maven.plugins$maven-jar-plugin/ws/target/local-repo/org/apache/maven/maven-profile/2.0.7/maven-profile-2.0.7.jar

[INFO] Installing /home/hudson/repos/maven-plugins/org/apache/maven/maven-profile/2.0.7/maven-profile-2.0.7.pom
to http://ci.sonatype.org/job/plugins-IT-with-maven-2.0.x/org.apache.maven.plugins$maven-jar-plugin/ws/target/local-repo/org/apache/maven/maven-profile/2.0.7/maven-profile-2.0.7.pom

[INFO] Installing /home/hudson/repos/maven-plugins/org/apache/maven/maven-artifact-manager/2.0.7/maven-artifact-manager-2.0.7.jar
to http://ci.sonatype.org/job/plugins-IT-with-maven-2.0.x/org.apache.maven.plugins$maven-jar-plugin/ws/target/local-repo/org/apache/maven/maven-artifact-manager/2.0.7/maven-artifact-manager-2.0.7.jar

[INFO] Installing /home/hudson/repos/maven-plugins/org/apache/maven/maven-artifact-manager/2.0.7/maven-artifact-manager-2.0.7.pom
to http://ci.sonatype.org/job/plugins-IT-with-maven-2.0.x/org.apache.maven.plugins$maven-jar-plugin/ws/target/local-repo/org/apache/maven/maven-artifact-manager/2.0.7/maven-artifact-manager-2.0.7.pom

[INFO] Installing /home/hudson/repos/maven-plugins/org/apache/maven/maven-repository-metadata/2.0.7/maven-repository-metadata-2.0.7.jar
to http://ci.sonatype.org/job/plugins-IT-with-maven-2.0.x/org.apache.maven.plugins$maven-jar-plugin/ws/target/local-repo/org/apache/maven/maven-repository-metadata/2.0.7/maven-repository-metadata-2.0.7.jar

[INFO] Installing /home/hudson/repos/maven-plugins/org/apache/maven/maven-repository-metadata/2.0.7/maven-repository-metadata-2.0.7.pom
to http://ci.sonatype.org/job/plugins-IT-with-maven-2.0.x/org.apache.maven.plugins$maven-jar-plugin/ws/target/local-repo/org/apache/maven/maven-repository-metadata/2.0.7/maven-repository-metadata-2.0.7.pom

[INFO] Installing /home/hudson/repos/maven-plugins/org/apache/maven/maven-artifact/2.0.7/maven-artifact-2.0.7.jar
to http://ci.sonatype.org/job/plugins-IT-with-maven-2.0.x/org.apache.maven.plugins$maven-jar-plugin/ws/target/local-repo/org/apache/maven/maven-artifact/2.0.7/maven-artifact-2.0.7.jar

[INFO] Installing /home/hudson/repos/maven-plugins/org/apache/maven/maven-artifact/2.0.7/maven-artifact-2.0.7.pom
to http://ci.sonatype.org/job/plugins-IT-with-maven-2.0.x/org.apache.maven.plugins$maven-jar-plugin/ws/target/local-repo/org/apache/maven/maven-artifact/2.0.7/maven-artifact-2.0.7.pom

[INFO] Installing /home/hudson/repos/maven-plugins/org/apache/maven/wagon/wagon-provider-api/1.0-beta-2/wagon-provider-api-1.0-beta-2.jar
to http://ci.sonatype.org/job/plugins-IT-with-maven-2.0.x/org.apache.maven.plugins$maven-jar-plugin/ws/target/local-repo/org/apache/maven/wagon/wagon-provider-api/1.0-beta-2/wagon-provider-api-1.0-beta-2.jar

[INFO] Installing /home/hudson/repos/maven-plugins/org/apache/maven/wagon/wagon-provider-api/1.0-beta-2/wagon-provider-api-1.0-beta-2.pom
to http://ci.sonatype.org/job/plugins-IT-with-maven-2.0.x/org.apache.maven.plugins$maven-jar-plugin/ws/target/local-repo/org/apache/maven/wagon/wagon-provider-api/1.0-beta-2/wagon-provider-api-1.0-beta-2.pom

[INFO] Installing /home/hudson/repos/maven-plugins/org/apache/maven/maven-plugin-registry/2.0.7/maven-plugin-registry-2.0.7.jar
to http://ci.sonatype.org/job/plugins-IT-with-maven-2.0.x/org.apache.maven.plugins$maven-jar-plugin/ws/target/local-repo/org/apache/maven/maven-plugin-registry/2.0.7/maven-plugin-registry-2.0.7.jar

[INFO] Installing /home/hudson/repos/maven-plugins/org/apache/maven/maven-plugin-registry/2.0.7/maven-plugin-registry-2.0.7.pom
to http://ci.sonatype.org/job/plugins-IT-with-maven-2.0.x/org.apache.maven.plugins$maven-jar-plugin/ws/target/local-repo/org/apache/maven/maven-plugin-registry/2.0.7/maven-plugin-registry-2.0.7.pom

[INFO] Installing /home/hudson/repos/maven-plugins/org/apache/maven/maven-archiver/2.4-SNAPSHOT/maven-archiver-2.4-SNAPSHOT.jar
to http://ci.sonatype.org/job/plugins-IT-with-maven-2.0.x/org.apache.maven.plugins$maven-jar-plugin/ws/target/local-repo/org/apache/maven/maven-archiver/2.4-SNAPSHOT/maven-archiver-2.4-20081012.183415-754.jar

[INFO] Installing /home/hudson/repos/maven-plugins/org/apache/maven/maven-archiver/2.4-SNAPSHOT/maven-archiver-2.4-20081012.183415-754.pom
to http://ci.sonatype.org/job/plugins-IT-with-maven-2.0.x/org.apache.maven.plugins$maven-jar-plugin/ws/target/local-repo/org/apache/maven/maven-archiver/2.4-SNAPSHOT/maven-archiver-2.4-20081012.183415-754.pom

[INFO] Installing /home/hudson/repos/maven-plugins/org/codehaus/plexus/plexus-archiver/1.0-alpha-9/plexus-archiver-1.0-alpha-9.jar
to http://ci.sonatype.org/job/plugins-IT-with-maven-2.0.x/org.apache.maven.plugins$maven-jar-plugin/ws/target/local-repo/org/codehaus/plexus/plexus-archiver/1.0-alpha-9/plexus-archiver-1.0-alpha-9.jar

[INFO] Installing /home/hudson/repos/maven-plugins/org/codehaus/plexus/plexus-archiver/1.0-alpha-9/plexus-archiver-1.0-alpha-9.pom
to http://ci.sonatype.org/job/plugins-IT-with-maven-2.0.x/org.apache.maven.plugins$maven-jar-plugin/ws/target/local-repo/org/codehaus/plexus/plexus-archiver/1.0-alpha-9/plexus-archiver-1.0-alpha-9.pom

[INFO] Installing /home/hudson/repos/maven-plugins/org/codehaus/plexus/plexus-io/1.0-alpha-1/plexus-io-1.0-alpha-1.jar
to http://ci.sonatype.org/job/plugins-IT-with-maven-2.0.x/org.apache.maven.plugins$maven-jar-plugin/ws/target/local-repo/org/codehaus/plexus/plexus-io/1.0-alpha-1/plexus-io-1.0-alpha-1.jar

[INFO] Installing /home/hudson/repos/maven-plugins/org/codehaus/plexus/plexus-io/1.0-alpha-1/plexus-io-1.0-alpha-1.pom
to http://ci.sonatype.org/job/plugins-IT-with-maven-2.0.x/org.apache.maven.plugins$maven-jar-plugin/ws/target/local-repo/org/codehaus/plexus/plexus-io/1.0-alpha-1/plexus-io-1.0-alpha-1.pom

[INFO] Installing /home/hudson/repos/maven-plugins/org/codehaus/plexus/plexus-interpolation/1.5/plexus-interpolation-1.5.jar
to http://ci.sonatype.org/job/plugins-IT-with-maven-2.0.x/org.apache.maven.plugins$maven-jar-plugin/ws/target/local-repo/org/codehaus/plexus/plexus-interpolation/1.5/plexus-interpolation-1.5.jar

[INFO] Installing /home/hudson/repos/maven-plugins/org/codehaus/plexus/plexus-interpolation/1.5/plexus-interpolation-1.5.pom
to http://ci.sonatype.org/job/plugins-IT-with-maven-2.0.x/org.apache.maven.plugins$maven-jar-plugin/ws/target/local-repo/org/codehaus/plexus/plexus-interpolation/1.5/plexus-interpolation-1.5.pom

[INFO] Installing /home/hudson/repos/maven-plugins/commons-lang/commons-lang/2.1/commons-lang-2.1.jar
to http://ci.sonatype.org/job/plugins-IT-with-maven-2.0.x/org.apache.maven.plugins$maven-jar-plugin/ws/target/local-repo/commons-lang/commons-lang/2.1/commons-lang-2.1.jar

[INFO] Installing /home/hudson/repos/maven-plugins/commons-lang/commons-lang/2.1/commons-lang-2.1.pom
to http://ci.sonatype.org/job/plugins-IT-with-maven-2.0.x/org.apache.maven.plugins$maven-jar-plugin/ws/target/local-repo/commons-lang/commons-lang/2.1/commons-lang-2.1.pom

[INFO] [invoker:run {execution: integration-test}]
[WARNING] Filtering of parent/child POMs is not supported without cloning the projects
[INFO] Building: MJAR-30-excludes/pom.xml
[INFO] ...SUCCESS.
[INFO] Building: mjar-71-01/pom.xml
[INFO] ...SUCCESS.
[INFO] Building: MJAR-80-exclude/pom.xml
[INFO] ...SUCCESS.
[INFO] Building: MJAR-70-recreation/pom.xml
[INFO] ...FAILED. The post-build script returned false.
[INFO] Building: MJAR-80-fullcontent/pom.xml
[INFO] ...SUCCESS.
[INFO] Building: mjar-71-02/pom.xml
[INFO] ...SUCCESS.
[INFO] Building: mjar-90/pom.xml
[INFO] ...SUCCESS.
[INFO] Building: MJAR-30-include/pom.xml
[INFO] ...SUCCESS.
[INFO] Building: MJAR-82/pom.xml
[INFO] ...SUCCESS.
[INFO] Building: MJAR-70-no-recreation/pom.xml
[INFO] ...FAILED. The post-build script returned false.
[INFO] Building: MJAR-80-include/pom.xml
[INFO] ...SUCCESS.
[INFO] Building: manifest-content/pom.xml
[INFO] ...SUCCESS.
[INFO] Building: MJAR-30-fullcontent/pom.xml
[INFO] ...SUCCESS.
[INFO] Building: project-004/pom.xml
[INFO] ...SUCCESS.
[INFO] Building: MJAR-60/pom.xml
[INFO] ...SUCCESS.
[INFO] ---------------------------------------
[INFO] Execution Summary:
[INFO]   Builds Passing: 13
[INFO]   Builds Failing: 2
[INFO] ---------------------------------------
[ERROR] The following builds failed:
[ERROR] *  MJAR-70-recreation/pom.xml
[ERROR] *  MJAR-70-no-recreation/pom.xml
[INFO] ---------------------------------------
[HUDSON] Archiving http://ci.sonatype.org/job/plugins-IT-with-maven-2.0.x/org.apache.maven.plugins$maven-jar-plugin/ws/pom.xml
 to /home/hudson/.hudson/jobs/plugins-IT-with-maven-2.0.x/modules/org.apache.maven.plugins$maven-jar-plugin/builds/2008-10-12_13-30-58/archive/org.apache.maven.plugins/maven-jar-plugin/2.3-SNAPSHOT/pom.xml
[HUDSON] Archiving http://ci.sonatype.org/job/plugins-IT-with-maven-2.0.x/org.apache.maven.plugins$maven-jar-plugin/ws/target/maven-jar-plugin-2.3-SNAPSHOT.jar
 to /home/hudson/.hudson/jobs/plugins-IT-with-maven-2.0.x/modules/org.apache.maven.plugins$maven-jar-plugin/builds/2008-10-12_13-30-58/archive/org.apache.maven.plugins/maven-jar-plugin/2.3-SNAPSHOT/maven-jar-plugin-2.3-SNAPSHOT.jar


Mime
View raw message