maven-notifications mailing list archives

Site index · List index
Message view « Date » · « Thread »
Top « Date » · « Thread »
From Hudson <Hud...@sonatype.org>
Subject Build failed in Hudson: plugins-IT-with-maven-2.0.x » Maven AntRun Plugin #33
Date Sun, 12 Oct 2008 17:09:59 GMT
See http://ci.sonatype.org/job/plugins-IT-with-maven-2.0.x/org.apache.maven.plugins$maven-antrun-plugin/33/changes

------------------------------------------
[INFO] ------------------------------------------------------------------------
[INFO] Building Maven AntRun Plugin
[INFO]    task-segment: [clean, deploy]
[INFO] ------------------------------------------------------------------------
[INFO] [clean:clean]
[INFO] Deleting directory http://ci.sonatype.org/job/plugins-IT-with-maven-2.0.x/org.apache.maven.plugins$maven-antrun-plugin/ws/target

[INFO] [enforcer:enforce {execution: ensure-no-container-api}]
[INFO] [plugin:helpmojo {execution: generated-helpmojo}]
[INFO] Using 2 extractors.
[INFO] Applying extractor for language: java
[INFO] Extractor for language: java found 1 mojo descriptors.
[INFO] Applying extractor for language: bsh
[INFO] Extractor for language: bsh found 0 mojo descriptors.
[INFO] [plugin:descriptor]
[INFO] Using 2 extractors.
[INFO] Applying extractor for language: java
[INFO] Extractor for language: java found 2 mojo descriptors.
[INFO] Applying extractor for language: bsh
[INFO] Extractor for language: bsh found 0 mojo descriptors.
[INFO] [remote-resources:process {execution: default}]
[INFO] [resources:resources]
[INFO] Using encoding: 'UTF-8' to copy filtered resources.
[INFO] [compiler:compile]
[INFO] Compiling 5 source files to http://ci.sonatype.org/job/plugins-IT-with-maven-2.0.x/org.apache.maven.plugins$maven-antrun-plugin/ws/target/classes

[INFO] [resources:testResources]
[INFO] Using encoding: 'UTF-8' to copy filtered resources.
[INFO] [compiler:testCompile]
[INFO] Nothing to compile - all classes are up to date
[INFO] [surefire:test]
[INFO] Surefire report directory: http://ci.sonatype.org/job/plugins-IT-with-maven-2.0.x/org.apache.maven.plugins$maven-antrun-plugin/ws/target/surefire-reports


-------------------------------------------------------
 T E S T S
-------------------------------------------------------
There are no tests to run.

Results :

Tests run: 0, Failures: 0, Errors: 0, Skipped: 0

[HUDSON] Recording test results
[INFO] [jar:jar]
[INFO] Building jar: http://ci.sonatype.org/job/plugins-IT-with-maven-2.0.x/org.apache.maven.plugins$maven-antrun-plugin/ws/target/maven-antrun-plugin-1.4-SNAPSHOT.jar

[INFO] [plugin:addPluginArtifactMetadata]
[INFO] [invoker:install {execution: integration-test}]
[INFO] Installing http://ci.sonatype.org/job/plugins-IT-with-maven-2.0.x/org.apache.maven.plugins$maven-antrun-plugin/ws/pom.xml
 to http://ci.sonatype.org/job/plugins-IT-with-maven-2.0.x/org.apache.maven.plugins$maven-antrun-plugin/ws/target/local-repo/org/apache/maven/plugins/maven-antrun-plugin/1.4-SNAPSHOT/maven-antrun-plugin-1.4-SNAPSHOT.pom

[INFO] Installing http://ci.sonatype.org/job/plugins-IT-with-maven-2.0.x/org.apache.maven.plugins$maven-antrun-plugin/ws/target/maven-antrun-plugin-1.4-SNAPSHOT.jar
 to http://ci.sonatype.org/job/plugins-IT-with-maven-2.0.x/org.apache.maven.plugins$maven-antrun-plugin/ws/target/local-repo/org/apache/maven/plugins/maven-antrun-plugin/1.4-SNAPSHOT/maven-antrun-plugin-1.4-SNAPSHOT.jar

[INFO] Installing /home/hudson/repos/maven-plugins/org/apache/maven/maven-plugin-api/2.0.4/maven-plugin-api-2.0.4.jar
to http://ci.sonatype.org/job/plugins-IT-with-maven-2.0.x/org.apache.maven.plugins$maven-antrun-plugin/ws/target/local-repo/org/apache/maven/maven-plugin-api/2.0.4/maven-plugin-api-2.0.4.jar

[INFO] Installing /home/hudson/repos/maven-plugins/org/apache/maven/maven-plugin-api/2.0.4/maven-plugin-api-2.0.4.pom
to http://ci.sonatype.org/job/plugins-IT-with-maven-2.0.x/org.apache.maven.plugins$maven-antrun-plugin/ws/target/local-repo/org/apache/maven/maven-plugin-api/2.0.4/maven-plugin-api-2.0.4.pom

[INFO] Installing /home/hudson/repos/maven-plugins/org/apache/maven/maven-project/2.0.4/maven-project-2.0.4.jar
to http://ci.sonatype.org/job/plugins-IT-with-maven-2.0.x/org.apache.maven.plugins$maven-antrun-plugin/ws/target/local-repo/org/apache/maven/maven-project/2.0.4/maven-project-2.0.4.jar

[INFO] Installing /home/hudson/repos/maven-plugins/org/apache/maven/maven-project/2.0.4/maven-project-2.0.4.pom
to http://ci.sonatype.org/job/plugins-IT-with-maven-2.0.x/org.apache.maven.plugins$maven-antrun-plugin/ws/target/local-repo/org/apache/maven/maven-project/2.0.4/maven-project-2.0.4.pom

[INFO] Installing /home/hudson/repos/maven-plugins/org/apache/maven/maven-settings/2.0.4/maven-settings-2.0.4.jar
to http://ci.sonatype.org/job/plugins-IT-with-maven-2.0.x/org.apache.maven.plugins$maven-antrun-plugin/ws/target/local-repo/org/apache/maven/maven-settings/2.0.4/maven-settings-2.0.4.jar

[INFO] Installing /home/hudson/repos/maven-plugins/org/apache/maven/maven-settings/2.0.4/maven-settings-2.0.4.pom
to http://ci.sonatype.org/job/plugins-IT-with-maven-2.0.x/org.apache.maven.plugins$maven-antrun-plugin/ws/target/local-repo/org/apache/maven/maven-settings/2.0.4/maven-settings-2.0.4.pom

[INFO] Installing /home/hudson/repos/maven-plugins/org/apache/maven/maven-model/2.0.4/maven-model-2.0.4.jar
to http://ci.sonatype.org/job/plugins-IT-with-maven-2.0.x/org.apache.maven.plugins$maven-antrun-plugin/ws/target/local-repo/org/apache/maven/maven-model/2.0.4/maven-model-2.0.4.jar

[INFO] Installing /home/hudson/repos/maven-plugins/org/apache/maven/maven-model/2.0.4/maven-model-2.0.4.pom
to http://ci.sonatype.org/job/plugins-IT-with-maven-2.0.x/org.apache.maven.plugins$maven-antrun-plugin/ws/target/local-repo/org/apache/maven/maven-model/2.0.4/maven-model-2.0.4.pom

[INFO] Installing /home/hudson/repos/maven-plugins/org/codehaus/plexus/plexus-utils/1.5.6/plexus-utils-1.5.6.jar
to http://ci.sonatype.org/job/plugins-IT-with-maven-2.0.x/org.apache.maven.plugins$maven-antrun-plugin/ws/target/local-repo/org/codehaus/plexus/plexus-utils/1.5.6/plexus-utils-1.5.6.jar

[INFO] Installing /home/hudson/repos/maven-plugins/org/codehaus/plexus/plexus-utils/1.5.6/plexus-utils-1.5.6.pom
to http://ci.sonatype.org/job/plugins-IT-with-maven-2.0.x/org.apache.maven.plugins$maven-antrun-plugin/ws/target/local-repo/org/codehaus/plexus/plexus-utils/1.5.6/plexus-utils-1.5.6.pom

[INFO] Installing /home/hudson/repos/maven-plugins/org/codehaus/plexus/plexus-container-default/1.0-alpha-9/plexus-container-default-1.0-alpha-9.jar
to http://ci.sonatype.org/job/plugins-IT-with-maven-2.0.x/org.apache.maven.plugins$maven-antrun-plugin/ws/target/local-repo/org/codehaus/plexus/plexus-container-default/1.0-alpha-9/plexus-container-default-1.0-alpha-9.jar

[INFO] Installing /home/hudson/repos/maven-plugins/org/codehaus/plexus/plexus-container-default/1.0-alpha-9/plexus-container-default-1.0-alpha-9.pom
to http://ci.sonatype.org/job/plugins-IT-with-maven-2.0.x/org.apache.maven.plugins$maven-antrun-plugin/ws/target/local-repo/org/codehaus/plexus/plexus-container-default/1.0-alpha-9/plexus-container-default-1.0-alpha-9.pom

[INFO] Installing /home/hudson/repos/maven-plugins/junit/junit/3.8.1/junit-3.8.1.jar to http://ci.sonatype.org/job/plugins-IT-with-maven-2.0.x/org.apache.maven.plugins$maven-antrun-plugin/ws/target/local-repo/junit/junit/3.8.1/junit-3.8.1.jar

[INFO] Installing /home/hudson/repos/maven-plugins/junit/junit/3.8.1/junit-3.8.1.pom to http://ci.sonatype.org/job/plugins-IT-with-maven-2.0.x/org.apache.maven.plugins$maven-antrun-plugin/ws/target/local-repo/junit/junit/3.8.1/junit-3.8.1.pom

[INFO] Installing /home/hudson/repos/maven-plugins/classworlds/classworlds/1.1-alpha-2/classworlds-1.1-alpha-2.jar
to http://ci.sonatype.org/job/plugins-IT-with-maven-2.0.x/org.apache.maven.plugins$maven-antrun-plugin/ws/target/local-repo/classworlds/classworlds/1.1-alpha-2/classworlds-1.1-alpha-2.jar

[INFO] Installing /home/hudson/repos/maven-plugins/classworlds/classworlds/1.1-alpha-2/classworlds-1.1-alpha-2.pom
to http://ci.sonatype.org/job/plugins-IT-with-maven-2.0.x/org.apache.maven.plugins$maven-antrun-plugin/ws/target/local-repo/classworlds/classworlds/1.1-alpha-2/classworlds-1.1-alpha-2.pom

[INFO] Installing /home/hudson/repos/maven-plugins/org/apache/maven/maven-profile/2.0.4/maven-profile-2.0.4.jar
to http://ci.sonatype.org/job/plugins-IT-with-maven-2.0.x/org.apache.maven.plugins$maven-antrun-plugin/ws/target/local-repo/org/apache/maven/maven-profile/2.0.4/maven-profile-2.0.4.jar

[INFO] Installing /home/hudson/repos/maven-plugins/org/apache/maven/maven-profile/2.0.4/maven-profile-2.0.4.pom
to http://ci.sonatype.org/job/plugins-IT-with-maven-2.0.x/org.apache.maven.plugins$maven-antrun-plugin/ws/target/local-repo/org/apache/maven/maven-profile/2.0.4/maven-profile-2.0.4.pom

[INFO] Installing /home/hudson/repos/maven-plugins/org/apache/maven/maven-artifact-manager/2.0.4/maven-artifact-manager-2.0.4.jar
to http://ci.sonatype.org/job/plugins-IT-with-maven-2.0.x/org.apache.maven.plugins$maven-antrun-plugin/ws/target/local-repo/org/apache/maven/maven-artifact-manager/2.0.4/maven-artifact-manager-2.0.4.jar

[INFO] Installing /home/hudson/repos/maven-plugins/org/apache/maven/maven-artifact-manager/2.0.4/maven-artifact-manager-2.0.4.pom
to http://ci.sonatype.org/job/plugins-IT-with-maven-2.0.x/org.apache.maven.plugins$maven-antrun-plugin/ws/target/local-repo/org/apache/maven/maven-artifact-manager/2.0.4/maven-artifact-manager-2.0.4.pom

[INFO] Installing /home/hudson/repos/maven-plugins/org/apache/maven/maven-repository-metadata/2.0.4/maven-repository-metadata-2.0.4.jar
to http://ci.sonatype.org/job/plugins-IT-with-maven-2.0.x/org.apache.maven.plugins$maven-antrun-plugin/ws/target/local-repo/org/apache/maven/maven-repository-metadata/2.0.4/maven-repository-metadata-2.0.4.jar

[INFO] Installing /home/hudson/repos/maven-plugins/org/apache/maven/maven-repository-metadata/2.0.4/maven-repository-metadata-2.0.4.pom
to http://ci.sonatype.org/job/plugins-IT-with-maven-2.0.x/org.apache.maven.plugins$maven-antrun-plugin/ws/target/local-repo/org/apache/maven/maven-repository-metadata/2.0.4/maven-repository-metadata-2.0.4.pom

[INFO] Installing /home/hudson/repos/maven-plugins/org/apache/maven/maven-artifact/2.0.4/maven-artifact-2.0.4.jar
to http://ci.sonatype.org/job/plugins-IT-with-maven-2.0.x/org.apache.maven.plugins$maven-antrun-plugin/ws/target/local-repo/org/apache/maven/maven-artifact/2.0.4/maven-artifact-2.0.4.jar

[INFO] Installing /home/hudson/repos/maven-plugins/org/apache/maven/maven-artifact/2.0.4/maven-artifact-2.0.4.pom
to http://ci.sonatype.org/job/plugins-IT-with-maven-2.0.x/org.apache.maven.plugins$maven-antrun-plugin/ws/target/local-repo/org/apache/maven/maven-artifact/2.0.4/maven-artifact-2.0.4.pom

[INFO] Installing /home/hudson/repos/maven-plugins/org/apache/maven/wagon/wagon-provider-api/1.0-alpha-6/wagon-provider-api-1.0-alpha-6.jar
to http://ci.sonatype.org/job/plugins-IT-with-maven-2.0.x/org.apache.maven.plugins$maven-antrun-plugin/ws/target/local-repo/org/apache/maven/wagon/wagon-provider-api/1.0-alpha-6/wagon-provider-api-1.0-alpha-6.jar

[INFO] Installing /home/hudson/repos/maven-plugins/org/apache/maven/wagon/wagon-provider-api/1.0-alpha-6/wagon-provider-api-1.0-alpha-6.pom
to http://ci.sonatype.org/job/plugins-IT-with-maven-2.0.x/org.apache.maven.plugins$maven-antrun-plugin/ws/target/local-repo/org/apache/maven/wagon/wagon-provider-api/1.0-alpha-6/wagon-provider-api-1.0-alpha-6.pom

[INFO] Installing /home/hudson/repos/maven-plugins/org/apache/ant/ant-launcher/1.7.1/ant-launcher-1.7.1.jar
to http://ci.sonatype.org/job/plugins-IT-with-maven-2.0.x/org.apache.maven.plugins$maven-antrun-plugin/ws/target/local-repo/org/apache/ant/ant-launcher/1.7.1/ant-launcher-1.7.1.jar

[INFO] Installing /home/hudson/repos/maven-plugins/org/apache/ant/ant-launcher/1.7.1/ant-launcher-1.7.1.pom
to http://ci.sonatype.org/job/plugins-IT-with-maven-2.0.x/org.apache.maven.plugins$maven-antrun-plugin/ws/target/local-repo/org/apache/ant/ant-launcher/1.7.1/ant-launcher-1.7.1.pom

[INFO] Installing /home/hudson/repos/maven-plugins/org/apache/ant/ant/1.7.1/ant-1.7.1.jar
to http://ci.sonatype.org/job/plugins-IT-with-maven-2.0.x/org.apache.maven.plugins$maven-antrun-plugin/ws/target/local-repo/org/apache/ant/ant/1.7.1/ant-1.7.1.jar

[INFO] Installing /home/hudson/repos/maven-plugins/org/apache/ant/ant/1.7.1/ant-1.7.1.pom
to http://ci.sonatype.org/job/plugins-IT-with-maven-2.0.x/org.apache.maven.plugins$maven-antrun-plugin/ws/target/local-repo/org/apache/ant/ant/1.7.1/ant-1.7.1.pom

[INFO] [invoker:run {execution: integration-test}]
[INFO] Building: test5/pom.xml
[INFO] ...SUCCESS.
[INFO] Building: test3/pom.xml
[INFO] ...SUCCESS.
[INFO] Building: test6/pom.xml
[INFO] ...SUCCESS.
[INFO] Building: ant-1.7-features/pom.xml
[INFO] ...FAILED. The post-build script did not succeed. Sourced file: inline evaluation of:
``import java.io.*; import org.codehaus.plexus.util.*; import org.custommonkey.xml . . . ''
: Attempt to resolve method: assertXMLEqual() on undefined variable or class name: XMLAssert
[INFO] Building: test4/pom.xml
[INFO] ...SUCCESS.
[INFO] Building: antrun-default-test/pom.xml
[INFO] ...SUCCESS.
[INFO] Building: tasksattributes-test/pom.xml
[INFO] ...SUCCESS.
[INFO] Building: test2/pom.xml
[INFO] ...SUCCESS.
[INFO] Building: test1/pom.xml
[INFO] ...SUCCESS.
[INFO] ---------------------------------------
[INFO] Execution Summary:
[INFO]   Builds Passing: 8
[INFO]   Builds Failing: 1
[INFO] ---------------------------------------
[ERROR] The following builds failed:
[ERROR] *  ant-1.7-features/pom.xml
[INFO] ---------------------------------------
[HUDSON] Archiving http://ci.sonatype.org/job/plugins-IT-with-maven-2.0.x/org.apache.maven.plugins$maven-antrun-plugin/ws/pom.xml
 to /home/hudson/.hudson/jobs/plugins-IT-with-maven-2.0.x/modules/org.apache.maven.plugins$maven-antrun-plugin/builds/2008-10-12_11-29-57/archive/org.apache.maven.plugins/maven-antrun-plugin/1.4-SNAPSHOT/pom.xml
[HUDSON] Archiving http://ci.sonatype.org/job/plugins-IT-with-maven-2.0.x/org.apache.maven.plugins$maven-antrun-plugin/ws/target/maven-antrun-plugin-1.4-SNAPSHOT.jar
 to /home/hudson/.hudson/jobs/plugins-IT-with-maven-2.0.x/modules/org.apache.maven.plugins$maven-antrun-plugin/builds/2008-10-12_11-29-57/archive/org.apache.maven.plugins/maven-antrun-plugin/1.4-SNAPSHOT/maven-antrun-plugin-1.4-SNAPSHOT.jar


Mime
View raw message