maven-notifications mailing list archives: September 2008

Site index · List index
Message list1 · 2 · 3 · 4 · 5 · 6 · 7 · 8 · 9 · 10 · Next »Thread · Author · Date
[continuum] BUILD FAILURE: Maven 2.1.x (trunk) - Integration Test Executor - Build Def: default maven2 buildDefinition
Contin...@vmbuild.apache.org   [continuum] BUILD FAILURE: Maven 2.1.x (trunk) - Integration Test Executor - Build Def: default maven2 buildDefinition Mon, 01 Sep, 02:00
Contin...@vmbuild.apache.org   [continuum] BUILD FAILURE: Maven 2.1.x (trunk) - Integration Test Executor - Build Def: default maven2 buildDefinition Mon, 01 Sep, 08:20
Contin...@vmbuild.apache.org   [continuum] BUILD FAILURE: Maven 2.1.x (trunk) - Integration Test Executor - Build Def: default maven2 buildDefinition Mon, 01 Sep, 20:39
Contin...@vmbuild.apache.org   [continuum] BUILD FAILURE: Maven 2.1.x (trunk) - Integration Test Executor - Build Def: default maven2 buildDefinition Tue, 02 Sep, 02:52
Contin...@vmbuild.apache.org   [continuum] BUILD FAILURE: Maven 2.1.x (trunk) - Integration Test Executor - Build Def: default maven2 buildDefinition Tue, 02 Sep, 05:56
Contin...@vmbuild.apache.org   [continuum] BUILD FAILURE: Maven 2.1.x (trunk) - Integration Test Executor - Build Def: default maven2 buildDefinition Thu, 04 Sep, 20:52
Contin...@vmbuild.apache.org   [continuum] BUILD FAILURE: Maven 2.1.x (trunk) - Integration Test Executor - Build Def: default maven2 buildDefinition Fri, 05 Sep, 06:23
Contin...@vmbuild.apache.org   [continuum] BUILD FAILURE: Maven 2.1.x (trunk) - Integration Test Executor - Build Def: default maven2 buildDefinition Fri, 05 Sep, 08:56
Contin...@vmbuild.apache.org   [continuum] BUILD FAILURE: Maven 2.1.x (trunk) - Integration Test Executor - Build Def: default maven2 buildDefinition Fri, 05 Sep, 13:10
Contin...@vmbuild.apache.org   [continuum] BUILD FAILURE: Maven 2.1.x (trunk) - Integration Test Executor - Build Def: default maven2 buildDefinition Wed, 10 Sep, 00:57
Contin...@vmbuild.apache.org   [continuum] BUILD FAILURE: Maven 2.1.x (trunk) - Integration Test Executor - Build Def: default maven2 buildDefinition Wed, 10 Sep, 03:54
Contin...@vmbuild.apache.org   [continuum] BUILD FAILURE: Maven 2.1.x (trunk) - Integration Test Executor - Build Def: default maven2 buildDefinition Wed, 10 Sep, 07:42
Contin...@vmbuild.apache.org   [continuum] BUILD FAILURE: Maven 2.1.x (trunk) - Integration Test Executor - Build Def: default maven2 buildDefinition Wed, 10 Sep, 10:34
Contin...@vmbuild.apache.org   [continuum] BUILD FAILURE: Maven 2.1.x (trunk) - Integration Test Executor - Build Def: default maven2 buildDefinition Thu, 11 Sep, 00:10
Hudson Build failed in Hudson: maven-shared » Maven Repository Builder #362 Mon, 01 Sep, 02:52
Hudson   Hudson build is back to normal: maven-shared » Maven Repository Builder #363 Mon, 01 Sep, 09:35
Build failed in Hudson: plugins-IT-with-maven-2.0.x » Maven Assembly Plugin #363
Hudson   Build failed in Hudson: plugins-IT-with-maven-2.0.x » Maven Assembly Plugin #363 Mon, 01 Sep, 10:11
Hudson     Build failed in Hudson: plugins-IT-with-maven-2.0.x » Maven Assembly Plugin #364 Mon, 01 Sep, 22:11
Hudson       Build failed in Hudson: plugins-IT-with-maven-2.0.x » Maven Assembly Plugin #365 Tue, 02 Sep, 06:11
Hudson         Build failed in Hudson: plugins-IT-with-maven-2.0.x » Maven Assembly Plugin #366 Tue, 02 Sep, 21:39
Hudson           Build failed in Hudson: plugins-IT-with-maven-2.0.x » Maven Assembly Plugin #367 Wed, 03 Sep, 05:39
Hudson             Build failed in Hudson: plugins-IT-with-maven-2.0.x » Maven Assembly Plugin #368 Wed, 03 Sep, 13:43
Hudson               Build failed in Hudson: plugins-IT-with-maven-2.0.x » Maven Assembly Plugin #369 Wed, 03 Sep, 21:49
Hudson                 Build failed in Hudson: plugins-IT-with-maven-2.0.x » Maven Assembly Plugin #370 Wed, 03 Sep, 22:23
Hudson                   Build failed in Hudson: plugins-IT-with-maven-2.0.x » Maven Assembly Plugin #371 Thu, 04 Sep, 06:09
Hudson Hudson build is back to stable: plugins-IT-with-maven-2.0.x » Maven Help Plugin #363 Mon, 01 Sep, 10:11
Hudson build is back to normal: plugins-IT-with-maven-2.0.x » Maven Changes Report Plugin #363
Hudson   Hudson build is back to normal: plugins-IT-with-maven-2.0.x » Maven Changes Report Plugin #363 Mon, 01 Sep, 10:11
Hudson Build failed in Hudson: plugins-IT-with-maven-2.0.x » Maven Changes Report Plugin #364 Mon, 01 Sep, 22:11
Hudson   Hudson build is back to normal: plugins-IT-with-maven-2.0.x » Maven Changes Report Plugin #365 Tue, 02 Sep, 06:11
Hudson Hudson build became unstable: plugins-IT-with-maven-2.0.x » Maven Help Plugin #364 Mon, 01 Sep, 22:11
Hudson   Hudson build is back to stable: plugins-IT-with-maven-2.0.x » Maven Help Plugin #365 Tue, 02 Sep, 06:11
Hudson Build failed in Hudson: plugins-IT-with-maven-2.0.x » Maven Changes Report Plugin #366 Tue, 02 Sep, 21:39
Hudson   Hudson build is back to normal: plugins-IT-with-maven-2.0.x » Maven Changes Report Plugin #367 Wed, 03 Sep, 05:39
Hudson Hudson build became unstable: plugins-IT-with-maven-2.0.x » Maven Help Plugin #366 Tue, 02 Sep, 21:39
Hudson   Hudson build is back to stable: plugins-IT-with-maven-2.0.x » Maven Help Plugin #367 Wed, 03 Sep, 05:39
Hudson Hudson build became unstable: plugins-IT-with-maven-2.0.x » Maven Eclipse Plugin #366 Tue, 02 Sep, 21:39
Hudson   Hudson build is back to stable: plugins-IT-with-maven-2.0.x » Maven Eclipse Plugin #367 Wed, 03 Sep, 05:39
Hudson Build failed in Hudson: plugins-IT-with-maven-2.0.x » Maven Changes Report Plugin #368 Wed, 03 Sep, 13:43
Hudson   Build failed in Hudson: plugins-IT-with-maven-2.0.x » Maven Changes Report Plugin #369 Wed, 03 Sep, 21:49
Hudson     Build failed in Hudson: plugins-IT-with-maven-2.0.x » Maven Changes Report Plugin #370 Wed, 03 Sep, 22:23
Hudson       Hudson build is back to normal: plugins-IT-with-maven-2.0.x » Maven Changes Report Plugin #371 Thu, 04 Sep, 06:09
Hudson Hudson build became unstable: plugins-IT-with-maven-2.0.x » Maven Help Plugin #368 Wed, 03 Sep, 13:43
Hudson Hudson build became unstable: plugins-IT-with-maven-2.0.x » Maven Eclipse Plugin #368 Wed, 03 Sep, 13:43
[continuum] BUILD FAILURE: Maven 2.0.x Branch - Integration Test Executor - Build Def: default maven2 buildDefinition
Contin...@vmbuild.apache.org   [continuum] BUILD FAILURE: Maven 2.0.x Branch - Integration Test Executor - Build Def: default maven2 buildDefinition Wed, 03 Sep, 22:30
Contin...@vmbuild.apache.org   [continuum] BUILD FAILURE: Maven 2.0.x Branch - Integration Test Executor - Build Def: default maven2 buildDefinition Thu, 04 Sep, 00:30
Contin...@vmbuild.apache.org   [continuum] BUILD FAILURE: Maven 2.0.x Branch - Integration Test Executor - Build Def: default maven2 buildDefinition Mon, 08 Sep, 17:59
Contin...@vmbuild.apache.org   [continuum] BUILD FAILURE: Maven 2.0.x Branch - Integration Test Executor - Build Def: default maven2 buildDefinition Tue, 09 Sep, 01:04
Contin...@vmbuild.apache.org   [continuum] BUILD FAILURE: Maven 2.0.x Branch - Integration Test Executor - Build Def: default maven2 buildDefinition Tue, 09 Sep, 04:38
Contin...@vmbuild.apache.org   [continuum] BUILD FAILURE: Maven 2.0.x Branch - Integration Test Executor - Build Def: default maven2 buildDefinition Tue, 09 Sep, 22:11
Contin...@vmbuild.apache.org   [continuum] BUILD FAILURE: Maven 2.0.x Branch - Integration Test Executor - Build Def: default maven2 buildDefinition Wed, 10 Sep, 02:06
Contin...@vmbuild.apache.org   [continuum] BUILD FAILURE: Maven 2.0.x Branch - Integration Test Executor - Build Def: default maven2 buildDefinition Wed, 10 Sep, 05:49
Contin...@vmbuild.apache.org   [continuum] BUILD FAILURE: Maven 2.0.x Branch - Integration Test Executor - Build Def: default maven2 buildDefinition Wed, 10 Sep, 19:00
Contin...@vmbuild.apache.org   [continuum] BUILD FAILURE: Maven 2.0.x Branch - Integration Test Executor - Build Def: default maven2 buildDefinition Wed, 10 Sep, 20:58
Contin...@vmbuild.apache.org   [continuum] BUILD FAILURE: Maven 2.0.x Branch - Integration Test Executor - Build Def: default maven2 buildDefinition Wed, 10 Sep, 22:17
Contin...@vmbuild.apache.org   [continuum] BUILD FAILURE: Maven 2.0.x Branch - Integration Test Executor - Build Def: default maven2 buildDefinition Thu, 11 Sep, 01:45
Contin...@vmbuild.apache.org   [continuum] BUILD FAILURE: Maven 2.0.x Branch - Integration Test Executor - Build Def: default maven2 buildDefinition Thu, 11 Sep, 03:55
Contin...@vmbuild.apache.org   [continuum] BUILD FAILURE: Maven 2.0.x Branch - Integration Test Executor - Build Def: default maven2 buildDefinition Thu, 11 Sep, 12:04
Contin...@vmbuild.apache.org   [continuum] BUILD FAILURE: Maven 2.0.x Branch - Integration Test Executor - Build Def: default maven2 buildDefinition Thu, 11 Sep, 17:59
Contin...@vmbuild.apache.org   [continuum] BUILD FAILURE: Maven 2.0.x Branch - Integration Test Executor - Build Def: default maven2 buildDefinition Fri, 12 Sep, 17:09
Contin...@vmbuild.apache.org   [continuum] BUILD FAILURE: Maven 2.0.x Branch - Integration Test Executor - Build Def: default maven2 buildDefinition Sat, 13 Sep, 21:34
Contin...@vmbuild.apache.org   [continuum] BUILD FAILURE: Maven 2.0.x Branch - Integration Test Executor - Build Def: default maven2 buildDefinition Sun, 14 Sep, 15:39
Contin...@vmbuild.apache.org   [continuum] BUILD FAILURE: Maven 2.0.x Branch - Integration Test Executor - Build Def: default maven2 buildDefinition Tue, 16 Sep, 12:17
Contin...@vmbuild.apache.org   [continuum] BUILD FAILURE: Maven 2.0.x Branch - Integration Test Executor - Build Def: default maven2 buildDefinition Tue, 16 Sep, 14:54
Contin...@vmbuild.apache.org   [continuum] BUILD FAILURE: Maven 2.0.x Branch - Integration Test Executor - Build Def: default maven2 buildDefinition Thu, 18 Sep, 00:00
Contin...@vmbuild.apache.org   [continuum] BUILD FAILURE: Maven 2.0.x Branch - Integration Test Executor - Build Def: default maven2 buildDefinition Fri, 19 Sep, 18:27
Contin...@vmbuild.apache.org   [continuum] BUILD FAILURE: Maven 2.0.x Branch - Integration Test Executor - Build Def: default maven2 buildDefinition Fri, 19 Sep, 22:54
Contin...@vmbuild.apache.org   [continuum] BUILD FAILURE: Maven 2.0.x Branch - Integration Test Executor - Build Def: default maven2 buildDefinition Sat, 20 Sep, 00:49
Contin...@vmbuild.apache.org   [continuum] BUILD FAILURE: Maven 2.0.x Branch - Integration Test Executor - Build Def: default maven2 buildDefinition Sat, 20 Sep, 14:32
Contin...@vmbuild.apache.org   [continuum] BUILD FAILURE: Maven 2.0.x Branch - Integration Test Executor - Build Def: default maven2 buildDefinition Sat, 20 Sep, 20:23
Contin...@vmbuild.apache.org   [continuum] BUILD FAILURE: Maven 2.0.x Branch - Integration Test Executor - Build Def: default maven2 buildDefinition Sat, 20 Sep, 22:11
Contin...@vmbuild.apache.org   [continuum] BUILD FAILURE: Maven 2.0.x Branch - Integration Test Executor - Build Def: default maven2 buildDefinition Sun, 21 Sep, 14:23
Contin...@vmbuild.apache.org   [continuum] BUILD FAILURE: Maven 2.0.x Branch - Integration Test Executor - Build Def: default maven2 buildDefinition Sun, 21 Sep, 16:21
Contin...@vmbuild.apache.org   [continuum] BUILD FAILURE: Maven 2.0.x Branch - Integration Test Executor - Build Def: default maven2 buildDefinition Sun, 21 Sep, 18:13
Contin...@vmbuild.apache.org   [continuum] BUILD FAILURE: Maven 2.0.x Branch - Integration Test Executor - Build Def: default maven2 buildDefinition Sun, 21 Sep, 20:16
Contin...@vmbuild.apache.org   [continuum] BUILD FAILURE: Maven 2.0.x Branch - Integration Test Executor - Build Def: default maven2 buildDefinition Sun, 21 Sep, 22:19
Contin...@vmbuild.apache.org   [continuum] BUILD FAILURE: Maven 2.0.x Branch - Integration Test Executor - Build Def: default maven2 buildDefinition Sun, 21 Sep, 23:46
Contin...@vmbuild.apache.org   [continuum] BUILD FAILURE: Maven 2.0.x Branch - Integration Test Executor - Build Def: default maven2 buildDefinition Mon, 22 Sep, 01:01
Contin...@vmbuild.apache.org   [continuum] BUILD FAILURE: Maven 2.0.x Branch - Integration Test Executor - Build Def: default maven2 buildDefinition Mon, 22 Sep, 02:46
Contin...@vmbuild.apache.org   [continuum] BUILD FAILURE: Maven 2.0.x Branch - Integration Test Executor - Build Def: default maven2 buildDefinition Mon, 22 Sep, 04:03
Hudson Hudson build is back to stable: plugins-IT-with-maven-2.0.x » Maven Help Plugin #371 Thu, 04 Sep, 06:09
Hudson build is back to normal: Archetype #43
Hudson   Hudson build is back to normal: Archetype #43 Thu, 04 Sep, 12:17
Build failed in Hudson: Maven-2.0.x » Maven Artifact #330
Hudson   Build failed in Hudson: Maven-2.0.x » Maven Artifact #330 Thu, 04 Sep, 12:21
Hudson     Build failed in Hudson: Maven-2.0.x » Maven Artifact #331 Thu, 04 Sep, 13:27
Hudson       Build failed in Hudson: Maven-2.0.x » Maven Artifact #332 Thu, 04 Sep, 13:35
Hudson         Build failed in Hudson: Maven-2.0.x » Maven Artifact #333 Sun, 07 Sep, 13:37
Hudson           Hudson build is back to normal: Maven-2.0.x » Maven Artifact #334 Wed, 10 Sep, 21:05
Hudson build is back to normal: maven-core-integration-testing #160
Hudson   Hudson build is back to normal: maven-core-integration-testing #160 Thu, 04 Sep, 12:37
Hudson Build failed in Hudson: plugins-IT-with-maven-2.0.x » Maven Plugins #372 Thu, 04 Sep, 13:26
Hudson   Hudson build is back to normal: plugins-IT-with-maven-2.0.x » Maven Plugins #373 Thu, 04 Sep, 14:18
Hudson Build failed in Hudson: plugins-IT-with-maven-2.0.x » Maven Assembly Plugin #373 Thu, 04 Sep, 14:18
Hudson   Build failed in Hudson: plugins-IT-with-maven-2.0.x » Maven Assembly Plugin #374 Thu, 04 Sep, 14:55
Hudson     Build failed in Hudson: plugins-IT-with-maven-2.0.x » Maven Assembly Plugin #375 Thu, 04 Sep, 21:46
Hudson Build failed in Hudson: plugins-IT-with-maven-2.0.x » Maven Changes Report Plugin #373 Thu, 04 Sep, 14:18
Hudson   Build failed in Hudson: plugins-IT-with-maven-2.0.x » Maven Changes Report Plugin #374 Thu, 04 Sep, 14:55
Hudson     Build failed in Hudson: plugins-IT-with-maven-2.0.x » Maven Changes Report Plugin #375 Thu, 04 Sep, 21:46
Hudson build is back to normal: maven-artifact #65
Hudson   Hudson build is back to normal: maven-artifact #65 Thu, 04 Sep, 17:47
Build failed in Hudson: Maven-2.1.x-with-bootstrap #41
Apache Hudson Server   Build failed in Hudson: Maven-2.1.x-with-bootstrap #41 Thu, 04 Sep, 19:16
Apache Hudson Server     Build failed in Hudson: Maven-2.1.x-with-bootstrap #42 Tue, 09 Sep, 01:22
Apache Hudson Server       Build failed in Hudson: Maven-2.1.x-with-bootstrap #43 Wed, 10 Sep, 03:21
Apache Hudson Server         Build failed in Hudson: Maven-2.1.x-with-bootstrap #44 Wed, 10 Sep, 06:57
Apache Hudson Server           Build failed in Hudson: Maven-2.1.x-with-bootstrap #45 Wed, 10 Sep, 08:22
Apache Hudson Server             Build failed in Hudson: Maven-2.1.x-with-bootstrap #46 Wed, 10 Sep, 23:50
Apache Hudson Server               Build failed in Hudson: Maven-2.1.x-with-bootstrap #47 Thu, 11 Sep, 05:21
Apache Hudson Server                 Build failed in Hudson: Maven-2.1.x-with-bootstrap #48 Thu, 11 Sep, 09:28
Apache Hudson Server                   Build failed in Hudson: Maven-2.1.x-with-bootstrap #49 Thu, 11 Sep, 17:34
Apache Hudson Server                     Build failed in Hudson: Maven-2.1.x-with-bootstrap #50 Fri, 12 Sep, 02:04
Apache Hudson Server                       Build failed in Hudson: Maven-2.1.x-with-bootstrap #51 Fri, 12 Sep, 03:21
Apache Hudson Server                         Build failed in Hudson: Maven-2.1.x-with-bootstrap #52 Fri, 12 Sep, 04:22
Apache Hudson Server                           Build failed in Hudson: Maven-2.1.x-with-bootstrap #53 Fri, 12 Sep, 11:04
Apache Hudson Server                             Build failed in Hudson: Maven-2.1.x-with-bootstrap #54 Fri, 12 Sep, 16:49
Apache Hudson Server                               Build failed in Hudson: Maven-2.1.x-with-bootstrap #55 Fri, 12 Sep, 17:20
Apache Hudson Server                                 Build failed in Hudson: Maven-2.1.x-with-bootstrap #56 Sat, 13 Sep, 10:21
Apache Hudson Server                                   Build failed in Hudson: Maven-2.1.x-with-bootstrap #57 Sat, 13 Sep, 19:20
Apache Hudson Server                                     Build failed in Hudson: Maven-2.1.x-with-bootstrap #58 Sat, 13 Sep, 21:20
Apache Hudson Server                                       Build failed in Hudson: Maven-2.1.x-with-bootstrap #59 Sun, 14 Sep, 05:20
Apache Hudson Server                                         Build failed in Hudson: Maven-2.1.x-with-bootstrap #60 Sun, 14 Sep, 12:58
Apache Hudson Server                                           Build failed in Hudson: Maven-2.1.x-with-bootstrap #61 Sun, 14 Sep, 16:20
Apache Hudson Server                                             Build failed in Hudson: Maven-2.1.x-with-bootstrap #62 Mon, 15 Sep, 03:20
Apache Hudson Server                                               Build failed in Hudson: Maven-2.1.x-with-bootstrap #63 Mon, 15 Sep, 21:21
Apache Hudson Server                                                 Build failed in Hudson: Maven-2.1.x-with-bootstrap #64 Tue, 16 Sep, 04:21
Apache Hudson Server                                                   Build failed in Hudson: Maven-2.1.x-with-bootstrap #65 Tue, 16 Sep, 15:21
Apache Hudson Server                                                     Build failed in Hudson: Maven-2.1.x-with-bootstrap #66 Wed, 17 Sep, 14:42
Apache Hudson Server                                                       Build failed in Hudson: Maven-2.1.x-with-bootstrap #67 Wed, 17 Sep, 15:24
Apache Hudson Server                                                         Build failed in Hudson: Maven-2.1.x-with-bootstrap #68 Thu, 18 Sep, 10:21
Apache Hudson Server                                                           Build failed in Hudson: Maven-2.1.x-with-bootstrap #69 Thu, 18 Sep, 12:17
Apache Hudson Server                                                             Build failed in Hudson: Maven-2.1.x-with-bootstrap #70 Thu, 18 Sep, 19:27
Apache Hudson Server                                                               Build failed in Hudson: Maven-2.1.x-with-bootstrap #71 Mon, 22 Sep, 18:54
Apache Hudson Server                                                                 Build failed in Hudson: Maven-2.1.x-with-bootstrap #72 Mon, 22 Sep, 22:05
Apache Hudson Server                                                                   Build failed in Hudson: Maven-2.1.x-with-bootstrap #73 Thu, 25 Sep, 17:24
Apache Hudson Server                                                                     Build failed in Hudson: Maven-2.1.x-with-bootstrap #74 Sat, 27 Sep, 15:21
Apache Hudson Server                                                                       Build failed in Hudson: Maven-2.1.x-with-bootstrap #75 Sun, 28 Sep, 05:21
Apache Hudson Server                                                                         Build failed in Hudson: Maven-2.1.x-with-bootstrap #76 Sun, 28 Sep, 14:31
Apache Hudson Server                                                                           Build failed in Hudson: Maven-2.1.x-with-bootstrap #77 Sun, 28 Sep, 16:20
Apache Hudson Server                                                                             Build failed in Hudson: Maven-2.1.x-with-bootstrap #78 Sun, 28 Sep, 17:20
Apache Hudson Server                                                                               Build failed in Hudson: Maven-2.1.x-with-bootstrap #79 Sun, 28 Sep, 19:20
Apache Hudson Server                                                                                 Build failed in Hudson: Maven-2.1.x-with-bootstrap #80 Mon, 29 Sep, 23:05
Apache Hudson Server                                                                                   Build failed in Hudson: Maven-2.1.x-with-bootstrap #81 Tue, 30 Sep, 00:02
Apache Hudson Server                                                                                     Build failed in Hudson: Maven-2.1.x-with-bootstrap #82 Tue, 30 Sep, 04:20
Apache Hudson Server                                                                                       Build failed in Hudson: Maven-2.1.x-with-bootstrap #83 Tue, 30 Sep, 06:51
Hudson Build failed in Hudson: plugins-IT-with-maven-2.0.x » Maven Assembly Plugin #377 Fri, 05 Sep, 10:20
Hudson   Build failed in Hudson: plugins-IT-with-maven-2.0.x » Maven Assembly Plugin #378 Fri, 05 Sep, 14:21
Hudson     Build failed in Hudson: plugins-IT-with-maven-2.0.x » Maven Assembly Plugin #379 Fri, 05 Sep, 21:26
Hudson       Build failed in Hudson: plugins-IT-with-maven-2.0.x » Maven Assembly Plugin #380 Fri, 05 Sep, 22:32
Hudson         Build failed in Hudson: plugins-IT-with-maven-2.0.x » Maven Assembly Plugin #381 Sat, 06 Sep, 05:43
Hudson           Build failed in Hudson: plugins-IT-with-maven-2.0.x » Maven Assembly Plugin #382 Sat, 06 Sep, 13:43
Hudson             Build failed in Hudson: plugins-IT-with-maven-2.0.x » Maven Assembly Plugin #383 Sat, 06 Sep, 14:26
Hudson               Build failed in Hudson: plugins-IT-with-maven-2.0.x » Maven Assembly Plugin #384 Sat, 06 Sep, 21:45
Hudson                 Build failed in Hudson: plugins-IT-with-maven-2.0.x » Maven Assembly Plugin #385 Sat, 06 Sep, 22:32
Hudson                   Build failed in Hudson: plugins-IT-with-maven-2.0.x » Maven Assembly Plugin #386 Sun, 07 Sep, 02:32
Hudson                     Build failed in Hudson: plugins-IT-with-maven-2.0.x » Maven Assembly Plugin #387 Sun, 07 Sep, 15:19
Hudson                       Build failed in Hudson: plugins-IT-with-maven-2.0.x » Maven Assembly Plugin #388 Sun, 07 Sep, 18:17
Hudson                         Build failed in Hudson: plugins-IT-with-maven-2.0.x » Maven Assembly Plugin #389 Tue, 09 Sep, 05:40
Hudson                           Build failed in Hudson: plugins-IT-with-maven-2.0.x » Maven Assembly Plugin #390 Wed, 10 Sep, 07:26
Hudson                             Build failed in Hudson: plugins-IT-with-maven-2.0.x » Maven Assembly Plugin #391 Wed, 10 Sep, 10:27
Hudson Build failed in Hudson: plugins-IT-with-maven-2.0.x » Maven Changes Report Plugin #378 Fri, 05 Sep, 14:21
Hudson   Build failed in Hudson: plugins-IT-with-maven-2.0.x » Maven Changes Report Plugin #379 Fri, 05 Sep, 21:26
Hudson     Build failed in Hudson: plugins-IT-with-maven-2.0.x » Maven Changes Report Plugin #380 Fri, 05 Sep, 22:32
Hudson       Hudson build is back to normal: plugins-IT-with-maven-2.0.x » Maven Changes Report Plugin #381 Sat, 06 Sep, 05:43
Hudson Hudson build became unstable: plugins-IT-with-maven-2.0.x » Maven Help Plugin #378 Fri, 05 Sep, 14:21
Hudson Hudson build is back to stable: plugins-IT-with-maven-2.0.x » Maven Help Plugin #381 Sat, 06 Sep, 05:43
Hudson Build failed in Hudson: plugins-IT-with-maven-2.0.x » Maven Changes Report Plugin #382 Sat, 06 Sep, 13:43
Hudson   Build failed in Hudson: plugins-IT-with-maven-2.0.x » Maven Changes Report Plugin #383 Sat, 06 Sep, 14:26
Hudson     Build failed in Hudson: plugins-IT-with-maven-2.0.x » Maven Changes Report Plugin #384 Sat, 06 Sep, 21:45
Hudson       Build failed in Hudson: plugins-IT-with-maven-2.0.x » Maven Changes Report Plugin #385 Sat, 06 Sep, 22:32
Hudson         Build failed in Hudson: plugins-IT-with-maven-2.0.x » Maven Changes Report Plugin #386 Sun, 07 Sep, 02:32
Hudson           Hudson build is back to normal: plugins-IT-with-maven-2.0.x » Maven Changes Report Plugin #387 Sun, 07 Sep, 15:19
Hudson Hudson build became unstable: plugins-IT-with-maven-2.0.x » Maven Help Plugin #382 Sat, 06 Sep, 13:43
Hudson Hudson build is back to stable: plugins-IT-with-maven-2.0.x » Maven Help Plugin #387 Sun, 07 Sep, 15:19
Hudson Build failed in Hudson: plugins-CI-with-maven-2.0.x » Maven Patch Plugin #337 Sun, 07 Sep, 17:23
Hudson   Hudson build is back to normal: plugins-CI-with-maven-2.0.x » Maven Patch Plugin #338 Sun, 07 Sep, 17:28
Hudson Build failed in Hudson: plugins-CI-with-maven-2.0.x » Maven PMD Plugin #337 Sun, 07 Sep, 17:23
Hudson   Hudson build is back to normal: plugins-CI-with-maven-2.0.x » Maven PMD Plugin #338 Sun, 07 Sep, 17:28
Hudson Build failed in Hudson: plugins-IT-with-maven-2.0.x » Maven Changes Report Plugin #388 Sun, 07 Sep, 18:17
Hudson   Hudson build is back to normal: plugins-IT-with-maven-2.0.x » Maven Changes Report Plugin #389 Tue, 09 Sep, 05:40
Hudson Hudson build became unstable: plugins-IT-with-maven-2.0.x » Maven Help Plugin #388 Sun, 07 Sep, 18:17
Hudson   Hudson build is back to stable: plugins-IT-with-maven-2.0.x » Maven Help Plugin #389 Tue, 09 Sep, 05:40
[continuum] BUILD ERROR: Maven 2.1.x (trunk) - Integration Test Executor - Build Def: default maven2 buildDefinition
Contin...@vmbuild.apache.org   [continuum] BUILD ERROR: Maven 2.1.x (trunk) - Integration Test Executor - Build Def: default maven2 buildDefinition Tue, 09 Sep, 03:55
Contin...@vmbuild.apache.org   [continuum] BUILD ERROR: Maven 2.1.x (trunk) - Integration Test Executor - Build Def: default maven2 buildDefinition Tue, 09 Sep, 06:51
Contin...@vmbuild.apache.org   [continuum] BUILD ERROR: Maven 2.1.x (trunk) - Integration Test Executor - Build Def: default maven2 buildDefinition Tue, 09 Sep, 09:22
Contin...@vmbuild.apache.org   [continuum] BUILD ERROR: Maven 2.1.x (trunk) - Integration Test Executor - Build Def: default maven2 buildDefinition Tue, 09 Sep, 12:33
Contin...@vmbuild.apache.org   [continuum] BUILD ERROR: Maven 2.1.x (trunk) - Integration Test Executor - Build Def: default maven2 buildDefinition Tue, 09 Sep, 15:46
Contin...@vmbuild.apache.org   [continuum] BUILD ERROR: Maven 2.1.x (trunk) - Integration Test Executor - Build Def: default maven2 buildDefinition Tue, 09 Sep, 18:28
Contin...@vmbuild.apache.org   [continuum] BUILD ERROR: Maven 2.1.x (trunk) - Integration Test Executor - Build Def: default maven2 buildDefinition Tue, 09 Sep, 21:25
Hudson Hudson build became unstable: plugins-IT-with-maven-2.0.x » Maven Javadoc Plugin #390 Wed, 10 Sep, 07:26
Hudson   Hudson build is back to stable: plugins-IT-with-maven-2.0.x » Maven Javadoc Plugin #391 Wed, 10 Sep, 10:27
Hudson Hudson build became unstable: plugins-IT-with-maven-2.0.x » Maven Help Plugin #391 Wed, 10 Sep, 10:27
Hudson Build failed in Hudson: plugins-IT-with-maven-2.0.x » Maven WAR Plugin #391 Wed, 10 Sep, 10:27
Hudson Build failed in Hudson: plugins-IT-with-maven-2.0.x » Maven Changes Report Plugin #391 Wed, 10 Sep, 10:27
Hudson Build failed in Hudson: plugins-IT-with-maven-2.0.x » Maven Assembly Plugin #393 Wed, 10 Sep, 14:35
Hudson   Build failed in Hudson: plugins-IT-with-maven-2.0.x » Maven Assembly Plugin #394 Wed, 10 Sep, 15:25
Hudson     Build failed in Hudson: plugins-IT-with-maven-2.0.x » Maven Assembly Plugin #395 Wed, 10 Sep, 21:47
Hudson       Build failed in Hudson: plugins-IT-with-maven-2.0.x » Maven Assembly Plugin #396 Wed, 10 Sep, 22:39
Hudson         Build failed in Hudson: plugins-IT-with-maven-2.0.x » Maven Assembly Plugin #397 Thu, 11 Sep, 02:24
Hudson           Build failed in Hudson: plugins-IT-with-maven-2.0.x » Maven Assembly Plugin #398 Thu, 11 Sep, 02:59
Hudson             Build failed in Hudson: plugins-IT-with-maven-2.0.x » Maven Assembly Plugin #399 Thu, 11 Sep, 06:35
Hudson               Build failed in Hudson: plugins-IT-with-maven-2.0.x » Maven Assembly Plugin #400 Thu, 11 Sep, 18:53
Hudson                 Build failed in Hudson: plugins-IT-with-maven-2.0.x » Maven Assembly Plugin #401 Thu, 11 Sep, 21:43
Hudson                   Hudson build is back to normal: plugins-IT-with-maven-2.0.x » Maven Assembly Plugin #402 Fri, 12 Sep, 02:44
Message list1 · 2 · 3 · 4 · 5 · 6 · 7 · 8 · 9 · 10 · Next »Thread · Author · Date
Box list
Sep 20146
Aug 2014246
Jul 2014317
Jun 2014341
May 2014161
Apr 2014146
Mar 2014336
Feb 2014308
Jan 2014189
Dec 2013319
Nov 2013274
Oct 2013167
Sep 2013486
Aug 2013263
Jul 2013726
Jun 2013722
May 2013378
Apr 2013313
Mar 2013467
Feb 2013520
Jan 20131437
Dec 20121778
Nov 2012775
Oct 20121224
Sep 2012791
Aug 2012362
Jul 2012232
Jun 2012149
May 2012189
Apr 2012115
Mar 201257
Feb 2012155
Jan 2012170
Dec 2011244
Nov 2011187
Oct 2011139
Sep 2011190
Aug 2011276
Jul 201194
Jun 20114
Apr 201162
Mar 201176
Feb 201154
Jan 201185
Dec 201079
Nov 201061
Oct 201058
Sep 20101
Aug 201057
Jul 201037
Jun 201020
May 201075
Apr 201053
Mar 201012
Feb 201030
Jan 201071
Dec 2009104
Nov 200919
Oct 200931
Sep 2009193
Aug 2009268
Jul 2009193
Jun 2009147
May 200975
Apr 200979
Mar 2009134
Feb 2009657
Jan 200983
Dec 2008349
Nov 2008288
Oct 2008986
Sep 2008842
Aug 2008707
Jul 2008887
Jun 2008167
May 200821
Apr 2008231
Mar 2008438
Feb 2008317
Jan 2008205
Dec 2007185
Nov 2007532
Oct 2007439
Sep 2007699
Aug 20071294
Jul 2007351
Jun 20072211
May 2007273
Apr 2007262
Mar 2007534
Feb 20071648
Jan 20072359
Dec 2006575
Nov 2006357
Oct 2006642
Sep 2006660
Aug 20061662
Jul 20061320
Jun 2006473
May 20064700
Apr 20061113
Mar 20061048