maven-notifications mailing list archives: September 2008

Site index · List index
Message list1 · 2 · 3 · 4 · 5 · 6 · 7 · 8 · 9 · Next »Thread · Author · Date
Contin...@vmbuild.apache.org [continuum] BUILD FAILURE: Maven 2.1.x (trunk) - Integration Test Executor - Build Def: default maven2 buildDefinition Mon, 01 Sep, 02:00
Hudson Build failed in Hudson: maven-shared » Maven Repository Builder #362 Mon, 01 Sep, 02:52
Contin...@vmbuild.apache.org [continuum] BUILD FAILURE: Maven 2.1.x (trunk) - Integration Test Executor - Build Def: default maven2 buildDefinition Mon, 01 Sep, 08:20
Hudson Hudson build is back to normal: maven-shared » Maven Repository Builder #363 Mon, 01 Sep, 09:35
Hudson Hudson build is back to normal: plugins-IT-with-maven-2.0.x » Maven Changes Report Plugin #363 Mon, 01 Sep, 10:11
Hudson Build failed in Hudson: plugins-IT-with-maven-2.0.x » Maven Assembly Plugin #363 Mon, 01 Sep, 10:11
Hudson Hudson build is back to stable: plugins-IT-with-maven-2.0.x » Maven Help Plugin #363 Mon, 01 Sep, 10:11
Contin...@vmbuild.apache.org [continuum] BUILD FAILURE: Maven 2.1.x (trunk) - Integration Test Executor - Build Def: default maven2 buildDefinition Mon, 01 Sep, 20:39
Hudson Build failed in Hudson: plugins-IT-with-maven-2.0.x » Maven Assembly Plugin #364 Mon, 01 Sep, 22:11
Hudson Hudson build became unstable: plugins-IT-with-maven-2.0.x » Maven Help Plugin #364 Mon, 01 Sep, 22:11
Hudson Build failed in Hudson: plugins-IT-with-maven-2.0.x » Maven Changes Report Plugin #364 Mon, 01 Sep, 22:11
Contin...@vmbuild.apache.org [continuum] BUILD FAILURE: Maven 2.1.x (trunk) - Integration Test Executor - Build Def: default maven2 buildDefinition Tue, 02 Sep, 02:52
Contin...@vmbuild.apache.org [continuum] BUILD FAILURE: Maven 2.1.x (trunk) - Integration Test Executor - Build Def: default maven2 buildDefinition Tue, 02 Sep, 05:56
Hudson Hudson build is back to normal: plugins-IT-with-maven-2.0.x » Maven Changes Report Plugin #365 Tue, 02 Sep, 06:11
Hudson Build failed in Hudson: plugins-IT-with-maven-2.0.x » Maven Assembly Plugin #365 Tue, 02 Sep, 06:11
Hudson Hudson build is back to stable: plugins-IT-with-maven-2.0.x » Maven Help Plugin #365 Tue, 02 Sep, 06:11
Hudson Build failed in Hudson: plugins-IT-with-maven-2.0.x » Maven Changes Report Plugin #366 Tue, 02 Sep, 21:39
Hudson Build failed in Hudson: plugins-IT-with-maven-2.0.x » Maven Assembly Plugin #366 Tue, 02 Sep, 21:39
Hudson Hudson build became unstable: plugins-IT-with-maven-2.0.x » Maven Help Plugin #366 Tue, 02 Sep, 21:39
Hudson Hudson build became unstable: plugins-IT-with-maven-2.0.x » Maven Eclipse Plugin #366 Tue, 02 Sep, 21:39
Hudson Build failed in Hudson: plugins-IT-with-maven-2.0.x » Maven Assembly Plugin #367 Wed, 03 Sep, 05:39
Hudson Hudson build is back to normal: plugins-IT-with-maven-2.0.x » Maven Changes Report Plugin #367 Wed, 03 Sep, 05:39
Hudson Hudson build is back to stable: plugins-IT-with-maven-2.0.x » Maven Help Plugin #367 Wed, 03 Sep, 05:39
Hudson Hudson build is back to stable: plugins-IT-with-maven-2.0.x » Maven Eclipse Plugin #367 Wed, 03 Sep, 05:39
Hudson Hudson build became unstable: plugins-IT-with-maven-2.0.x » Maven Help Plugin #368 Wed, 03 Sep, 13:43
Hudson Build failed in Hudson: plugins-IT-with-maven-2.0.x » Maven Changes Report Plugin #368 Wed, 03 Sep, 13:43
Hudson Hudson build became unstable: plugins-IT-with-maven-2.0.x » Maven Eclipse Plugin #368 Wed, 03 Sep, 13:43
Hudson Build failed in Hudson: plugins-IT-with-maven-2.0.x » Maven Assembly Plugin #368 Wed, 03 Sep, 13:43
Hudson Build failed in Hudson: plugins-IT-with-maven-2.0.x » Maven Changes Report Plugin #369 Wed, 03 Sep, 21:49
Hudson Build failed in Hudson: plugins-IT-with-maven-2.0.x » Maven Assembly Plugin #369 Wed, 03 Sep, 21:49
Hudson Build failed in Hudson: plugins-IT-with-maven-2.0.x » Maven Assembly Plugin #370 Wed, 03 Sep, 22:23
Hudson Build failed in Hudson: plugins-IT-with-maven-2.0.x » Maven Changes Report Plugin #370 Wed, 03 Sep, 22:23
Contin...@vmbuild.apache.org [continuum] BUILD FAILURE: Maven 2.0.x Branch - Integration Test Executor - Build Def: default maven2 buildDefinition Wed, 03 Sep, 22:30
Contin...@vmbuild.apache.org [continuum] BUILD FAILURE: Maven 2.0.x Branch - Integration Test Executor - Build Def: default maven2 buildDefinition Thu, 04 Sep, 00:30
Hudson Hudson build is back to normal: plugins-IT-with-maven-2.0.x » Maven Changes Report Plugin #371 Thu, 04 Sep, 06:09
Hudson Hudson build is back to stable: plugins-IT-with-maven-2.0.x » Maven Help Plugin #371 Thu, 04 Sep, 06:09
Hudson Build failed in Hudson: plugins-IT-with-maven-2.0.x » Maven Assembly Plugin #371 Thu, 04 Sep, 06:09
Hudson Hudson build is back to normal: Archetype #43 Thu, 04 Sep, 12:17
Hudson Build failed in Hudson: Maven-2.0.x » Maven Artifact #330 Thu, 04 Sep, 12:21
Hudson Hudson build is back to normal: maven-core-integration-testing #160 Thu, 04 Sep, 12:37
Hudson Build failed in Hudson: plugins-IT-with-maven-2.0.x » Maven Plugins #372 Thu, 04 Sep, 13:26
Hudson Build failed in Hudson: Maven-2.0.x » Maven Artifact #331 Thu, 04 Sep, 13:27
Hudson Build failed in Hudson: Maven-2.0.x » Maven Artifact #332 Thu, 04 Sep, 13:35
Hudson Build failed in Hudson: plugins-IT-with-maven-2.0.x » Maven Changes Report Plugin #373 Thu, 04 Sep, 14:18
Hudson Hudson build is back to normal: plugins-IT-with-maven-2.0.x » Maven Plugins #373 Thu, 04 Sep, 14:18
Hudson Build failed in Hudson: plugins-IT-with-maven-2.0.x » Maven Assembly Plugin #373 Thu, 04 Sep, 14:18
Hudson Build failed in Hudson: plugins-IT-with-maven-2.0.x » Maven Assembly Plugin #374 Thu, 04 Sep, 14:55
Hudson Build failed in Hudson: plugins-IT-with-maven-2.0.x » Maven Changes Report Plugin #374 Thu, 04 Sep, 14:55
Hudson Hudson build is back to normal: maven-artifact #65 Thu, 04 Sep, 17:47
Apache Hudson Server Build failed in Hudson: Maven-2.1.x-with-bootstrap #41 Thu, 04 Sep, 19:16
Contin...@vmbuild.apache.org [continuum] BUILD FAILURE: Maven 2.1.x (trunk) - Integration Test Executor - Build Def: default maven2 buildDefinition Thu, 04 Sep, 20:52
Hudson Build failed in Hudson: plugins-IT-with-maven-2.0.x » Maven Assembly Plugin #375 Thu, 04 Sep, 21:46
Hudson Build failed in Hudson: plugins-IT-with-maven-2.0.x » Maven Changes Report Plugin #375 Thu, 04 Sep, 21:46
Contin...@vmbuild.apache.org [continuum] BUILD FAILURE: Maven 2.1.x (trunk) - Integration Test Executor - Build Def: default maven2 buildDefinition Fri, 05 Sep, 06:23
Contin...@vmbuild.apache.org [continuum] BUILD FAILURE: Maven 2.1.x (trunk) - Integration Test Executor - Build Def: default maven2 buildDefinition Fri, 05 Sep, 08:56
Hudson Build failed in Hudson: plugins-IT-with-maven-2.0.x » Maven Assembly Plugin #377 Fri, 05 Sep, 10:20
Contin...@vmbuild.apache.org [continuum] BUILD FAILURE: Maven 2.1.x (trunk) - Integration Test Executor - Build Def: default maven2 buildDefinition Fri, 05 Sep, 13:10
Hudson Build failed in Hudson: plugins-IT-with-maven-2.0.x » Maven Assembly Plugin #378 Fri, 05 Sep, 14:21
Hudson Build failed in Hudson: plugins-IT-with-maven-2.0.x » Maven Changes Report Plugin #378 Fri, 05 Sep, 14:21
Hudson Hudson build became unstable: plugins-IT-with-maven-2.0.x » Maven Help Plugin #378 Fri, 05 Sep, 14:21
Hudson Build failed in Hudson: plugins-IT-with-maven-2.0.x » Maven Changes Report Plugin #379 Fri, 05 Sep, 21:26
Hudson Build failed in Hudson: plugins-IT-with-maven-2.0.x » Maven Assembly Plugin #379 Fri, 05 Sep, 21:26
Hudson Build failed in Hudson: plugins-IT-with-maven-2.0.x » Maven Changes Report Plugin #380 Fri, 05 Sep, 22:32
Hudson Build failed in Hudson: plugins-IT-with-maven-2.0.x » Maven Assembly Plugin #380 Fri, 05 Sep, 22:32
Hudson Hudson build is back to stable: plugins-IT-with-maven-2.0.x » Maven Help Plugin #381 Sat, 06 Sep, 05:43
Hudson Build failed in Hudson: plugins-IT-with-maven-2.0.x » Maven Assembly Plugin #381 Sat, 06 Sep, 05:43
Hudson Hudson build is back to normal: plugins-IT-with-maven-2.0.x » Maven Changes Report Plugin #381 Sat, 06 Sep, 05:43
Hudson Build failed in Hudson: plugins-IT-with-maven-2.0.x » Maven Changes Report Plugin #382 Sat, 06 Sep, 13:43
Hudson Build failed in Hudson: plugins-IT-with-maven-2.0.x » Maven Assembly Plugin #382 Sat, 06 Sep, 13:43
Hudson Hudson build became unstable: plugins-IT-with-maven-2.0.x » Maven Help Plugin #382 Sat, 06 Sep, 13:43
Hudson Build failed in Hudson: plugins-IT-with-maven-2.0.x » Maven Assembly Plugin #383 Sat, 06 Sep, 14:26
Hudson Build failed in Hudson: plugins-IT-with-maven-2.0.x » Maven Changes Report Plugin #383 Sat, 06 Sep, 14:26
Hudson Build failed in Hudson: plugins-IT-with-maven-2.0.x » Maven Assembly Plugin #384 Sat, 06 Sep, 21:45
Hudson Build failed in Hudson: plugins-IT-with-maven-2.0.x » Maven Changes Report Plugin #384 Sat, 06 Sep, 21:45
Hudson Build failed in Hudson: plugins-IT-with-maven-2.0.x » Maven Assembly Plugin #385 Sat, 06 Sep, 22:32
Hudson Build failed in Hudson: plugins-IT-with-maven-2.0.x » Maven Changes Report Plugin #385 Sat, 06 Sep, 22:32
Hudson Build failed in Hudson: plugins-IT-with-maven-2.0.x » Maven Changes Report Plugin #386 Sun, 07 Sep, 02:32
Hudson Build failed in Hudson: plugins-IT-with-maven-2.0.x » Maven Assembly Plugin #386 Sun, 07 Sep, 02:32
Hudson Build failed in Hudson: Maven-2.0.x » Maven Artifact #333 Sun, 07 Sep, 13:37
Hudson Hudson build is back to normal: plugins-IT-with-maven-2.0.x » Maven Changes Report Plugin #387 Sun, 07 Sep, 15:19
Hudson Hudson build is back to stable: plugins-IT-with-maven-2.0.x » Maven Help Plugin #387 Sun, 07 Sep, 15:19
Hudson Build failed in Hudson: plugins-IT-with-maven-2.0.x » Maven Assembly Plugin #387 Sun, 07 Sep, 15:19
Hudson Build failed in Hudson: plugins-CI-with-maven-2.0.x » Maven PMD Plugin #337 Sun, 07 Sep, 17:23
Hudson Build failed in Hudson: plugins-CI-with-maven-2.0.x » Maven Patch Plugin #337 Sun, 07 Sep, 17:23
Hudson Hudson build is back to normal: plugins-CI-with-maven-2.0.x » Maven PMD Plugin #338 Sun, 07 Sep, 17:28
Hudson Hudson build is back to normal: plugins-CI-with-maven-2.0.x » Maven Patch Plugin #338 Sun, 07 Sep, 17:28
Hudson Build failed in Hudson: plugins-IT-with-maven-2.0.x » Maven Assembly Plugin #388 Sun, 07 Sep, 18:17
Hudson Hudson build became unstable: plugins-IT-with-maven-2.0.x » Maven Help Plugin #388 Sun, 07 Sep, 18:17
Hudson Build failed in Hudson: plugins-IT-with-maven-2.0.x » Maven Changes Report Plugin #388 Sun, 07 Sep, 18:17
Contin...@vmbuild.apache.org [continuum] BUILD FAILURE: Maven 2.0.x Branch - Integration Test Executor - Build Def: default maven2 buildDefinition Mon, 08 Sep, 17:59
Contin...@vmbuild.apache.org [continuum] BUILD FAILURE: Maven 2.0.x Branch - Integration Test Executor - Build Def: default maven2 buildDefinition Tue, 09 Sep, 01:04
Apache Hudson Server Build failed in Hudson: Maven-2.1.x-with-bootstrap #42 Tue, 09 Sep, 01:22
Contin...@vmbuild.apache.org [continuum] BUILD ERROR: Maven 2.1.x (trunk) - Integration Test Executor - Build Def: default maven2 buildDefinition Tue, 09 Sep, 03:55
Contin...@vmbuild.apache.org [continuum] BUILD FAILURE: Maven 2.0.x Branch - Integration Test Executor - Build Def: default maven2 buildDefinition Tue, 09 Sep, 04:38
Hudson Hudson build is back to stable: plugins-IT-with-maven-2.0.x » Maven Help Plugin #389 Tue, 09 Sep, 05:40
Hudson Build failed in Hudson: plugins-IT-with-maven-2.0.x » Maven Assembly Plugin #389 Tue, 09 Sep, 05:40
Hudson Hudson build is back to normal: plugins-IT-with-maven-2.0.x » Maven Changes Report Plugin #389 Tue, 09 Sep, 05:40
Contin...@vmbuild.apache.org [continuum] BUILD ERROR: Maven 2.1.x (trunk) - Integration Test Executor - Build Def: default maven2 buildDefinition Tue, 09 Sep, 06:51
Contin...@vmbuild.apache.org [continuum] BUILD ERROR: Maven 2.1.x (trunk) - Integration Test Executor - Build Def: default maven2 buildDefinition Tue, 09 Sep, 09:22
Contin...@vmbuild.apache.org [continuum] BUILD ERROR: Maven 2.1.x (trunk) - Integration Test Executor - Build Def: default maven2 buildDefinition Tue, 09 Sep, 12:33
Message list1 · 2 · 3 · 4 · 5 · 6 · 7 · 8 · 9 · Next »Thread · Author · Date
Box list
Jul 2014211
Jun 2014341
May 2014161
Apr 2014146
Mar 2014336
Feb 2014308
Jan 2014189
Dec 2013319
Nov 2013274
Oct 2013167
Sep 2013486
Aug 2013263
Jul 2013726
Jun 2013722
May 2013378
Apr 2013313
Mar 2013467
Feb 2013520
Jan 20131437
Dec 20121778
Nov 2012775
Oct 20121224
Sep 2012791
Aug 2012362
Jul 2012232
Jun 2012149
May 2012189
Apr 2012115
Mar 201257
Feb 2012155
Jan 2012170
Dec 2011244
Nov 2011187
Oct 2011139
Sep 2011190
Aug 2011276
Jul 201194
Jun 20114
Apr 201162
Mar 201176
Feb 201154
Jan 201185
Dec 201079
Nov 201061
Oct 201058
Sep 20101
Aug 201057
Jul 201037
Jun 201020
May 201075
Apr 201053
Mar 201012
Feb 201030
Jan 201071
Dec 2009104
Nov 200919
Oct 200931
Sep 2009193
Aug 2009268
Jul 2009193
Jun 2009147
May 200975
Apr 200979
Mar 2009134
Feb 2009657
Jan 200983
Dec 2008349
Nov 2008288
Oct 2008986
Sep 2008842
Aug 2008707
Jul 2008887
Jun 2008167
May 200821
Apr 2008231
Mar 2008438
Feb 2008317
Jan 2008205
Dec 2007185
Nov 2007532
Oct 2007439
Sep 2007699
Aug 20071294
Jul 2007351
Jun 20072211
May 2007273
Apr 2007262
Mar 2007534
Feb 20071648
Jan 20072359
Dec 2006575
Nov 2006357
Oct 2006642
Sep 2006660
Aug 20061662
Jul 20061320
Jun 2006473
May 20064700
Apr 20061113
Mar 20061048