maven-notifications mailing list archives: August 2008

Site index · List index
Message list1 · 2 · 3 · 4 · 5 · 6 · 7 · 8 · Next »Thread · Author · Date
Hudson build is back to stable: Maven-Plugins » Maven Ant Plugin #137
Hudson   Hudson build is back to stable: Maven-Plugins » Maven Ant Plugin #137 Fri, 01 Aug, 01:28
Build failed in Hudson: Maven-Plugins » Maven Patch Plugin #137
Hudson   Build failed in Hudson: Maven-Plugins » Maven Patch Plugin #137 Fri, 01 Aug, 01:28
Hudson     Build failed in Hudson: Maven-Plugins » Maven Patch Plugin #138 Fri, 01 Aug, 09:22
Hudson       Build failed in Hudson: Maven-Plugins » Maven Patch Plugin #139 Fri, 01 Aug, 13:34
Hudson         Build failed in Hudson: Maven-Plugins » Maven Patch Plugin #140 Fri, 01 Aug, 17:27
Hudson           Build failed in Hudson: Maven-Plugins » Maven Patch Plugin #141 Fri, 01 Aug, 22:33
Hudson             Build failed in Hudson: Maven-Plugins » Maven Patch Plugin #142 Sat, 02 Aug, 01:24
Hudson               Build failed in Hudson: Maven-Plugins » Maven Patch Plugin #143 Sat, 02 Aug, 09:25
Hudson                 Build failed in Hudson: Maven-Plugins » Maven Patch Plugin #144 Sat, 02 Aug, 12:35
Hudson                   Build failed in Hudson: Maven-Plugins » Maven Patch Plugin #145 Sat, 02 Aug, 13:26
Hudson                     Build failed in Hudson: Maven-Plugins » Maven Patch Plugin #146 Sat, 02 Aug, 13:49
Hudson                       Build failed in Hudson: Maven-Plugins » Maven Patch Plugin #147 Sat, 02 Aug, 14:11
Hudson                         Build failed in Hudson: Maven-Plugins » Maven Patch Plugin #148 Sat, 02 Aug, 18:04
Hudson                           Build failed in Hudson: Maven-Plugins » Maven Patch Plugin #149 Sat, 02 Aug, 18:57
Hudson                             Build failed in Hudson: Maven-Plugins » Maven Patch Plugin #150 Sat, 02 Aug, 21:39
Hudson                               Build failed in Hudson: Maven-Plugins » Maven Patch Plugin #151 Sun, 03 Aug, 00:32
Hudson                                 Build failed in Hudson: Maven-Plugins » Maven Patch Plugin #152 Sun, 03 Aug, 02:58
Hudson                                   Build failed in Hudson: Maven-Plugins » Maven Patch Plugin #153 Sun, 03 Aug, 09:21
Hudson                                     Build failed in Hudson: Maven-Plugins » Maven Patch Plugin #154 Sun, 03 Aug, 13:04
Hudson                                       Build failed in Hudson: Maven-Plugins » Maven Patch Plugin #155 Sun, 03 Aug, 13:38
Hudson                                         Build failed in Hudson: Maven-Plugins » Maven Patch Plugin #156 Sun, 03 Aug, 19:13
Hudson                                           Build failed in Hudson: Maven-Plugins » Maven Patch Plugin #157 Sun, 03 Aug, 20:19
Hudson                                             Build failed in Hudson: Maven-Plugins » Maven Patch Plugin #158 Sun, 03 Aug, 21:52
Hudson                                               Build failed in Hudson: Maven-Plugins » Maven Patch Plugin #159 Sun, 03 Aug, 23:09
Hudson                                                 Hudson build is back to normal: Maven-Plugins » Maven Patch Plugin #160 Mon, 04 Aug, 01:20
Hudson Build failed in Hudson: Maven-Plugins » Maven Changes Report Plugin #137 Fri, 01 Aug, 01:28
Build failed in Hudson: Maven-Plugins » Maven Dependency Plugin #137
Hudson   Build failed in Hudson: Maven-Plugins » Maven Dependency Plugin #137 Fri, 01 Aug, 01:28
Hudson     Build failed in Hudson: Maven-Plugins » Maven Dependency Plugin #138 Fri, 01 Aug, 09:22
Hudson       Build failed in Hudson: Maven-Plugins » Maven Dependency Plugin #139 Fri, 01 Aug, 13:34
Hudson         Build failed in Hudson: Maven-Plugins » Maven Dependency Plugin #140 Fri, 01 Aug, 17:27
Hudson           Build failed in Hudson: Maven-Plugins » Maven Dependency Plugin #141 Fri, 01 Aug, 22:33
Hudson             Build failed in Hudson: Maven-Plugins » Maven Dependency Plugin #142 Sat, 02 Aug, 01:24
Hudson               Build failed in Hudson: Maven-Plugins » Maven Dependency Plugin #143 Sat, 02 Aug, 09:25
Hudson                 Build failed in Hudson: Maven-Plugins » Maven Dependency Plugin #144 Sat, 02 Aug, 12:35
Hudson                   Build failed in Hudson: Maven-Plugins » Maven Dependency Plugin #145 Sat, 02 Aug, 13:26
Hudson                     Build failed in Hudson: Maven-Plugins » Maven Dependency Plugin #146 Sat, 02 Aug, 13:49
Hudson                       Build failed in Hudson: Maven-Plugins » Maven Dependency Plugin #147 Sat, 02 Aug, 14:11
Hudson                         Build failed in Hudson: Maven-Plugins » Maven Dependency Plugin #148 Sat, 02 Aug, 18:04
Hudson                           Build failed in Hudson: Maven-Plugins » Maven Dependency Plugin #149 Sat, 02 Aug, 18:57
Hudson                             Build failed in Hudson: Maven-Plugins » Maven Dependency Plugin #150 Sat, 02 Aug, 21:39
Hudson                               Build failed in Hudson: Maven-Plugins » Maven Dependency Plugin #151 Sun, 03 Aug, 00:32
Hudson                                 Build failed in Hudson: Maven-Plugins » Maven Dependency Plugin #152 Sun, 03 Aug, 02:58
Hudson                                   Build failed in Hudson: Maven-Plugins » Maven Dependency Plugin #153 Sun, 03 Aug, 09:21
Hudson                                     Build failed in Hudson: Maven-Plugins » Maven Dependency Plugin #154 Sun, 03 Aug, 13:04
Hudson                                       Build failed in Hudson: Maven-Plugins » Maven Dependency Plugin #155 Sun, 03 Aug, 13:38
Hudson                                         Build failed in Hudson: Maven-Plugins » Maven Dependency Plugin #156 Sun, 03 Aug, 19:13
Hudson                                           Build failed in Hudson: Maven-Plugins » Maven Dependency Plugin #157 Sun, 03 Aug, 20:19
Hudson                                             Build failed in Hudson: Maven-Plugins » Maven Dependency Plugin #158 Sun, 03 Aug, 21:52
Hudson                                               Build failed in Hudson: Maven-Plugins » Maven Dependency Plugin #159 Sun, 03 Aug, 23:09
Hudson                                                 Build failed in Hudson: Maven-Plugins » Maven Dependency Plugin #160 Mon, 04 Aug, 01:20
Hudson                                                   Build failed in Hudson: Maven-Plugins » Maven Dependency Plugin #161 Mon, 04 Aug, 01:56
Hudson                                                     Build failed in Hudson: Maven-Plugins » Maven Dependency Plugin #162 Mon, 04 Aug, 02:39
Hudson                                                       Build failed in Hudson: Maven-Plugins » Maven Dependency Plugin #163 Mon, 04 Aug, 03:37
Hudson                                                         Build failed in Hudson: Maven-Plugins » Maven Dependency Plugin #164 Mon, 04 Aug, 09:19
Hudson                                                           Build failed in Hudson: Maven-Plugins » Maven Dependency Plugin #165 Mon, 04 Aug, 13:26
Hudson                                                             Hudson build is back to normal: Maven-Plugins » Maven Dependency Plugin #166 Mon, 04 Aug, 17:35
Build failed in Hudson: Maven-Plugins » Maven Assembly Plugin #137
Hudson   Build failed in Hudson: Maven-Plugins » Maven Assembly Plugin #137 Fri, 01 Aug, 01:28
Hudson     Build failed in Hudson: Maven-Plugins » Maven Assembly Plugin #138 Fri, 01 Aug, 09:22
Hudson       Build failed in Hudson: Maven-Plugins » Maven Assembly Plugin #139 Fri, 01 Aug, 13:34
Hudson         Build failed in Hudson: Maven-Plugins » Maven Assembly Plugin #140 Fri, 01 Aug, 17:27
Hudson           Build failed in Hudson: Maven-Plugins » Maven Assembly Plugin #141 Fri, 01 Aug, 22:33
Hudson             Build failed in Hudson: Maven-Plugins » Maven Assembly Plugin #142 Sat, 02 Aug, 01:24
Hudson               Build failed in Hudson: Maven-Plugins » Maven Assembly Plugin #143 Sat, 02 Aug, 09:25
Hudson                 Build failed in Hudson: Maven-Plugins » Maven Assembly Plugin #144 Sat, 02 Aug, 12:35
Hudson                   Build failed in Hudson: Maven-Plugins » Maven Assembly Plugin #145 Sat, 02 Aug, 13:26
Hudson                     Build failed in Hudson: Maven-Plugins » Maven Assembly Plugin #146 Sat, 02 Aug, 13:49
Hudson                       Build failed in Hudson: Maven-Plugins » Maven Assembly Plugin #147 Sat, 02 Aug, 14:11
Hudson                         Build failed in Hudson: Maven-Plugins » Maven Assembly Plugin #148 Sat, 02 Aug, 18:04
Hudson                           Build failed in Hudson: Maven-Plugins » Maven Assembly Plugin #149 Sat, 02 Aug, 18:57
Hudson                             Build failed in Hudson: Maven-Plugins » Maven Assembly Plugin #150 Sat, 02 Aug, 21:39
Hudson                               Build failed in Hudson: Maven-Plugins » Maven Assembly Plugin #151 Sun, 03 Aug, 00:32
Hudson                                 Build failed in Hudson: Maven-Plugins » Maven Assembly Plugin #152 Sun, 03 Aug, 02:58
Hudson                                   Build failed in Hudson: Maven-Plugins » Maven Assembly Plugin #153 Sun, 03 Aug, 09:21
Hudson                                     Build failed in Hudson: Maven-Plugins » Maven Assembly Plugin #154 Sun, 03 Aug, 13:04
Hudson                                       Build failed in Hudson: Maven-Plugins » Maven Assembly Plugin #155 Sun, 03 Aug, 13:38
Hudson                                         Build failed in Hudson: Maven-Plugins » Maven Assembly Plugin #156 Sun, 03 Aug, 19:13
Hudson                                           Build failed in Hudson: Maven-Plugins » Maven Assembly Plugin #157 Sun, 03 Aug, 20:19
Hudson                                             Build failed in Hudson: Maven-Plugins » Maven Assembly Plugin #158 Sun, 03 Aug, 21:52
Hudson                                               Build failed in Hudson: Maven-Plugins » Maven Assembly Plugin #159 Sun, 03 Aug, 23:09
Hudson                                                 Build failed in Hudson: Maven-Plugins » Maven Assembly Plugin #160 Mon, 04 Aug, 01:20
Hudson                                                   Build failed in Hudson: Maven-Plugins » Maven Assembly Plugin #161 Mon, 04 Aug, 01:56
Hudson                                                     Build failed in Hudson: Maven-Plugins » Maven Assembly Plugin #162 Mon, 04 Aug, 02:39
Hudson                                                       Build failed in Hudson: Maven-Plugins » Maven Assembly Plugin #163 Mon, 04 Aug, 03:37
Hudson                                                         Build failed in Hudson: Maven-Plugins » Maven Assembly Plugin #164 Mon, 04 Aug, 09:19
Hudson                                                           Build failed in Hudson: Maven-Plugins » Maven Assembly Plugin #165 Mon, 04 Aug, 13:26
Hudson                                                             Hudson build is back to normal: Maven-Plugins » Maven Assembly Plugin #166 Mon, 04 Aug, 17:35
Hudson Hudson build became unstable: Maven-Plugins » Maven Ant Plugin #138 Fri, 01 Aug, 09:22
Hudson   Hudson build is back to stable: Maven-Plugins » Maven Ant Plugin #139 Fri, 01 Aug, 13:34
Hudson Build failed in Hudson: Maven-Plugins » Maven Changes Report Plugin #139 Fri, 01 Aug, 13:34
Hudson   Build failed in Hudson: Maven-Plugins » Maven Changes Report Plugin #140 Fri, 01 Aug, 17:27
Hudson     Build failed in Hudson: Maven-Plugins » Maven Changes Report Plugin #141 Fri, 01 Aug, 22:33
[continuum] BUILD FAILURE: Maven 2.1.x (trunk) - Maven Project Builder - Build Def: default maven2 buildDefinition
Contin...@vmbuild.apache.org   [continuum] BUILD FAILURE: Maven 2.1.x (trunk) - Maven Project Builder - Build Def: default maven2 buildDefinition Fri, 01 Aug, 16:36
Contin...@vmbuild.apache.org   [continuum] BUILD FAILURE: Maven 2.1.x (trunk) - Maven Project Builder - Build Def: default maven2 buildDefinition Fri, 01 Aug, 19:21
Contin...@vmbuild.apache.org   [continuum] BUILD FAILURE: Maven 2.1.x (trunk) - Maven Project Builder - Build Def: default maven2 buildDefinition Sat, 02 Aug, 12:02
Contin...@vmbuild.apache.org   [continuum] BUILD FAILURE: Maven 2.1.x (trunk) - Maven Project Builder - Build Def: default maven2 buildDefinition Sun, 03 Aug, 00:16
Contin...@vmbuild.apache.org   [continuum] BUILD FAILURE: Maven 2.1.x (trunk) - Maven Project Builder - Build Def: default maven2 buildDefinition Wed, 13 Aug, 05:34
Build failed in Hudson: maven-assembly-plugin-trunk » Maven Assembly Plugin #4
Hudson   Build failed in Hudson: maven-assembly-plugin-trunk » Maven Assembly Plugin #4 Fri, 01 Aug, 19:13
Hudson     Build failed in Hudson: maven-assembly-plugin-trunk » Maven Assembly Plugin #5 Sat, 02 Aug, 11:38
Hudson       Build failed in Hudson: maven-assembly-plugin-trunk » Maven Assembly Plugin #6 Sat, 02 Aug, 12:37
Hudson         Build failed in Hudson: maven-assembly-plugin-trunk » Maven Assembly Plugin #7 Sat, 02 Aug, 13:40
Hudson           Build failed in Hudson: maven-assembly-plugin-trunk » Maven Assembly Plugin #8 Sat, 02 Aug, 18:37
Hudson             Build failed in Hudson: maven-assembly-plugin-trunk » Maven Assembly Plugin #9 Sat, 02 Aug, 23:48
Hudson               Build failed in Hudson: maven-assembly-plugin-trunk » Maven Assembly Plugin #10 Sun, 03 Aug, 02:36
Hudson                 Build failed in Hudson: maven-assembly-plugin-trunk » Maven Assembly Plugin #11 Sun, 03 Aug, 12:38
Hudson                   Build failed in Hudson: maven-assembly-plugin-trunk » Maven Assembly Plugin #12 Sun, 03 Aug, 16:36
Hudson                     Build failed in Hudson: maven-assembly-plugin-trunk » Maven Assembly Plugin #13 Sun, 03 Aug, 19:36
Hudson                       Build failed in Hudson: maven-assembly-plugin-trunk » Maven Assembly Plugin #14 Sun, 03 Aug, 20:36
Hudson                         Build failed in Hudson: maven-assembly-plugin-trunk » Maven Assembly Plugin #15 Mon, 04 Aug, 01:37
Hudson                           Build failed in Hudson: maven-assembly-plugin-trunk » Maven Assembly Plugin #16 Mon, 04 Aug, 12:54
Hudson                             Build failed in Hudson: maven-assembly-plugin-trunk » Maven Assembly Plugin #17 Mon, 04 Aug, 13:06
Hudson                               Build failed in Hudson: maven-assembly-plugin-trunk » Maven Assembly Plugin #18 Mon, 04 Aug, 16:32
Hudson                                 Hudson build is back to normal: maven-assembly-plugin-trunk » Maven Assembly Plugin #19 Mon, 04 Aug, 17:13
[continuum] BUILD FAILURE: Maven 2.1.x (trunk) - Integration Test Executor - Build Def: default maven2 buildDefinition
Contin...@vmbuild.apache.org   [continuum] BUILD FAILURE: Maven 2.1.x (trunk) - Integration Test Executor - Build Def: default maven2 buildDefinition Fri, 01 Aug, 20:46
Contin...@vmbuild.apache.org   [continuum] BUILD FAILURE: Maven 2.1.x (trunk) - Integration Test Executor - Build Def: default maven2 buildDefinition Fri, 01 Aug, 22:29
Contin...@vmbuild.apache.org   [continuum] BUILD FAILURE: Maven 2.1.x (trunk) - Integration Test Executor - Build Def: default maven2 buildDefinition Sat, 02 Aug, 12:29
Contin...@vmbuild.apache.org   [continuum] BUILD FAILURE: Maven 2.1.x (trunk) - Integration Test Executor - Build Def: default maven2 buildDefinition Sun, 03 Aug, 00:38
Contin...@vmbuild.apache.org   [continuum] BUILD FAILURE: Maven 2.1.x (trunk) - Integration Test Executor - Build Def: default maven2 buildDefinition Mon, 04 Aug, 02:54
Contin...@vmbuild.apache.org   [continuum] BUILD FAILURE: Maven 2.1.x (trunk) - Integration Test Executor - Build Def: default maven2 buildDefinition Tue, 05 Aug, 08:07
Contin...@vmbuild.apache.org   [continuum] BUILD FAILURE: Maven 2.1.x (trunk) - Integration Test Executor - Build Def: default maven2 buildDefinition Wed, 06 Aug, 03:17
Contin...@vmbuild.apache.org   [continuum] BUILD FAILURE: Maven 2.1.x (trunk) - Integration Test Executor - Build Def: default maven2 buildDefinition Wed, 06 Aug, 16:43
Contin...@vmbuild.apache.org   [continuum] BUILD FAILURE: Maven 2.1.x (trunk) - Integration Test Executor - Build Def: default maven2 buildDefinition Wed, 06 Aug, 23:44
Contin...@vmbuild.apache.org   [continuum] BUILD FAILURE: Maven 2.1.x (trunk) - Integration Test Executor - Build Def: default maven2 buildDefinition Fri, 08 Aug, 07:04
Contin...@vmbuild.apache.org   [continuum] BUILD FAILURE: Maven 2.1.x (trunk) - Integration Test Executor - Build Def: default maven2 buildDefinition Fri, 08 Aug, 15:49
Contin...@vmbuild.apache.org   [continuum] BUILD FAILURE: Maven 2.1.x (trunk) - Integration Test Executor - Build Def: default maven2 buildDefinition Sat, 09 Aug, 11:01
Contin...@vmbuild.apache.org   [continuum] BUILD FAILURE: Maven 2.1.x (trunk) - Integration Test Executor - Build Def: default maven2 buildDefinition Tue, 12 Aug, 01:29
Contin...@vmbuild.apache.org   [continuum] BUILD FAILURE: Maven 2.1.x (trunk) - Integration Test Executor - Build Def: default maven2 buildDefinition Wed, 13 Aug, 05:40
Contin...@vmbuild.apache.org   [continuum] BUILD FAILURE: Maven 2.1.x (trunk) - Integration Test Executor - Build Def: default maven2 buildDefinition Wed, 13 Aug, 15:02
Contin...@vmbuild.apache.org   [continuum] BUILD FAILURE: Maven 2.1.x (trunk) - Integration Test Executor - Build Def: default maven2 buildDefinition Wed, 13 Aug, 18:24
Contin...@vmbuild.apache.org   [continuum] BUILD FAILURE: Maven 2.1.x (trunk) - Integration Test Executor - Build Def: default maven2 buildDefinition Wed, 20 Aug, 16:27
Contin...@vmbuild.apache.org   [continuum] BUILD FAILURE: Maven 2.1.x (trunk) - Integration Test Executor - Build Def: default maven2 buildDefinition Mon, 25 Aug, 01:02
Contin...@vmbuild.apache.org   [continuum] BUILD FAILURE: Maven 2.1.x (trunk) - Integration Test Executor - Build Def: default maven2 buildDefinition Mon, 25 Aug, 19:25
Contin...@vmbuild.apache.org   [continuum] BUILD FAILURE: Maven 2.1.x (trunk) - Integration Test Executor - Build Def: default maven2 buildDefinition Tue, 26 Aug, 20:23
Contin...@vmbuild.apache.org   [continuum] BUILD FAILURE: Maven 2.1.x (trunk) - Integration Test Executor - Build Def: default maven2 buildDefinition Tue, 26 Aug, 23:02
Contin...@vmbuild.apache.org   [continuum] BUILD FAILURE: Maven 2.1.x (trunk) - Integration Test Executor - Build Def: default maven2 buildDefinition Wed, 27 Aug, 05:28
Contin...@vmbuild.apache.org   [continuum] BUILD FAILURE: Maven 2.1.x (trunk) - Integration Test Executor - Build Def: default maven2 buildDefinition Wed, 27 Aug, 06:23
Contin...@vmbuild.apache.org   [continuum] BUILD FAILURE: Maven 2.1.x (trunk) - Integration Test Executor - Build Def: default maven2 buildDefinition Wed, 27 Aug, 07:48
Contin...@vmbuild.apache.org   [continuum] BUILD FAILURE: Maven 2.1.x (trunk) - Integration Test Executor - Build Def: default maven2 buildDefinition Wed, 27 Aug, 08:42
Contin...@vmbuild.apache.org   [continuum] BUILD FAILURE: Maven 2.1.x (trunk) - Integration Test Executor - Build Def: default maven2 buildDefinition Wed, 27 Aug, 22:00
Contin...@vmbuild.apache.org   [continuum] BUILD FAILURE: Maven 2.1.x (trunk) - Integration Test Executor - Build Def: default maven2 buildDefinition Wed, 27 Aug, 23:24
Contin...@vmbuild.apache.org   [continuum] BUILD FAILURE: Maven 2.1.x (trunk) - Integration Test Executor - Build Def: default maven2 buildDefinition Fri, 29 Aug, 03:15
Contin...@vmbuild.apache.org   [continuum] BUILD FAILURE: Maven 2.1.x (trunk) - Integration Test Executor - Build Def: default maven2 buildDefinition Fri, 29 Aug, 18:31
Build failed in Hudson: ant-tasks » Maven Ant Task #45
Hudson   Build failed in Hudson: ant-tasks » Maven Ant Task #45 Fri, 01 Aug, 20:54
Hudson     Hudson build is back to normal: ant-tasks » Maven Ant Tasks #46 Fri, 01 Aug, 22:17
Hudson build is still unstable: maven-eclipse-plugin-trunk » Maven Eclipse Plugin #2
Hudson   Hudson build is still unstable: maven-eclipse-plugin-trunk » Maven Eclipse Plugin #2 Fri, 01 Aug, 22:16
Hudson     Build failed in Hudson: maven-eclipse-plugin-trunk » Maven Eclipse Plugin #3 Sun, 03 Aug, 22:31
Hudson       Hudson build is back to normal: maven-eclipse-plugin-trunk » Maven Eclipse Plugin #4 Mon, 04 Aug, 08:47
Build failed in Hudson: mercury #33
Hudson   Build failed in Hudson: mercury #33 Fri, 01 Aug, 22:16
Hudson     Build failed in Hudson: mercury #34 Fri, 01 Aug, 22:46
Hudson       Build failed in Hudson: mercury #35 Fri, 01 Aug, 23:46
Hudson         Build failed in Hudson: mercury #36 Sat, 02 Aug, 00:46
Hudson           Build failed in Hudson: mercury #37 Mon, 04 Aug, 19:23
Hudson             Build failed in Hudson: mercury #38 Mon, 04 Aug, 19:33
Hudson               Build failed in Hudson: mercury #39 Mon, 04 Aug, 19:41
Hudson                 Build failed in Hudson: mercury #40 Mon, 04 Aug, 19:47
Hudson                   Build failed in Hudson: mercury #41 Mon, 04 Aug, 19:52
Hudson                     Build failed in Hudson: mercury #42 Mon, 04 Aug, 20:40
Hudson                       Build failed in Hudson: mercury #43 Mon, 04 Aug, 20:51
Hudson                         Build failed in Hudson: mercury #44 Mon, 04 Aug, 20:58
Hudson                           Hudson build is back to normal: mercury #45 Mon, 04 Aug, 21:06
Hudson Hudson build became unstable: Maven-Plugins » Maven Ant Plugin #142 Sat, 02 Aug, 01:24
[continuum] BUILD ERROR: Maven Integration Testing - core-integration-testing-wagon - Build Def: default maven2 buildDefinition
Contin...@vmbuild.apache.org   [continuum] BUILD ERROR: Maven Integration Testing - core-integration-testing-wagon - Build Def: default maven2 buildDefinition Sat, 02 Aug, 07:00
Contin...@vmbuild.apache.org   [continuum] BUILD ERROR: Maven Integration Testing - core-integration-testing-wagon - Build Def: default maven2 buildDefinition Wed, 20 Aug, 09:33
Contin...@vmbuild.apache.org   [continuum] BUILD ERROR: Maven Integration Testing - core-integration-testing-wagon - Build Def: default maven2 buildDefinition Wed, 20 Aug, 11:05
[continuum] BUILD ERROR: Maven 2.1.x (trunk) - Apache Maven - Build Def: default maven2 buildDefinition
Contin...@vmbuild.apache.org   [continuum] BUILD ERROR: Maven 2.1.x (trunk) - Apache Maven - Build Def: default maven2 buildDefinition Sat, 02 Aug, 07:25
Contin...@vmbuild.apache.org   [continuum] BUILD ERROR: Maven 2.1.x (trunk) - Apache Maven - Build Def: default maven2 buildDefinition Wed, 20 Aug, 09:59
Contin...@vmbuild.apache.org   [continuum] BUILD ERROR: Maven 2.1.x (trunk) - Apache Maven - Build Def: default maven2 buildDefinition Wed, 20 Aug, 10:33
Hudson Hudson build is back to stable: Maven-Plugins » Maven Eclipse Plugin #143 Sat, 02 Aug, 09:25
[continuum] BUILD SUCCESSFUL: Maven 2.1.x (trunk) - Apache Maven - Build Def: default maven2 buildDefinition
Contin...@vmbuild.apache.org   [continuum] BUILD SUCCESSFUL: Maven 2.1.x (trunk) - Apache Maven - Build Def: default maven2 buildDefinition Sat, 02 Aug, 11:16
Contin...@vmbuild.apache.org   [continuum] BUILD SUCCESSFUL: Maven 2.1.x (trunk) - Apache Maven - Build Def: default maven2 buildDefinition Wed, 20 Aug, 15:52
[continuum] BUILD FAILURE: Maven 2.1.x (trunk) - Maven Embedder - Build Def: default maven2 buildDefinition
Contin...@vmbuild.apache.org   [continuum] BUILD FAILURE: Maven 2.1.x (trunk) - Maven Embedder - Build Def: default maven2 buildDefinition Sat, 02 Aug, 12:13
Contin...@vmbuild.apache.org   [continuum] BUILD FAILURE: Maven 2.1.x (trunk) - Maven Embedder - Build Def: default maven2 buildDefinition Sun, 03 Aug, 00:24
Hudson Build failed in Hudson: Maven-Plugins » Maven Changes Report Plugin #144 Sat, 02 Aug, 12:35
Hudson   Build failed in Hudson: Maven-Plugins » Maven Changes Report Plugin #145 Sat, 02 Aug, 13:26
Hudson     Build failed in Hudson: Maven-Plugins » Maven Changes Report Plugin #146 Sat, 02 Aug, 13:49
Hudson       Build failed in Hudson: Maven-Plugins » Maven Changes Report Plugin #147 Sat, 02 Aug, 14:11
Hudson         Build failed in Hudson: Maven-Plugins » Maven Changes Report Plugin #148 Sat, 02 Aug, 18:04
Hudson           Build failed in Hudson: Maven-Plugins » Maven Changes Report Plugin #149 Sat, 02 Aug, 18:57
Hudson             Build failed in Hudson: Maven-Plugins » Maven Changes Report Plugin #150 Sat, 02 Aug, 21:39
Hudson               Build failed in Hudson: Maven-Plugins » Maven Changes Report Plugin #151 Sun, 03 Aug, 00:32
Hudson                 Build failed in Hudson: Maven-Plugins » Maven Changes Report Plugin #152 Sun, 03 Aug, 02:58
Hudson Hudson build became unstable: Maven-Plugins » Maven Eclipse Plugin #144 Sat, 02 Aug, 12:35
Hudson Hudson build is back to stable: Maven-Plugins » Maven Ant Plugin #144 Sat, 02 Aug, 12:35
[continuum] BUILD FAILURE: Maven 2.1.x (trunk) - Integration Tests for Maven Embedder - Build Def: default maven2 buildDefinition
Contin...@vmbuild.apache.org   [continuum] BUILD FAILURE: Maven 2.1.x (trunk) - Integration Tests for Maven Embedder - Build Def: default maven2 buildDefinition Sat, 02 Aug, 12:39
Contin...@vmbuild.apache.org   [continuum] BUILD FAILURE: Maven 2.1.x (trunk) - Integration Tests for Maven Embedder - Build Def: default maven2 buildDefinition Sun, 03 Aug, 00:48
[continuum] BUILD SUCCESSFUL: Maven Integration Testing - core-integration-testing-wagon - Build Def: default maven2 buildDefinition
Contin...@vmbuild.apache.org   [continuum] BUILD SUCCESSFUL: Maven Integration Testing - core-integration-testing-wagon - Build Def: default maven2 buildDefinition Sat, 02 Aug, 13:06
Contin...@vmbuild.apache.org   [continuum] BUILD SUCCESSFUL: Maven Integration Testing - core-integration-testing-wagon - Build Def: default maven2 buildDefinition Wed, 20 Aug, 19:11
Hudson Hudson build is back to stable: Maven-Plugins » Maven Eclipse Plugin #146 Sat, 02 Aug, 13:49
Hudson Hudson build became unstable: Maven-Plugins » Maven Eclipse Plugin #148 Sat, 02 Aug, 18:04
Hudson   Hudson build is back to stable: Maven-Plugins » Maven Eclipse Plugin #149 Sat, 02 Aug, 18:57
Hudson Hudson build became unstable: Maven-Plugins » Maven Eclipse Plugin #150 Sat, 02 Aug, 21:39
Hudson build is back to normal: Maven-2.1.x-with-bootstrap #28
Apache Hudson Server   Hudson build is back to normal: Maven-2.1.x-with-bootstrap #28 Sat, 02 Aug, 23:20
Hudson build is back to normal: XXX #17
Hudson   Hudson build is back to normal: XXX #17 Sat, 02 Aug, 23:25
Hudson Hudson build became unstable: Maven-Plugins » Maven Ant Plugin #153 Sun, 03 Aug, 09:21
Hudson   Hudson build is back to stable: Maven-Plugins » Maven Ant Plugin #154 Sun, 03 Aug, 13:04
Hudson Build failed in Hudson: Maven-Plugins » Maven Changes Report Plugin #154 Sun, 03 Aug, 13:04
Hudson   Build failed in Hudson: Maven-Plugins » Maven Changes Report Plugin #155 Sun, 03 Aug, 13:38
Hudson     Build failed in Hudson: Maven-Plugins » Maven Changes Report Plugin #156 Sun, 03 Aug, 19:13
Hudson       Build failed in Hudson: Maven-Plugins » Maven Changes Report Plugin #157 Sun, 03 Aug, 20:19
Hudson         Build failed in Hudson: Maven-Plugins » Maven Changes Report Plugin #158 Sun, 03 Aug, 21:52
Hudson           Build failed in Hudson: Maven-Plugins » Maven Changes Report Plugin #159 Sun, 03 Aug, 23:09
Hudson             Build failed in Hudson: Maven-Plugins » Maven Changes Report Plugin #160 Mon, 04 Aug, 01:20
Hudson               Build failed in Hudson: Maven-Plugins » Maven Changes Report Plugin #161 Mon, 04 Aug, 01:56
Hudson                 Build failed in Hudson: Maven-Plugins » Maven Changes Report Plugin #162 Mon, 04 Aug, 02:39
Hudson                   Build failed in Hudson: Maven-Plugins » Maven Changes Report Plugin #163 Mon, 04 Aug, 03:37
Hudson Hudson build is back to stable: Maven-Plugins » Maven Eclipse Plugin #155 Sun, 03 Aug, 13:38
Hudson Hudson build became unstable: Maven-Plugins » Maven Eclipse Plugin #156 Sun, 03 Aug, 19:13
Hudson Build failed in Hudson: Maven-Plugins » Maven Eclipse Plugin #160 Mon, 04 Aug, 01:20
Hudson   Build failed in Hudson: Maven-Plugins » Maven Eclipse Plugin #161 Mon, 04 Aug, 01:56
Hudson     Build failed in Hudson: Maven-Plugins » Maven Eclipse Plugin #162 Mon, 04 Aug, 02:39
Hudson       Build failed in Hudson: Maven-Plugins » Maven Eclipse Plugin #163 Mon, 04 Aug, 03:37
Hudson         Hudson build is back to normal: Maven-Plugins » Maven Eclipse Plugin #164 Mon, 04 Aug, 09:19
[continuum] BUILD SUCCESSFUL: Maven 2.1.x (trunk) - Maven Project Builder - Build Def: default maven2 buildDefinition
Contin...@vmbuild.apache.org   [continuum] BUILD SUCCESSFUL: Maven 2.1.x (trunk) - Maven Project Builder - Build Def: default maven2 buildDefinition Mon, 04 Aug, 01:51
Contin...@vmbuild.apache.org   [continuum] BUILD SUCCESSFUL: Maven 2.1.x (trunk) - Maven Project Builder - Build Def: default maven2 buildDefinition Wed, 13 Aug, 14:40
Contin...@vmbuild.apache.org   [continuum] BUILD SUCCESSFUL: Maven 2.1.x (trunk) - Maven Project Builder - Build Def: default maven2 buildDefinition Wed, 20 Aug, 16:18
[continuum] BUILD SUCCESSFUL: Maven 2.1.x (trunk) - Maven Embedder - Build Def: default maven2 buildDefinition
Contin...@vmbuild.apache.org   [continuum] BUILD SUCCESSFUL: Maven 2.1.x (trunk) - Maven Embedder - Build Def: default maven2 buildDefinition Mon, 04 Aug, 02:10
Contin...@vmbuild.apache.org   [continuum] BUILD SUCCESSFUL: Maven 2.1.x (trunk) - Maven Embedder - Build Def: default maven2 buildDefinition Wed, 20 Aug, 16:24
Apache Hudson Server Build failed in Hudson: Maven-2.1.x-with-bootstrap #29 Mon, 04 Aug, 02:17
Apache Hudson Server   Build failed in Hudson: Maven-2.1.x-with-bootstrap #30 Mon, 04 Aug, 11:16
Apache Hudson Server     Build failed in Hudson: Maven-2.1.x-with-bootstrap #31 Tue, 05 Aug, 11:17
Apache Hudson Server       Build failed in Hudson: Maven-2.1.x-with-bootstrap #32 Tue, 05 Aug, 21:33
Apache Hudson Server         Build failed in Hudson: Maven-2.1.x-with-bootstrap #33 Wed, 06 Aug, 22:18
Apache Hudson Server           Build failed in Hudson: Maven-2.1.x-with-bootstrap #34 Fri, 08 Aug, 04:17
Apache Hudson Server             Build failed in Hudson: Maven-2.1.x-with-bootstrap #35 Mon, 11 Aug, 23:26
Apache Hudson Server               Build failed in Hudson: Maven-2.1.x-with-bootstrap #36 Wed, 13 Aug, 05:34
Apache Hudson Server                 Build failed in Hudson: Maven-2.1.x-with-bootstrap #37 Wed, 13 Aug, 14:19
Apache Hudson Server                   Build failed in Hudson: Maven-2.1.x-with-bootstrap #38 Wed, 13 Aug, 15:19
Apache Hudson Server                     Build failed in Hudson: Maven-2.1.x-with-bootstrap #39 Mon, 25 Aug, 10:40
Apache Hudson Server                       Build failed in Hudson: Maven-2.1.x-with-bootstrap #40 Wed, 27 Aug, 22:47
Hudson Build failed in Hudson: maven-2.1.x #286 Mon, 04 Aug, 02:18
Hudson   Build failed in Hudson: maven-2.1.x #287 Mon, 04 Aug, 11:17
Hudson     Build failed in Hudson: maven-2.1.x #288 Tue, 05 Aug, 06:18
Hudson       Build failed in Hudson: maven-2.1.x #289 Tue, 05 Aug, 22:03
Hudson         Build failed in Hudson: maven-2.1.x #290 Wed, 06 Aug, 20:30
Hudson           Build failed in Hudson: maven-2.1.x #291 Wed, 06 Aug, 20:44
Hudson             Build failed in Hudson: maven-2.1.x #292 Wed, 06 Aug, 21:18
Hudson               Build failed in Hudson: maven-2.1.x #293 Wed, 06 Aug, 22:33
Hudson                 Hudson build is back to normal: maven-2.1.x #294 Thu, 07 Aug, 21:46
Hudson Build failed in Hudson: maven-components-trunk #18 Mon, 04 Aug, 02:19
Hudson   Build failed in Hudson: maven-components-trunk #19 Mon, 04 Aug, 11:19
Hudson     Build failed in Hudson: maven-components-trunk #20 Tue, 05 Aug, 06:18
Hudson       Build failed in Hudson: maven-components-trunk #21 Tue, 05 Aug, 22:08
Hudson         Build failed in Hudson: maven-components-trunk #22 Wed, 06 Aug, 22:37
Hudson           Hudson build is back to normal: maven-components-trunk #23 Fri, 08 Aug, 04:25
[continuum] BUILD SUCCESSFUL: Maven 2.1.x (trunk) - Integration Tests for Maven Embedder - Build Def: default maven2 buildDefinition
Contin...@vmbuild.apache.org   [continuum] BUILD SUCCESSFUL: Maven 2.1.x (trunk) - Integration Tests for Maven Embedder - Build Def: default maven2 buildDefinition Mon, 04 Aug, 02:58
Contin...@vmbuild.apache.org   [continuum] BUILD SUCCESSFUL: Maven 2.1.x (trunk) - Integration Tests for Maven Embedder - Build Def: default maven2 buildDefinition Wed, 20 Aug, 17:23
Message list1 · 2 · 3 · 4 · 5 · 6 · 7 · 8 · Next »Thread · Author · Date
Box list
Dec 2014302
Nov 2014618
Oct 2014426
Sep 2014304
Aug 2014246
Jul 2014317
Jun 2014341
May 2014161
Apr 2014146
Mar 2014336
Feb 2014308
Jan 2014189
Dec 2013319
Nov 2013274
Oct 2013167
Sep 2013486
Aug 2013263
Jul 2013726
Jun 2013722
May 2013378
Apr 2013313
Mar 2013467
Feb 2013520
Jan 20131437
Dec 20121778
Nov 2012775
Oct 20121224
Sep 2012791
Aug 2012362
Jul 2012232
Jun 2012149
May 2012189
Apr 2012115
Mar 201257
Feb 2012155
Jan 2012170
Dec 2011244
Nov 2011187
Oct 2011139
Sep 2011190
Aug 2011276
Jul 201194
Jun 20114
Apr 201162
Mar 201176
Feb 201154
Jan 201185
Dec 201079
Nov 201061
Oct 201058
Sep 20101
Aug 201057
Jul 201037
Jun 201020
May 201075
Apr 201053
Mar 201012
Feb 201030
Jan 201071
Dec 2009104
Nov 200919
Oct 200931
Sep 2009193
Aug 2009268
Jul 2009193
Jun 2009147
May 200975
Apr 200979
Mar 2009134
Feb 2009657
Jan 200983
Dec 2008349
Nov 2008288
Oct 2008986
Sep 2008842
Aug 2008707
Jul 2008887
Jun 2008167
May 200821
Apr 2008231
Mar 2008438
Feb 2008317
Jan 2008205
Dec 2007185
Nov 2007532
Oct 2007439
Sep 2007699
Aug 20071294
Jul 2007351
Jun 20072211
May 2007273
Apr 2007262
Mar 2007534
Feb 20071648
Jan 20072359
Dec 2006575
Nov 2006357
Oct 2006642
Sep 2006660
Aug 20061662
Jul 20061320
Jun 2006473
May 20064700
Apr 20061113
Mar 20061048