maven-notifications mailing list archives: August 2008

Site index · List index
Message list1 · 2 · 3 · 4 · 5 · 6 · 7 · 8 · Next »Thread · Author · Date
Hudson Build failed in Hudson: Maven-Plugins » Maven Changes Report Plugin #137 Fri, 01 Aug, 01:28
Hudson Build failed in Hudson: Maven-Plugins » Maven Patch Plugin #137 Fri, 01 Aug, 01:28
Hudson Hudson build is back to stable: Maven-Plugins » Maven Ant Plugin #137 Fri, 01 Aug, 01:28
Hudson Build failed in Hudson: Maven-Plugins » Maven Dependency Plugin #137 Fri, 01 Aug, 01:28
Hudson Build failed in Hudson: Maven-Plugins » Maven Assembly Plugin #137 Fri, 01 Aug, 01:28
Hudson Build failed in Hudson: Maven-Plugins » Maven Patch Plugin #138 Fri, 01 Aug, 09:22
Hudson Build failed in Hudson: Maven-Plugins » Maven Assembly Plugin #138 Fri, 01 Aug, 09:22
Hudson Build failed in Hudson: Maven-Plugins » Maven Dependency Plugin #138 Fri, 01 Aug, 09:22
Hudson Hudson build became unstable: Maven-Plugins » Maven Ant Plugin #138 Fri, 01 Aug, 09:22
Hudson Build failed in Hudson: Maven-Plugins » Maven Patch Plugin #139 Fri, 01 Aug, 13:34
Hudson Hudson build is back to stable: Maven-Plugins » Maven Ant Plugin #139 Fri, 01 Aug, 13:34
Hudson Build failed in Hudson: Maven-Plugins » Maven Changes Report Plugin #139 Fri, 01 Aug, 13:34
Hudson Build failed in Hudson: Maven-Plugins » Maven Dependency Plugin #139 Fri, 01 Aug, 13:34
Hudson Build failed in Hudson: Maven-Plugins » Maven Assembly Plugin #139 Fri, 01 Aug, 13:34
Contin...@vmbuild.apache.org [continuum] BUILD FAILURE: Maven 2.1.x (trunk) - Maven Project Builder - Build Def: default maven2 buildDefinition Fri, 01 Aug, 16:36
Hudson Build failed in Hudson: Maven-Plugins » Maven Patch Plugin #140 Fri, 01 Aug, 17:27
Hudson Build failed in Hudson: Maven-Plugins » Maven Changes Report Plugin #140 Fri, 01 Aug, 17:27
Hudson Build failed in Hudson: Maven-Plugins » Maven Dependency Plugin #140 Fri, 01 Aug, 17:27
Hudson Build failed in Hudson: Maven-Plugins » Maven Assembly Plugin #140 Fri, 01 Aug, 17:27
Hudson Build failed in Hudson: maven-assembly-plugin-trunk » Maven Assembly Plugin #4 Fri, 01 Aug, 19:13
Contin...@vmbuild.apache.org [continuum] BUILD FAILURE: Maven 2.1.x (trunk) - Maven Project Builder - Build Def: default maven2 buildDefinition Fri, 01 Aug, 19:21
Contin...@vmbuild.apache.org [continuum] BUILD FAILURE: Maven 2.1.x (trunk) - Integration Test Executor - Build Def: default maven2 buildDefinition Fri, 01 Aug, 20:46
Hudson Build failed in Hudson: ant-tasks » Maven Ant Task #45 Fri, 01 Aug, 20:54
Hudson Hudson build is still unstable: maven-eclipse-plugin-trunk » Maven Eclipse Plugin #2 Fri, 01 Aug, 22:16
Hudson Build failed in Hudson: mercury #33 Fri, 01 Aug, 22:16
Hudson Hudson build is back to normal: ant-tasks » Maven Ant Tasks #46 Fri, 01 Aug, 22:17
Contin...@vmbuild.apache.org [continuum] BUILD FAILURE: Maven 2.1.x (trunk) - Integration Test Executor - Build Def: default maven2 buildDefinition Fri, 01 Aug, 22:29
Hudson Build failed in Hudson: Maven-Plugins » Maven Changes Report Plugin #141 Fri, 01 Aug, 22:33
Hudson Build failed in Hudson: Maven-Plugins » Maven Dependency Plugin #141 Fri, 01 Aug, 22:33
Hudson Build failed in Hudson: Maven-Plugins » Maven Patch Plugin #141 Fri, 01 Aug, 22:33
Hudson Build failed in Hudson: Maven-Plugins » Maven Assembly Plugin #141 Fri, 01 Aug, 22:33
Hudson Build failed in Hudson: mercury #34 Fri, 01 Aug, 22:46
Hudson Build failed in Hudson: mercury #35 Fri, 01 Aug, 23:46
Hudson Build failed in Hudson: mercury #36 Sat, 02 Aug, 00:46
Hudson Hudson build became unstable: Maven-Plugins » Maven Ant Plugin #142 Sat, 02 Aug, 01:24
Hudson Build failed in Hudson: Maven-Plugins » Maven Dependency Plugin #142 Sat, 02 Aug, 01:24
Hudson Build failed in Hudson: Maven-Plugins » Maven Patch Plugin #142 Sat, 02 Aug, 01:24
Hudson Build failed in Hudson: Maven-Plugins » Maven Assembly Plugin #142 Sat, 02 Aug, 01:24
Contin...@vmbuild.apache.org [continuum] BUILD ERROR: Maven Integration Testing - core-integration-testing-wagon - Build Def: default maven2 buildDefinition Sat, 02 Aug, 07:00
Contin...@vmbuild.apache.org [continuum] BUILD ERROR: Maven 2.1.x (trunk) - Apache Maven - Build Def: default maven2 buildDefinition Sat, 02 Aug, 07:25
Hudson Build failed in Hudson: Maven-Plugins » Maven Dependency Plugin #143 Sat, 02 Aug, 09:25
Hudson Hudson build is back to stable: Maven-Plugins » Maven Eclipse Plugin #143 Sat, 02 Aug, 09:25
Hudson Build failed in Hudson: Maven-Plugins » Maven Patch Plugin #143 Sat, 02 Aug, 09:25
Hudson Build failed in Hudson: Maven-Plugins » Maven Assembly Plugin #143 Sat, 02 Aug, 09:25
Contin...@vmbuild.apache.org [continuum] BUILD SUCCESSFUL: Maven 2.1.x (trunk) - Apache Maven - Build Def: default maven2 buildDefinition Sat, 02 Aug, 11:16
Hudson Build failed in Hudson: maven-assembly-plugin-trunk » Maven Assembly Plugin #5 Sat, 02 Aug, 11:38
Contin...@vmbuild.apache.org [continuum] BUILD FAILURE: Maven 2.1.x (trunk) - Maven Project Builder - Build Def: default maven2 buildDefinition Sat, 02 Aug, 12:02
Contin...@vmbuild.apache.org [continuum] BUILD FAILURE: Maven 2.1.x (trunk) - Maven Embedder - Build Def: default maven2 buildDefinition Sat, 02 Aug, 12:13
Contin...@vmbuild.apache.org [continuum] BUILD FAILURE: Maven 2.1.x (trunk) - Integration Test Executor - Build Def: default maven2 buildDefinition Sat, 02 Aug, 12:29
Hudson Build failed in Hudson: Maven-Plugins » Maven Dependency Plugin #144 Sat, 02 Aug, 12:35
Hudson Hudson build is back to stable: Maven-Plugins » Maven Ant Plugin #144 Sat, 02 Aug, 12:35
Hudson Build failed in Hudson: Maven-Plugins » Maven Assembly Plugin #144 Sat, 02 Aug, 12:35
Hudson Build failed in Hudson: Maven-Plugins » Maven Patch Plugin #144 Sat, 02 Aug, 12:35
Hudson Build failed in Hudson: Maven-Plugins » Maven Changes Report Plugin #144 Sat, 02 Aug, 12:35
Hudson Hudson build became unstable: Maven-Plugins » Maven Eclipse Plugin #144 Sat, 02 Aug, 12:35
Hudson Build failed in Hudson: maven-assembly-plugin-trunk » Maven Assembly Plugin #6 Sat, 02 Aug, 12:37
Contin...@vmbuild.apache.org [continuum] BUILD FAILURE: Maven 2.1.x (trunk) - Integration Tests for Maven Embedder - Build Def: default maven2 buildDefinition Sat, 02 Aug, 12:39
Contin...@vmbuild.apache.org [continuum] BUILD SUCCESSFUL: Maven Integration Testing - core-integration-testing-wagon - Build Def: default maven2 buildDefinition Sat, 02 Aug, 13:06
Hudson Build failed in Hudson: Maven-Plugins » Maven Patch Plugin #145 Sat, 02 Aug, 13:26
Hudson Build failed in Hudson: Maven-Plugins » Maven Dependency Plugin #145 Sat, 02 Aug, 13:26
Hudson Build failed in Hudson: Maven-Plugins » Maven Assembly Plugin #145 Sat, 02 Aug, 13:26
Hudson Build failed in Hudson: Maven-Plugins » Maven Changes Report Plugin #145 Sat, 02 Aug, 13:26
Hudson Build failed in Hudson: maven-assembly-plugin-trunk » Maven Assembly Plugin #7 Sat, 02 Aug, 13:40
Hudson Build failed in Hudson: Maven-Plugins » Maven Assembly Plugin #146 Sat, 02 Aug, 13:49
Hudson Hudson build is back to stable: Maven-Plugins » Maven Eclipse Plugin #146 Sat, 02 Aug, 13:49
Hudson Build failed in Hudson: Maven-Plugins » Maven Changes Report Plugin #146 Sat, 02 Aug, 13:49
Hudson Build failed in Hudson: Maven-Plugins » Maven Dependency Plugin #146 Sat, 02 Aug, 13:49
Hudson Build failed in Hudson: Maven-Plugins » Maven Patch Plugin #146 Sat, 02 Aug, 13:49
Hudson Build failed in Hudson: Maven-Plugins » Maven Dependency Plugin #147 Sat, 02 Aug, 14:11
Hudson Build failed in Hudson: Maven-Plugins » Maven Patch Plugin #147 Sat, 02 Aug, 14:11
Hudson Build failed in Hudson: Maven-Plugins » Maven Changes Report Plugin #147 Sat, 02 Aug, 14:11
Hudson Build failed in Hudson: Maven-Plugins » Maven Assembly Plugin #147 Sat, 02 Aug, 14:11
Hudson Build failed in Hudson: Maven-Plugins » Maven Assembly Plugin #148 Sat, 02 Aug, 18:04
Hudson Build failed in Hudson: Maven-Plugins » Maven Changes Report Plugin #148 Sat, 02 Aug, 18:04
Hudson Build failed in Hudson: Maven-Plugins » Maven Patch Plugin #148 Sat, 02 Aug, 18:04
Hudson Build failed in Hudson: Maven-Plugins » Maven Dependency Plugin #148 Sat, 02 Aug, 18:04
Hudson Hudson build became unstable: Maven-Plugins » Maven Eclipse Plugin #148 Sat, 02 Aug, 18:04
Hudson Build failed in Hudson: maven-assembly-plugin-trunk » Maven Assembly Plugin #8 Sat, 02 Aug, 18:37
Hudson Hudson build is back to stable: Maven-Plugins » Maven Eclipse Plugin #149 Sat, 02 Aug, 18:57
Hudson Build failed in Hudson: Maven-Plugins » Maven Changes Report Plugin #149 Sat, 02 Aug, 18:57
Hudson Build failed in Hudson: Maven-Plugins » Maven Dependency Plugin #149 Sat, 02 Aug, 18:57
Hudson Build failed in Hudson: Maven-Plugins » Maven Patch Plugin #149 Sat, 02 Aug, 18:57
Hudson Build failed in Hudson: Maven-Plugins » Maven Assembly Plugin #149 Sat, 02 Aug, 18:57
Hudson Build failed in Hudson: Maven-Plugins » Maven Dependency Plugin #150 Sat, 02 Aug, 21:39
Hudson Hudson build became unstable: Maven-Plugins » Maven Eclipse Plugin #150 Sat, 02 Aug, 21:39
Hudson Build failed in Hudson: Maven-Plugins » Maven Assembly Plugin #150 Sat, 02 Aug, 21:39
Hudson Build failed in Hudson: Maven-Plugins » Maven Patch Plugin #150 Sat, 02 Aug, 21:39
Hudson Build failed in Hudson: Maven-Plugins » Maven Changes Report Plugin #150 Sat, 02 Aug, 21:39
Apache Hudson Server Hudson build is back to normal: Maven-2.1.x-with-bootstrap #28 Sat, 02 Aug, 23:20
Hudson Hudson build is back to normal: XXX #17 Sat, 02 Aug, 23:25
Hudson Build failed in Hudson: maven-assembly-plugin-trunk » Maven Assembly Plugin #9 Sat, 02 Aug, 23:48
Contin...@vmbuild.apache.org [continuum] BUILD FAILURE: Maven 2.1.x (trunk) - Maven Project Builder - Build Def: default maven2 buildDefinition Sun, 03 Aug, 00:16
Contin...@vmbuild.apache.org [continuum] BUILD FAILURE: Maven 2.1.x (trunk) - Maven Embedder - Build Def: default maven2 buildDefinition Sun, 03 Aug, 00:24
Hudson Build failed in Hudson: Maven-Plugins » Maven Changes Report Plugin #151 Sun, 03 Aug, 00:32
Hudson Build failed in Hudson: Maven-Plugins » Maven Assembly Plugin #151 Sun, 03 Aug, 00:32
Hudson Build failed in Hudson: Maven-Plugins » Maven Dependency Plugin #151 Sun, 03 Aug, 00:32
Hudson Build failed in Hudson: Maven-Plugins » Maven Patch Plugin #151 Sun, 03 Aug, 00:32
Contin...@vmbuild.apache.org [continuum] BUILD FAILURE: Maven 2.1.x (trunk) - Integration Test Executor - Build Def: default maven2 buildDefinition Sun, 03 Aug, 00:38
Contin...@vmbuild.apache.org [continuum] BUILD FAILURE: Maven 2.1.x (trunk) - Integration Tests for Maven Embedder - Build Def: default maven2 buildDefinition Sun, 03 Aug, 00:48
Hudson Build failed in Hudson: maven-assembly-plugin-trunk » Maven Assembly Plugin #10 Sun, 03 Aug, 02:36
Message list1 · 2 · 3 · 4 · 5 · 6 · 7 · 8 · Next »Thread · Author · Date
Box list
Jul 2014317
Jun 2014341
May 2014161
Apr 2014146
Mar 2014336
Feb 2014308
Jan 2014189
Dec 2013319
Nov 2013274
Oct 2013167
Sep 2013486
Aug 2013263
Jul 2013726
Jun 2013722
May 2013378
Apr 2013313
Mar 2013467
Feb 2013520
Jan 20131437
Dec 20121778
Nov 2012775
Oct 20121224
Sep 2012791
Aug 2012362
Jul 2012232
Jun 2012149
May 2012189
Apr 2012115
Mar 201257
Feb 2012155
Jan 2012170
Dec 2011244
Nov 2011187
Oct 2011139
Sep 2011190
Aug 2011276
Jul 201194
Jun 20114
Apr 201162
Mar 201176
Feb 201154
Jan 201185
Dec 201079
Nov 201061
Oct 201058
Sep 20101
Aug 201057
Jul 201037
Jun 201020
May 201075
Apr 201053
Mar 201012
Feb 201030
Jan 201071
Dec 2009104
Nov 200919
Oct 200931
Sep 2009193
Aug 2009268
Jul 2009193
Jun 2009147
May 200975
Apr 200979
Mar 2009134
Feb 2009657
Jan 200983
Dec 2008349
Nov 2008288
Oct 2008986
Sep 2008842
Aug 2008707
Jul 2008887
Jun 2008167
May 200821
Apr 2008231
Mar 2008438
Feb 2008317
Jan 2008205
Dec 2007185
Nov 2007532
Oct 2007439
Sep 2007699
Aug 20071294
Jul 2007351
Jun 20072211
May 2007273
Apr 2007262
Mar 2007534
Feb 20071648
Jan 20072359
Dec 2006575
Nov 2006357
Oct 2006642
Sep 2006660
Aug 20061662
Jul 20061320
Jun 2006473
May 20064700
Apr 20061113
Mar 20061048