maven-notifications mailing list archives: August 2008

Site index · List index
Message list1 · 2 · 3 · 4 · 5 · 6 · 7 · 8 · Next »Thread · Author · Date
Apache Hudson Server Hudson build is back to normal: Maven-2.1.x-with-bootstrap #28 Sat, 02 Aug, 23:20
Apache Hudson Server Build failed in Hudson: Maven-2.1.x-with-bootstrap #29 Mon, 04 Aug, 02:17
Apache Hudson Server Build failed in Hudson: Maven-2.1.x-with-bootstrap #30 Mon, 04 Aug, 11:16
Apache Hudson Server Build failed in Hudson: Maven-2.1.x-with-bootstrap #31 Tue, 05 Aug, 11:17
Apache Hudson Server Build failed in Hudson: Maven-2.1.x-with-bootstrap #32 Tue, 05 Aug, 21:33
Apache Hudson Server Build failed in Hudson: Maven-2.1.x-with-bootstrap #33 Wed, 06 Aug, 22:18
Apache Hudson Server Build failed in Hudson: Maven-2.1.x-with-bootstrap #34 Fri, 08 Aug, 04:17
Apache Hudson Server Build failed in Hudson: Maven-2.1.x-with-bootstrap #35 Mon, 11 Aug, 23:26
Apache Hudson Server Build failed in Hudson: Maven-2.1.x-with-bootstrap #36 Wed, 13 Aug, 05:34
Apache Hudson Server Build failed in Hudson: Maven-2.1.x-with-bootstrap #37 Wed, 13 Aug, 14:19
Apache Hudson Server Build failed in Hudson: Maven-2.1.x-with-bootstrap #38 Wed, 13 Aug, 15:19
Apache Hudson Server Build failed in Hudson: Maven-2.1.x-with-bootstrap #39 Mon, 25 Aug, 10:40
Apache Hudson Server Build failed in Hudson: Maven-2.1.x-with-bootstrap #40 Wed, 27 Aug, 22:47
Contin...@vmbuild.apache.org [continuum] BUILD FAILURE: Maven 2.1.x (trunk) - Maven Project Builder - Build Def: default maven2 buildDefinition Fri, 01 Aug, 16:36
Contin...@vmbuild.apache.org [continuum] BUILD FAILURE: Maven 2.1.x (trunk) - Maven Project Builder - Build Def: default maven2 buildDefinition Fri, 01 Aug, 19:21
Contin...@vmbuild.apache.org [continuum] BUILD FAILURE: Maven 2.1.x (trunk) - Integration Test Executor - Build Def: default maven2 buildDefinition Fri, 01 Aug, 20:46
Contin...@vmbuild.apache.org [continuum] BUILD FAILURE: Maven 2.1.x (trunk) - Integration Test Executor - Build Def: default maven2 buildDefinition Fri, 01 Aug, 22:29
Contin...@vmbuild.apache.org [continuum] BUILD ERROR: Maven Integration Testing - core-integration-testing-wagon - Build Def: default maven2 buildDefinition Sat, 02 Aug, 07:00
Contin...@vmbuild.apache.org [continuum] BUILD ERROR: Maven 2.1.x (trunk) - Apache Maven - Build Def: default maven2 buildDefinition Sat, 02 Aug, 07:25
Contin...@vmbuild.apache.org [continuum] BUILD SUCCESSFUL: Maven 2.1.x (trunk) - Apache Maven - Build Def: default maven2 buildDefinition Sat, 02 Aug, 11:16
Contin...@vmbuild.apache.org [continuum] BUILD FAILURE: Maven 2.1.x (trunk) - Maven Project Builder - Build Def: default maven2 buildDefinition Sat, 02 Aug, 12:02
Contin...@vmbuild.apache.org [continuum] BUILD FAILURE: Maven 2.1.x (trunk) - Maven Embedder - Build Def: default maven2 buildDefinition Sat, 02 Aug, 12:13
Contin...@vmbuild.apache.org [continuum] BUILD FAILURE: Maven 2.1.x (trunk) - Integration Test Executor - Build Def: default maven2 buildDefinition Sat, 02 Aug, 12:29
Contin...@vmbuild.apache.org [continuum] BUILD FAILURE: Maven 2.1.x (trunk) - Integration Tests for Maven Embedder - Build Def: default maven2 buildDefinition Sat, 02 Aug, 12:39
Contin...@vmbuild.apache.org [continuum] BUILD SUCCESSFUL: Maven Integration Testing - core-integration-testing-wagon - Build Def: default maven2 buildDefinition Sat, 02 Aug, 13:06
Contin...@vmbuild.apache.org [continuum] BUILD FAILURE: Maven 2.1.x (trunk) - Maven Project Builder - Build Def: default maven2 buildDefinition Sun, 03 Aug, 00:16
Contin...@vmbuild.apache.org [continuum] BUILD FAILURE: Maven 2.1.x (trunk) - Maven Embedder - Build Def: default maven2 buildDefinition Sun, 03 Aug, 00:24
Contin...@vmbuild.apache.org [continuum] BUILD FAILURE: Maven 2.1.x (trunk) - Integration Test Executor - Build Def: default maven2 buildDefinition Sun, 03 Aug, 00:38
Contin...@vmbuild.apache.org [continuum] BUILD FAILURE: Maven 2.1.x (trunk) - Integration Tests for Maven Embedder - Build Def: default maven2 buildDefinition Sun, 03 Aug, 00:48
Contin...@vmbuild.apache.org [continuum] BUILD SUCCESSFUL: Maven 2.1.x (trunk) - Maven Project Builder - Build Def: default maven2 buildDefinition Mon, 04 Aug, 01:51
Contin...@vmbuild.apache.org [continuum] BUILD SUCCESSFUL: Maven 2.1.x (trunk) - Maven Embedder - Build Def: default maven2 buildDefinition Mon, 04 Aug, 02:10
Contin...@vmbuild.apache.org [continuum] BUILD FAILURE: Maven 2.1.x (trunk) - Integration Test Executor - Build Def: default maven2 buildDefinition Mon, 04 Aug, 02:54
Contin...@vmbuild.apache.org [continuum] BUILD SUCCESSFUL: Maven 2.1.x (trunk) - Integration Tests for Maven Embedder - Build Def: default maven2 buildDefinition Mon, 04 Aug, 02:58
Contin...@vmbuild.apache.org [continuum] BUILD FAILURE: Maven 2.1.x (trunk) - Integration Test Executor - Build Def: default maven2 buildDefinition Tue, 05 Aug, 08:07
Contin...@vmbuild.apache.org [continuum] BUILD SUCCESSFUL: Maven SCM - Maven SCM - Build Def: default maven2 buildDefinition Tue, 05 Aug, 21:54
Contin...@vmbuild.apache.org [continuum] BUILD SUCCESSFUL: Maven SCM - Maven SCM API - Build Def: default maven2 buildDefinition Tue, 05 Aug, 21:55
Contin...@vmbuild.apache.org [continuum] BUILD SUCCESSFUL: Maven SCM - Maven SCM Managers - Build Def: default maven2 buildDefinition Tue, 05 Aug, 21:57
Contin...@vmbuild.apache.org [continuum] BUILD SUCCESSFUL: Maven SCM - Maven SCM Manager for Plexus - Build Def: default maven2 buildDefinition Tue, 05 Aug, 21:57
Contin...@vmbuild.apache.org [continuum] BUILD SUCCESSFUL: Maven SCM - Maven SCM Test - Build Def: default maven2 buildDefinition Tue, 05 Aug, 21:58
Contin...@vmbuild.apache.org [continuum] BUILD SUCCESSFUL: Maven SCM - Maven SCM Local Provider - Build Def: default maven2 buildDefinition Tue, 05 Aug, 21:58
Contin...@vmbuild.apache.org [continuum] BUILD SUCCESSFUL: Maven SCM - Maven SCM git Provider - Parent - Build Def: default maven2 buildDefinition Tue, 05 Aug, 21:59
Contin...@vmbuild.apache.org [continuum] BUILD SUCCESSFUL: Maven SCM - Maven SCM git Provider - Common library - Build Def: default maven2 buildDefinition Tue, 05 Aug, 21:59
Contin...@vmbuild.apache.org [continuum] BUILD SUCCESSFUL: Maven SCM - Maven SCM git Provider TCK Tests - Build Def: default maven2 buildDefinition Tue, 05 Aug, 21:59
Contin...@vmbuild.apache.org [continuum] BUILD SUCCESSFUL: Maven SCM - Maven SCM git Provider - git Executable Impl. - Build Def: default maven2 buildDefinition Tue, 05 Aug, 22:00
Contin...@vmbuild.apache.org [continuum] BUILD SUCCESSFUL: Maven SCM - Maven SCM Providers - Build Def: default maven2 buildDefinition Tue, 05 Aug, 22:02
Contin...@vmbuild.apache.org [continuum] BUILD SUCCESSFUL: Maven SCM - Maven SCM AccuRev Provider - Build Def: default maven2 buildDefinition Tue, 05 Aug, 22:02
Contin...@vmbuild.apache.org [continuum] BUILD SUCCESSFUL: Maven SCM - Maven SCM Bazaar Provider - Build Def: default maven2 buildDefinition Tue, 05 Aug, 22:03
Contin...@vmbuild.apache.org [continuum] BUILD SUCCESSFUL: Maven SCM - Maven SCM CVS Provider - Parent - Build Def: default maven2 buildDefinition Tue, 05 Aug, 22:03
Contin...@vmbuild.apache.org [continuum] BUILD SUCCESSFUL: Maven SCM - Maven SCM CVS Provider TCK tests - Build Def: default maven2 buildDefinition Tue, 05 Aug, 22:03
Contin...@vmbuild.apache.org [continuum] BUILD SUCCESSFUL: Maven SCM - Maven SCM CVS Provider - Common library - Build Def: default maven2 buildDefinition Tue, 05 Aug, 22:04
Contin...@vmbuild.apache.org [continuum] BUILD SUCCESSFUL: Maven SCM - Maven SCM CVS Provider - CVS Executable Impl. - Build Def: default maven2 buildDefinition Tue, 05 Aug, 22:05
Contin...@vmbuild.apache.org [continuum] BUILD SUCCESSFUL: Maven SCM - Maven SCM CVS Provider - CVS Java Impl. - Build Def: default maven2 buildDefinition Tue, 05 Aug, 22:05
Contin...@vmbuild.apache.org [continuum] BUILD SUCCESSFUL: Maven SCM - Maven SCM Clearcase Provider - Build Def: default maven2 buildDefinition Tue, 05 Aug, 22:06
Contin...@vmbuild.apache.org [continuum] BUILD SUCCESSFUL: Maven SCM - Maven SCM Mercurial (Hg) Provider - Build Def: default maven2 buildDefinition Tue, 05 Aug, 22:06
Contin...@vmbuild.apache.org [continuum] BUILD SUCCESSFUL: Maven SCM - Maven SCM Perforce Provider - Build Def: default maven2 buildDefinition Tue, 05 Aug, 22:06
Contin...@vmbuild.apache.org [continuum] BUILD SUCCESSFUL: Maven SCM - Maven SCM Starteam Provider - Build Def: default maven2 buildDefinition Tue, 05 Aug, 22:07
Contin...@vmbuild.apache.org [continuum] BUILD SUCCESSFUL: Maven SCM - Maven SCM Subversion Provider - Parent - Build Def: default maven2 buildDefinition Tue, 05 Aug, 22:07
Contin...@vmbuild.apache.org [continuum] BUILD SUCCESSFUL: Maven SCM - Maven SCM Subversion Provider - Common library - Build Def: default maven2 buildDefinition Tue, 05 Aug, 22:08
Contin...@vmbuild.apache.org [continuum] BUILD SUCCESSFUL: Maven SCM - Maven SCM Subversion Provider TCK Tests - Build Def: default maven2 buildDefinition Tue, 05 Aug, 22:08
Contin...@vmbuild.apache.org [continuum] BUILD SUCCESSFUL: Maven SCM - Maven SCM Subversion Provider - SVN Executable Impl. - Build Def: default maven2 buildDefinition Tue, 05 Aug, 22:09
Contin...@vmbuild.apache.org [continuum] BUILD SUCCESSFUL: Maven SCM - Maven SCM Synergy Provider - Build Def: default maven2 buildDefinition Tue, 05 Aug, 22:09
Contin...@vmbuild.apache.org [continuum] BUILD SUCCESSFUL: Maven SCM - Maven SCM Visual Source Safe Provider - Build Def: default maven2 buildDefinition Tue, 05 Aug, 22:10
Contin...@vmbuild.apache.org [continuum] BUILD SUCCESSFUL: Maven SCM - Maven SCM Client - Build Def: default maven2 buildDefinition Tue, 05 Aug, 22:10
Contin...@vmbuild.apache.org [continuum] BUILD SUCCESSFUL: Maven SCM - Maven SCM Plugin - Build Def: default maven2 buildDefinition Tue, 05 Aug, 22:11
Contin...@vmbuild.apache.org [continuum] BUILD FAILURE: Maven SCM - Maven SCM CVS Provider - CVS Executable Impl. - Build Def: default maven2 buildDefinition Wed, 06 Aug, 01:23
Contin...@vmbuild.apache.org [continuum] BUILD FAILURE: Maven 2.1.x (trunk) - Integration Test Executor - Build Def: default maven2 buildDefinition Wed, 06 Aug, 03:17
Contin...@vmbuild.apache.org [continuum] BUILD SUCCESSFUL: Maven SCM - Maven SCM CVS Provider - CVS Executable Impl. - Build Def: default maven2 buildDefinition Wed, 06 Aug, 04:35
Contin...@vmbuild.apache.org [continuum] BUILD FAILURE: Maven 2.1.x (trunk) - Integration Test Executor - Build Def: default maven2 buildDefinition Wed, 06 Aug, 16:43
Contin...@vmbuild.apache.org [continuum] BUILD FAILURE: Maven 2.1.x (trunk) - Integration Test Executor - Build Def: default maven2 buildDefinition Wed, 06 Aug, 23:44
Contin...@vmbuild.apache.org [continuum] BUILD FAILURE: Maven 2.1.x (trunk) - Integration Test Executor - Build Def: default maven2 buildDefinition Fri, 08 Aug, 07:04
Contin...@vmbuild.apache.org [continuum] BUILD FAILURE: Maven 2.1.x (trunk) - Integration Test Executor - Build Def: default maven2 buildDefinition Fri, 08 Aug, 15:49
Contin...@vmbuild.apache.org [continuum] BUILD FAILURE: Maven 2.1.x (trunk) - Integration Test Executor - Build Def: default maven2 buildDefinition Sat, 09 Aug, 11:01
Contin...@vmbuild.apache.org [continuum] BUILD FAILURE: Maven SCM - Maven SCM git Provider - Common library - Build Def: default maven2 buildDefinition Mon, 11 Aug, 18:44
Contin...@vmbuild.apache.org [continuum] BUILD FAILURE: Maven SCM - Maven SCM git Provider - git Executable Impl. - Build Def: default maven2 buildDefinition Mon, 11 Aug, 18:45
Contin...@vmbuild.apache.org [continuum] BUILD FAILURE: Maven SCM - Maven SCM Mercurial (Hg) Provider - Build Def: default maven2 buildDefinition Mon, 11 Aug, 18:46
Contin...@vmbuild.apache.org [continuum] BUILD FAILURE: Maven SCM - Maven SCM Mercurial (Hg) Provider - Build Def: default maven2 buildDefinition Mon, 11 Aug, 18:49
Contin...@vmbuild.apache.org [continuum] BUILD FAILURE: Maven SCM - Maven SCM Mercurial (Hg) Provider - Build Def: default maven2 buildDefinition Mon, 11 Aug, 18:51
Contin...@vmbuild.apache.org [continuum] BUILD FAILURE: Maven SCM - Maven SCM Subversion Provider - SVN Executable Impl. - Build Def: default maven2 buildDefinition Mon, 11 Aug, 19:10
Contin...@vmbuild.apache.org [continuum] BUILD FAILURE: Maven SCM - Maven SCM Perforce Provider - Build Def: default maven2 buildDefinition Mon, 11 Aug, 19:11
Contin...@vmbuild.apache.org [continuum] BUILD FAILURE: Maven SCM - Maven SCM Perforce Provider - Build Def: default maven2 buildDefinition Mon, 11 Aug, 19:36
Contin...@vmbuild.apache.org [continuum] BUILD FAILURE: Maven SCM - Maven SCM Perforce Provider - Build Def: default maven2 buildDefinition Mon, 11 Aug, 19:39
Contin...@vmbuild.apache.org [continuum] BUILD FAILURE: Maven SCM - Maven SCM Perforce Provider - Build Def: default maven2 buildDefinition Mon, 11 Aug, 19:50
Contin...@vmbuild.apache.org [continuum] BUILD FAILURE: Maven SCM - Maven SCM Subversion Provider - SVN Executable Impl. - Build Def: default maven2 buildDefinition Mon, 11 Aug, 21:23
Contin...@vmbuild.apache.org [continuum] BUILD FAILURE: Maven SCM - Maven SCM Perforce Provider - Build Def: default maven2 buildDefinition Mon, 11 Aug, 21:24
Contin...@vmbuild.apache.org [continuum] BUILD FAILURE: Maven SCM - Maven SCM git Provider - Common library - Build Def: default maven2 buildDefinition Mon, 11 Aug, 21:36
Contin...@vmbuild.apache.org [continuum] BUILD FAILURE: Maven SCM - Maven SCM git Provider - git Executable Impl. - Build Def: default maven2 buildDefinition Mon, 11 Aug, 21:37
Contin...@vmbuild.apache.org [continuum] BUILD FAILURE: Maven SCM - Maven SCM Mercurial (Hg) Provider - Build Def: default maven2 buildDefinition Mon, 11 Aug, 21:37
Contin...@vmbuild.apache.org [continuum] BUILD FAILURE: Maven 2.1.x (trunk) - Integration Test Executor - Build Def: default maven2 buildDefinition Tue, 12 Aug, 01:29
Contin...@vmbuild.apache.org [continuum] BUILD FAILURE: Maven SCM - Maven SCM Test - Build Def: default maven2 buildDefinition Tue, 12 Aug, 08:37
Contin...@vmbuild.apache.org [continuum] BUILD FAILURE: Maven SCM - Maven SCM Subversion Provider - Parent - Build Def: default maven2 buildDefinition Tue, 12 Aug, 08:37
Contin...@vmbuild.apache.org [continuum] BUILD FAILURE: Maven SCM - Maven SCM Subversion Provider - Common library - Build Def: default maven2 buildDefinition Tue, 12 Aug, 08:38
Contin...@vmbuild.apache.org [continuum] BUILD FAILURE: Maven SCM - Maven SCM Subversion Provider TCK Tests - Build Def: default maven2 buildDefinition Tue, 12 Aug, 08:38
Contin...@vmbuild.apache.org [continuum] BUILD FAILURE: Maven SCM - Maven SCM Subversion Provider - SVN Executable Impl. - Build Def: default maven2 buildDefinition Tue, 12 Aug, 08:39
Contin...@vmbuild.apache.org [continuum] BUILD FAILURE: Maven SCM - Maven SCM Local Provider - Build Def: default maven2 buildDefinition Tue, 12 Aug, 08:40
Contin...@vmbuild.apache.org [continuum] BUILD FAILURE: Maven SCM - Maven SCM Perforce Provider - Build Def: default maven2 buildDefinition Tue, 12 Aug, 08:40
Contin...@vmbuild.apache.org [continuum] BUILD FAILURE: Maven SCM - Maven SCM Starteam Provider - Build Def: default maven2 buildDefinition Tue, 12 Aug, 08:41
Contin...@vmbuild.apache.org [continuum] BUILD FAILURE: Maven SCM - Maven SCM git Provider - Parent - Build Def: default maven2 buildDefinition Tue, 12 Aug, 08:42
Contin...@vmbuild.apache.org [continuum] BUILD FAILURE: Maven SCM - Maven SCM git Provider - Common library - Build Def: default maven2 buildDefinition Tue, 12 Aug, 08:44
Contin...@vmbuild.apache.org [continuum] BUILD FAILURE: Maven SCM - Maven SCM git Provider TCK Tests - Build Def: default maven2 buildDefinition Tue, 12 Aug, 08:44
Contin...@vmbuild.apache.org [continuum] BUILD FAILURE: Maven SCM - Maven SCM git Provider - git Executable Impl. - Build Def: default maven2 buildDefinition Tue, 12 Aug, 08:45
Message list1 · 2 · 3 · 4 · 5 · 6 · 7 · 8 · Next »Thread · Author · Date
Box list
Dec 2014283
Nov 2014618
Oct 2014426
Sep 2014304
Aug 2014246
Jul 2014317
Jun 2014341
May 2014161
Apr 2014146
Mar 2014336
Feb 2014308
Jan 2014189
Dec 2013319
Nov 2013274
Oct 2013167
Sep 2013486
Aug 2013263
Jul 2013726
Jun 2013722
May 2013378
Apr 2013313
Mar 2013467
Feb 2013520
Jan 20131437
Dec 20121778
Nov 2012775
Oct 20121224
Sep 2012791
Aug 2012362
Jul 2012232
Jun 2012149
May 2012189
Apr 2012115
Mar 201257
Feb 2012155
Jan 2012170
Dec 2011244
Nov 2011187
Oct 2011139
Sep 2011190
Aug 2011276
Jul 201194
Jun 20114
Apr 201162
Mar 201176
Feb 201154
Jan 201185
Dec 201079
Nov 201061
Oct 201058
Sep 20101
Aug 201057
Jul 201037
Jun 201020
May 201075
Apr 201053
Mar 201012
Feb 201030
Jan 201071
Dec 2009104
Nov 200919
Oct 200931
Sep 2009193
Aug 2009268
Jul 2009193
Jun 2009147
May 200975
Apr 200979
Mar 2009134
Feb 2009657
Jan 200983
Dec 2008349
Nov 2008288
Oct 2008986
Sep 2008842
Aug 2008707
Jul 2008887
Jun 2008167
May 200821
Apr 2008231
Mar 2008438
Feb 2008317
Jan 2008205
Dec 2007185
Nov 2007532
Oct 2007439
Sep 2007699
Aug 20071294
Jul 2007351
Jun 20072211
May 2007273
Apr 2007262
Mar 2007534
Feb 20071648
Jan 20072359
Dec 2006575
Nov 2006357
Oct 2006642
Sep 2006660
Aug 20061662
Jul 20061320
Jun 2006473
May 20064700
Apr 20061113
Mar 20061048