maven-notifications mailing list archives

Site index · List index
Message view « Date » · « Thread »
Top « Date » · « Thread »
From Hudson <Hud...@sonatype.org>
Subject Build failed in Hudson: maven-assembly-plugin-trunk » Maven Assembly Plugin #8
Date Sat, 02 Aug 2008 18:37:24 GMT
See http://ci.sonatype.org/job/maven-assembly-plugin-trunk/org.apache.maven.plugins$maven-assembly-plugin/8/changes

------------------------------------------
channel started
+ Error stacktraces are turned on.
[INFO] Scanning for projects...
[INFO] ------------------------------------------------------------------------
[INFO] Building Maven Assembly Plugin
[INFO]    task-segment: [clean, deploy]
[INFO] ------------------------------------------------------------------------
[INFO] snapshot org.apache.maven.plugins:maven-component-it-plugin:1.0-SNAPSHOT: checking
for updates from central
[INFO] snapshot org.apache.maven.plugins:maven-component-it-plugin:1.0-SNAPSHOT: checking
for updates from apache.snapshots
[INFO] snapshot org.apache.maven.plugins:maven-component-it-plugin:1.0-SNAPSHOT: checking
for updates from codehaus.snapshots
[INFO] snapshot org.apache.maven.plugins:maven-component-it-plugin:1.0-SNAPSHOT: checking
for updates from central
[INFO] snapshot org.apache.maven.plugins:maven-component-it-plugin:1.0-SNAPSHOT: checking
for updates from codehaus.org
[INFO] snapshot org.apache.maven.plugins:maven-component-it-plugin:1.0-SNAPSHOT: checking
for updates from apache.snapshots
[INFO] [clean:clean]
[INFO] Deleting directory http://ci.sonatype.org/job/maven-assembly-plugin-trunk/org.apache.maven.plugins$maven-assembly-plugin/ws/target

[INFO] Deleting directory http://ci.sonatype.org/job/maven-assembly-plugin-trunk/org.apache.maven.plugins$maven-assembly-plugin/ws/target/classes

[INFO] Deleting directory http://ci.sonatype.org/job/maven-assembly-plugin-trunk/org.apache.maven.plugins$maven-assembly-plugin/ws/target/test-classes

[INFO] Deleting file-set: src/it (included: [**/target, **/build.log], excluded: [])
[WARNING] Attempting to build MavenProject instance for Artifact (org.apache.maven.plugins:maven-component-it-plugin:1.0-20080219.232826-8)
of type: maven-plugin; constructing POM artifact instead.
[INFO] [component-it:inject-local-repository-path {execution: inject-localrepo-path}]
[INFO] Injecting local-repository path: /home/j2ee-hudson/repos/maven-plugins into project
properties under key: local.repo.path
[INFO] [plugin:helpmojo {execution: generated-helpmojo}]
[INFO] Using 2 extractors.
[INFO] Applying extractor for language: java
[INFO] Extractor for language: java found 9 mojo descriptors.
[INFO] Applying extractor for language: bsh
[INFO] Extractor for language: bsh found 0 mojo descriptors.
[INFO] [modello:xpp3-reader {execution: mdo}]
[INFO] outputDirectory: http://ci.sonatype.org/job/maven-assembly-plugin-trunk/org.apache.maven.plugins$maven-assembly-plugin/ws/target/generated-sources/modello

[INFO] Working on model: src/main/mdo/descriptor.mdo
[INFO] Generating current version: 1.1.0
[INFO] Working on model: src/main/mdo/component.mdo
[INFO] Generating current version: 1.1.0
[INFO] [modello:xpp3-writer {execution: mdo}]
[INFO] outputDirectory: http://ci.sonatype.org/job/maven-assembly-plugin-trunk/org.apache.maven.plugins$maven-assembly-plugin/ws/target/generated-sources/modello

[INFO] Working on model: src/main/mdo/descriptor.mdo
[INFO] Generating current version: 1.1.0
[INFO] Working on model: src/main/mdo/component.mdo
[INFO] Generating current version: 1.1.0
[INFO] [modello:java {execution: mdo}]
[INFO] outputDirectory: http://ci.sonatype.org/job/maven-assembly-plugin-trunk/org.apache.maven.plugins$maven-assembly-plugin/ws/target/generated-sources/modello

[INFO] Working on model: src/main/mdo/descriptor.mdo
[INFO] Generating current version: 1.1.0
[INFO] Working on model: src/main/mdo/component.mdo
[INFO] Generating current version: 1.1.0
[INFO] [modello:xsd {execution: mdo}]
[INFO] outputDirectory: http://ci.sonatype.org/job/maven-assembly-plugin-trunk/org.apache.maven.plugins$maven-assembly-plugin/ws/target/generated-site/xsd

[INFO] Working on model: src/main/mdo/descriptor.mdo
[INFO] Generating current version: 1.1.0
[INFO] Working on model: src/main/mdo/component.mdo
[INFO] Generating current version: 1.1.0
[INFO] [plexus:descriptor {execution: create-component-descriptor}]
[INFO] snapshot org.apache.maven:maven-archiver:2.4-SNAPSHOT: checking for updates from central
[INFO] snapshot org.apache.maven:maven-archiver:2.4-SNAPSHOT: checking for updates from codehaus.org
[INFO] snapshot org.apache.maven:maven-archiver:2.4-SNAPSHOT: checking for updates from apache.snapshots
Downloading: http://localhost:8081/content/groups/public/org/apache/maven/maven-archiver/2.4-SNAPSHOT/maven-archiver-2.4-20080802.183217-184.pom
3K downloaded
Downloading: http://localhost:8081/content/groups/public/org/apache/maven/maven-archiver/2.4-SNAPSHOT/maven-archiver-2.4-20080802.183217-184.jar
17K downloaded
[INFO] [plugin:descriptor]
[INFO] Using 2 extractors.
[INFO] Applying extractor for language: java
[INFO] Extractor for language: java found 10 mojo descriptors.
[INFO] Applying extractor for language: bsh
[INFO] Extractor for language: bsh found 0 mojo descriptors.
[INFO] Setting property: classpath.resource.loader.class => 'org.codehaus.plexus.velocity.ContextClassLoaderResourceLoader'.
[INFO] Setting property: velocimacro.messages.on => 'false'.
[INFO] Setting property: resource.loader => 'classpath'.
[INFO] Setting property: resource.manager.logwhenfound => 'false'.
[INFO] [remote-resources:process {execution: default}]
[INFO] [plexus:merge-descriptors {execution: merge}]
[INFO] [resources:resources]
[INFO] Using default encoding to copy filtered resources.
[INFO] [compiler:compile]
[INFO] Compiling 80 source files to http://ci.sonatype.org/job/maven-assembly-plugin-trunk/org.apache.maven.plugins$maven-assembly-plugin/ws/target/classes

[INFO] [resources:testResources]
[INFO] Using default encoding to copy filtered resources.
[INFO] [compiler:testCompile]
[INFO] Compiling 33 source files to http://ci.sonatype.org/job/maven-assembly-plugin-trunk/org.apache.maven.plugins$maven-assembly-plugin/ws/target/test-classes

[INFO] [surefire:test]
[INFO] Surefire report directory: http://ci.sonatype.org/job/maven-assembly-plugin-trunk/org.apache.maven.plugins$maven-assembly-plugin/ws/target/surefire-reports


-------------------------------------------------------
 T E S T S
-------------------------------------------------------
Running org.apache.maven.plugin.assembly.archive.phase.ModuleSetAssemblyPhaseTest
Tests run: 28, Failures: 0, Errors: 0, Skipped: 0, Time elapsed: 1.109 sec
Running org.apache.maven.plugin.assembly.utils.PropertyUtilsTest
Tests run: 9, Failures: 0, Errors: 0, Skipped: 0, Time elapsed: 0.076 sec
Running org.apache.maven.plugin.assembly.utils.AssemblyFormatUtilsTest
Tests run: 55, Failures: 0, Errors: 0, Skipped: 0, Time elapsed: 0.604 sec
Running org.apache.maven.plugin.assembly.archive.phase.RepositoryAssemblyPhaseTest
Tests run: 2, Failures: 0, Errors: 0, Skipped: 0, Time elapsed: 0.092 sec
Running org.apache.maven.plugin.assembly.archive.task.AddDirectoryTaskTest
Tests run: 4, Failures: 0, Errors: 0, Skipped: 0, Time elapsed: 0.076 sec
Running org.apache.maven.plugin.assembly.format.FileFormatterTest
Tests run: 12, Failures: 0, Errors: 0, Skipped: 0, Time elapsed: 0.397 sec
Running org.apache.maven.plugin.assembly.archive.task.AddFileSetsTaskTest
Tests run: 9, Failures: 0, Errors: 0, Skipped: 0, Time elapsed: 0.387 sec
Running org.apache.maven.plugin.assembly.utils.FilterUtilsTest
Tests run: 12, Failures: 0, Errors: 0, Skipped: 0, Time elapsed: 0.027 sec
Running org.apache.maven.plugin.assembly.utils.PropertiesInterpolationValueSourceTest
Tests run: 3, Failures: 0, Errors: 0, Skipped: 0, Time elapsed: 0.03 sec
Running org.apache.maven.plugin.assembly.archive.DefaultAssemblyArchiverTest
Tests run: 9, Failures: 0, Errors: 0, Skipped: 0, Time elapsed: 0.118 sec
Running org.apache.maven.plugin.assembly.archive.task.AddDependencySetsTaskTest
Tests run: 8, Failures: 0, Errors: 0, Skipped: 0, Time elapsed: 0.743 sec
Running org.apache.maven.plugin.assembly.utils.AssemblyFileUtilsTest
Tests run: 9, Failures: 0, Errors: 0, Skipped: 0, Time elapsed: 0.042 sec
Running org.apache.maven.plugin.assembly.io.DefaultAssemblyReaderTest
Tests run: 24, Failures: 0, Errors: 0, Skipped: 0, Time elapsed: 0.836 sec
Running org.apache.maven.plugin.assembly.filter.ComponentsXmlArchiverFileFilterTest
Tests run: 7, Failures: 0, Errors: 0, Skipped: 0, Time elapsed: 0.241 sec
Running org.apache.maven.plugin.assembly.archive.archiver.AssemblyProxyArchiverTest
Tests run: 2, Failures: 0, Errors: 0, Skipped: 0, Time elapsed: 0.032 sec
Running org.apache.maven.plugin.assembly.format.FileSetFormatterTest
Tests run: 8, Failures: 0, Errors: 0, Skipped: 0, Time elapsed: 0.256 sec
Running org.apache.maven.plugin.assembly.archive.phase.FileItemAssemblyPhaseTest
Tests run: 6, Failures: 0, Errors: 0, Skipped: 0, Time elapsed: 0.963 sec
Running org.apache.maven.plugin.assembly.interpolation.AssemblyInterpolatorTest
Tests run: 7, Failures: 0, Errors: 0, Skipped: 0, Time elapsed: 0.123 sec
Running org.apache.maven.plugin.assembly.archive.task.AddArtifactTaskTest
Tests run: 5, Failures: 0, Errors: 0, Skipped: 0, Time elapsed: 0.171 sec
Running org.apache.maven.plugin.assembly.utils.ProjectUtilsTest
Tests run: 5, Failures: 0, Errors: 0, Skipped: 0, Time elapsed: 0.008 sec
Running org.apache.maven.plugin.assembly.archive.phase.DependencySetAssemblyPhaseTest
Tests run: 2, Failures: 0, Errors: 0, Skipped: 0, Time elapsed: 0.039 sec
Running org.apache.maven.plugin.assembly.utils.TypeConversionUtilsTest
Tests run: 6, Failures: 0, Errors: 0, Skipped: 0, Time elapsed: 0.006 sec
Running org.apache.maven.plugin.assembly.archive.phase.FileSetAssemblyPhaseTest
Tests run: 2, Failures: 0, Errors: 0, Skipped: 0, Time elapsed: 0.086 sec
Running org.apache.maven.plugin.assembly.archive.ManifestCreationFinalizerTest
Tests run: 4, Failures: 0, Errors: 0, Skipped: 0, Time elapsed: 0.051 sec

Results :

Tests run: 238, Failures: 0, Errors: 0, Skipped: 0

[HUDSON] Recording test results
[INFO] [jar:jar]
[INFO] Building jar: http://ci.sonatype.org/job/maven-assembly-plugin-trunk/org.apache.maven.plugins$maven-assembly-plugin/ws/target/maven-assembly-plugin-2.2-beta-3-SNAPSHOT.jar

[INFO] [plugin:addPluginArtifactMetadata]
[INFO] [component-it:stage {execution: stage-artifact-types}]
Using target/it-build-target and target/it-build-target/classes to build IT version of plugin
Using staged plugin-pom: http://ci.sonatype.org/job/maven-assembly-plugin-trunk/org.apache.maven.plugins$maven-assembly-plugin/ws/maven-assembly-artifact-types/pom-testing.xml

Using IT Plugin Jar: http://ci.sonatype.org/job/maven-assembly-plugin-trunk/org.apache.maven.plugins$maven-assembly-plugin/ws/maven-assembly-artifact-types/target/it-build-target/maven-assembly-artifact-types-testing.jar

[INFO] Installing http://ci.sonatype.org/job/maven-assembly-plugin-trunk/org.apache.maven.plugins$maven-assembly-plugin/ws/maven-assembly-artifact-types/target/it-build-target/maven-assembly-artifact-types-testing.jar
 to http://ci.sonatype.org/job/maven-assembly-plugin-trunk/org.apache.maven.plugins$maven-assembly-plugin/ws/target/local-repository/org/apache/maven/plugins/maven-assembly-artifact-types/testing/maven-assembly-artifact-types-testing.jar

[INFO] Installing http://ci.sonatype.org/job/maven-assembly-plugin-trunk/org.apache.maven.plugins$maven-assembly-plugin/ws/maven-assembly-artifact-types/../pom.xml
 to http://ci.sonatype.org/job/maven-assembly-plugin-trunk/org.apache.maven.plugins$maven-assembly-plugin/ws/target/local-repository/org/apache/maven/plugins/maven-assembly-plugin/2.2-beta-3-SNAPSHOT/maven-assembly-plugin-2.2-beta-3-SNAPSHOT.pom

[INFO] [component-it:stage {execution: stage-plugin}]
Using target/it-build-target and target/it-build-target/classes to build IT version of plugin
Using staged plugin-pom: http://ci.sonatype.org/job/maven-assembly-plugin-trunk/org.apache.maven.plugins$maven-assembly-plugin/ws/pom-testing.xml

Using IT Plugin Jar: http://ci.sonatype.org/job/maven-assembly-plugin-trunk/org.apache.maven.plugins$maven-assembly-plugin/ws/target/it-build-target/maven-assembly-plugin-testing.jar

[INFO] Installing http://ci.sonatype.org/job/maven-assembly-plugin-trunk/org.apache.maven.plugins$maven-assembly-plugin/ws/target/it-build-target/maven-assembly-plugin-testing.jar
 to http://ci.sonatype.org/job/maven-assembly-plugin-trunk/org.apache.maven.plugins$maven-assembly-plugin/ws/target/local-repository/org/apache/maven/plugins/maven-assembly-plugin/testing/maven-assembly-plugin-testing.jar

[HUDSON] Archiving http://ci.sonatype.org/job/maven-assembly-plugin-trunk/org.apache.maven.plugins$maven-assembly-plugin/ws/pom.xml
 to /home/j2ee-hudson/.hudson/jobs/maven-assembly-plugin-trunk/modules/org.apache.maven.plugins$maven-assembly-plugin/builds/2008-08-02_13-35-28/archive/org.apache.maven.plugins/maven-assembly-plugin/2.2-beta-3-SNAPSHOT/pom.xml
[HUDSON] Archiving http://ci.sonatype.org/job/maven-assembly-plugin-trunk/org.apache.maven.plugins$maven-assembly-plugin/ws/target/maven-assembly-plugin-2.2-beta-3-SNAPSHOT.jar
 to /home/j2ee-hudson/.hudson/jobs/maven-assembly-plugin-trunk/modules/org.apache.maven.plugins$maven-assembly-plugin/builds/2008-08-02_13-35-28/archive/org.apache.maven.plugins/maven-assembly-plugin/2.2-beta-3-SNAPSHOT/maven-assembly-plugin-2.2-beta-3-SNAPSHOT.jar
[INFO] Error for project: Maven Assembly Plugin (during deploy)
[INFO] ------------------------------------------------------------------------
[INFO] Failed to stage plugin with version: testing to test local repository: http://ci.sonatype.org/job/maven-assembly-plugin-trunk/org.apache.maven.plugins$maven-assembly-plugin/ws/target/local-repository


Embedded error: Error installing plugin artifact to target local repository: http://ci.sonatype.org/job/maven-assembly-plugin-trunk/org.apache.maven.plugins$maven-assembly-plugin/ws/target/local-repository

File http://ci.sonatype.org/job/maven-assembly-plugin-trunk/org.apache.maven.plugins$maven-assembly-plugin/ws/target/it-build-target/maven-assembly-plugin-testing.jar
 does not exist
[INFO] ------------------------------------------------------------------------
[INFO] Trace
org.apache.maven.lifecycle.LifecycleExecutionException: Failed to stage plugin with version:
testing to test local repository: http://ci.sonatype.org/job/maven-assembly-plugin-trunk/org.apache.maven.plugins$maven-assembly-plugin/ws/target/local-repository

	at org.apache.maven.lifecycle.DefaultLifecycleExecutor.executeGoals(DefaultLifecycleExecutor.java:583)
	at org.apache.maven.lifecycle.DefaultLifecycleExecutor.executeGoalWithLifecycle(DefaultLifecycleExecutor.java:499)
	at org.apache.maven.lifecycle.DefaultLifecycleExecutor.executeGoal(DefaultLifecycleExecutor.java:478)
	at org.apache.maven.lifecycle.DefaultLifecycleExecutor.executeGoalAndHandleFailures(DefaultLifecycleExecutor.java:330)
	at org.apache.maven.lifecycle.DefaultLifecycleExecutor.executeTaskSegments(DefaultLifecycleExecutor.java:291)
	at org.apache.maven.lifecycle.DefaultLifecycleExecutor.execute(DefaultLifecycleExecutor.java:142)
	at org.apache.maven.lifecycle.LifecycleExecutorInterceptor.execute(LifecycleExecutorInterceptor.java:42)
	at org.apache.maven.DefaultMaven.doExecute(DefaultMaven.java:336)
	at org.apache.maven.DefaultMaven.execute(DefaultMaven.java:129)
	at org.apache.maven.cli.MavenCli.main(MavenCli.java:287)
	at sun.reflect.NativeMethodAccessorImpl.invoke0(Native Method)
	at sun.reflect.NativeMethodAccessorImpl.invoke(NativeMethodAccessorImpl.java:39)
	at sun.reflect.DelegatingMethodAccessorImpl.invoke(DelegatingMethodAccessorImpl.java:25)
	at java.lang.reflect.Method.invoke(Method.java:585)
	at org.codehaus.classworlds.Launcher.launchEnhanced(Launcher.java:315)
	at org.codehaus.classworlds.Launcher.launch(Launcher.java:255)
	at hudson.maven.agent.Main.launch(Main.java:133)
	at hudson.maven.MavenBuilder.call(MavenBuilder.java:135)
	at hudson.maven.MavenModuleSetBuild$Builder.call(MavenModuleSetBuild.java:536)
	at hudson.maven.MavenModuleSetBuild$Builder.call(MavenModuleSetBuild.java:482)
	at hudson.remoting.UserRequest.perform(UserRequest.java:69)
	at hudson.remoting.UserRequest.perform(UserRequest.java:23)
	at hudson.remoting.Request$2.run(Request.java:206)
	at java.util.concurrent.Executors$RunnableAdapter.call(Executors.java:417)
	at java.util.concurrent.FutureTask$Sync.innerRun(FutureTask.java:269)
	at java.util.concurrent.FutureTask.run(FutureTask.java:123)
	at java.util.concurrent.ThreadPoolExecutor$Worker.runTask(ThreadPoolExecutor.java:650)
	at java.util.concurrent.ThreadPoolExecutor$Worker.run(ThreadPoolExecutor.java:675)
	at java.lang.Thread.run(Thread.java:595)
Caused by: org.apache.maven.plugin.MojoExecutionException: Failed to stage plugin with version:
testing to test local repository: http://ci.sonatype.org/job/maven-assembly-plugin-trunk/org.apache.maven.plugins$maven-assembly-plugin/ws/target/local-repository

	at org.apache.maven.plugin.componentit.StagingBuildMojo.execute(StagingBuildMojo.java:99)
	at org.apache.maven.plugin.DefaultPluginManager.executeMojo(DefaultPluginManager.java:451)
	at hudson.maven.agent.PluginManagerInterceptor.executeMojo(PluginManagerInterceptor.java:159)
	at org.apache.maven.lifecycle.DefaultLifecycleExecutor.executeGoals(DefaultLifecycleExecutor.java:558)
	... 28 more
Caused by: org.apache.maven.shared.test.plugin.TestToolsException: Error installing plugin
artifact to target local repository: http://ci.sonatype.org/job/maven-assembly-plugin-trunk/org.apache.maven.plugins$maven-assembly-plugin/ws/target/local-repository

	at org.apache.maven.shared.test.plugin.RepositoryTool.createLocalRepositoryFromComponentProject(RepositoryTool.java:203)
	at org.apache.maven.shared.test.plugin.ComponentTestTool.prepareForTesting(ComponentTestTool.java:182)
	at org.apache.maven.shared.test.plugin.ComponentTestTool.prepareComponentForUnitTestingWithMavenBuilds(ComponentTestTool.java:121)
	at org.apache.maven.plugin.componentit.StagingBuildMojo.execute(StagingBuildMojo.java:90)
	... 31 more
Caused by: org.apache.maven.artifact.installer.ArtifactInstallationException: Error installing
artifact: File http://ci.sonatype.org/job/maven-assembly-plugin-trunk/org.apache.maven.plugins$maven-assembly-plugin/ws/target/it-build-target/maven-assembly-plugin-testing.jar
 does not exist
	at org.apache.maven.artifact.installer.DefaultArtifactInstaller.install(DefaultArtifactInstaller.java:87)
	at org.apache.maven.shared.test.plugin.RepositoryTool.createLocalRepositoryFromComponentProject(RepositoryTool.java:199)
	... 34 more
Caused by: java.io.IOException: File http://ci.sonatype.org/job/maven-assembly-plugin-trunk/org.apache.maven.plugins$maven-assembly-plugin/ws/target/it-build-target/maven-assembly-plugin-testing.jar
 does not exist
	at hidden.org.codehaus.plexus.util.FileUtils.copyFile(FileUtils.java:922)
	at org.apache.maven.artifact.installer.DefaultArtifactInstaller.install(DefaultArtifactInstaller.java:73)
	... 35 more
[INFO] ------------------------------------------------------------------------
[INFO] BUILD ERRORS
[INFO] ------------------------------------------------------------------------
[INFO] Total time: 1 minute 49 seconds
[INFO] Finished at: Sat Aug 02 13:37:24 CDT 2008
[INFO] Final Memory: 48M/206M
[INFO] ------------------------------------------------------------------------


Mime
View raw message