maven-notifications mailing list archives

Site index · List index
Message view « Date » · « Thread »
Top « Date » · « Thread »
From Hudson <Hud...@sonatype.org>
Subject Build failed in Hudson: mercury #35
Date Fri, 01 Aug 2008 23:46:54 GMT
See http://ci.sonatype.org/job/mercury/35/changes

Changes:

[ogusakov] restoring new Mercury structure

[ogusakov] removed .settings from svn

[ogusakov] adding new Mercury

[ogusakov] adding new Mercury

------------------------------------------
[...truncated 486 lines...]
Downloading: http://localhost:8081/content/groups/public/org/codehaus/plexus/plexus-containers/1.0-alpha-30/plexus-containers-1.0-alpha-30.pom
1K downloaded
Downloading: http://localhost:8081/content/groups/public/org/apache/maven/doxia/doxia-decoration-model/1.0-alpha-10/doxia-decoration-model-1.0-alpha-10.pom
2K downloaded
Downloading: http://localhost:8081/content/groups/public/org/apache/maven/doxia/doxia-sitetools/1.0-alpha-10/doxia-sitetools-1.0-alpha-10.pom
7K downloaded
Downloading: http://localhost:8081/content/groups/public/org/apache/maven/doxia/doxia-site-renderer/1.0-alpha-10/doxia-site-renderer-1.0-alpha-10.pom
4K downloaded
Downloading: http://localhost:8081/content/groups/public/org/codehaus/plexus/plexus-i18n/1.0-beta-7/plexus-i18n-1.0-beta-7.pom
1K downloaded
Downloading: http://localhost:8081/content/groups/public/org/codehaus/plexus/plexus-components/1.1.12/plexus-components-1.1.12.pom
2K downloaded
Downloading: http://localhost:8081/content/groups/public/org/codehaus/plexus/plexus/1.0.10/plexus-1.0.10.pom
8K downloaded
Downloading: http://localhost:8081/content/groups/public/org/codehaus/plexus/plexus-utils/1.4.1/plexus-utils-1.4.1.pom
1K downloaded
Downloading: http://localhost:8081/content/groups/public/org/codehaus/plexus/plexus-velocity/1.1.7/plexus-velocity-1.1.7.pom
1K downloaded
Downloading: http://localhost:8081/content/groups/public/org/apache/velocity/velocity/1.5/velocity-1.5.pom
7K downloaded
Downloading: http://localhost:8081/content/groups/public/commons-collections/commons-collections/3.1/commons-collections-3.1.pom
5K downloaded
Downloading: http://localhost:8081/content/groups/public/commons-lang/commons-lang/2.1/commons-lang-2.1.pom
9K downloaded
Downloading: http://localhost:8081/content/groups/public/oro/oro/2.0.8/oro-2.0.8.pom
140b downloaded
Downloading: http://localhost:8081/content/groups/public/commons-collections/commons-collections/3.2/commons-collections-3.2.pom
10K downloaded
Downloading: http://localhost:8081/content/groups/public/org/apache/maven/doxia/doxia-module-apt/1.0-alpha-10/doxia-module-apt-1.0-alpha-10.pom
2K downloaded
Downloading: http://localhost:8081/content/groups/public/org/apache/maven/doxia/doxia-module-fml/1.0-alpha-10/doxia-module-fml-1.0-alpha-10.pom
2K downloaded
Downloading: http://localhost:8081/content/groups/public/org/apache/maven/doxia/doxia-module-xdoc/1.0-alpha-10/doxia-module-xdoc-1.0-alpha-10.pom
2K downloaded
Downloading: http://localhost:8081/content/groups/public/org/apache/maven/reporting/maven-reporting-api/2.0.4/maven-reporting-api-2.0.4.pom
902b downloaded
Downloading: http://localhost:8081/content/groups/public/org/apache/maven/reporting/maven-reporting/2.0.4/maven-reporting-2.0.4.pom
700b downloaded
Downloading: http://localhost:8081/content/groups/public/org/apache/maven/maven/2.0.4/maven-2.0.4.pom
11K downloaded
Downloading: http://localhost:8081/content/groups/public/org/apache/maven/doxia/doxia-sink-api/1.0-alpha-7/doxia-sink-api-1.0-alpha-7.pom
424b downloaded
Downloading: http://localhost:8081/content/groups/public/org/apache/maven/doxia/doxia/1.0-alpha-7/doxia-1.0-alpha-7.pom
3K downloaded
Downloading: http://localhost:8081/content/groups/public/org/apache/maven/wagon/wagon-provider-api/1.0-beta-2/wagon-provider-api-1.0-beta-2.pom
680b downloaded
Downloading: http://localhost:8081/content/groups/public/org/apache/maven/wagon/wagon/1.0-beta-2/wagon-1.0-beta-2.pom
5K downloaded
Downloading: http://localhost:8081/content/groups/public/org/apache/maven/maven-parent/4/maven-parent-4.pom
9K downloaded
Downloading: http://localhost:8081/content/groups/public/org/codehaus/plexus/plexus-archiver/1.0-alpha-7/plexus-archiver-1.0-alpha-7.pom
1K downloaded
Downloading: http://localhost:8081/content/groups/public/org/codehaus/plexus/plexus-components/1.1.6/plexus-components-1.1.6.pom
1K downloaded
Downloading: http://localhost:8081/content/groups/public/org/codehaus/plexus/plexus/1.0.8/plexus-1.0.8.pom
7K downloaded
Downloading: http://localhost:8081/content/groups/public/org/codehaus/plexus/plexus-utils/1.2/plexus-utils-1.2.pom
767b downloaded
Downloading: http://localhost:8081/content/groups/public/org/codehaus/plexus/plexus/1.0.5/plexus-1.0.5.pom
5K downloaded
Downloading: http://localhost:8081/content/groups/public/org/mortbay/jetty/jetty/6.1.5/jetty-6.1.5.pom
4K downloaded
Downloading: http://localhost:8081/content/groups/public/org/mortbay/jetty/project/6.1.5/project-6.1.5.pom
12K downloaded
Downloading: http://localhost:8081/content/groups/public/org/mortbay/jetty/jetty-util/6.1.5/jetty-util-6.1.5.pom
3K downloaded
Downloading: http://localhost:8081/content/groups/public/org/mortbay/jetty/servlet-api-2.5/6.1.5/servlet-api-2.5-6.1.5.pom
3K downloaded
Downloading: http://localhost:8081/content/groups/public/org/codehaus/plexus/plexus-utils/1.4.5/plexus-utils-1.4.5.jar
200K downloaded
Downloading: http://localhost:8081/content/groups/public/org/apache/maven/doxia/doxia-module-xhtml/1.0-alpha-10/doxia-module-xhtml-1.0-alpha-10.jar
20K downloaded
Downloading: http://localhost:8081/content/groups/public/org/apache/maven/doxia/doxia-core/1.0-alpha-10/doxia-core-1.0-alpha-10.jar
53K downloaded
Downloading: http://localhost:8081/content/groups/public/org/apache/maven/doxia/doxia-decoration-model/1.0-alpha-10/doxia-decoration-model-1.0-alpha-10.jar
48K downloaded
Downloading: http://localhost:8081/content/groups/public/org/apache/maven/doxia/doxia-site-renderer/1.0-alpha-10/doxia-site-renderer-1.0-alpha-10.jar
44K downloaded
Downloading: http://localhost:8081/content/groups/public/org/codehaus/plexus/plexus-i18n/1.0-beta-7/plexus-i18n-1.0-beta-7.jar
10K downloaded
Downloading: http://localhost:8081/content/groups/public/org/codehaus/plexus/plexus-velocity/1.1.7/plexus-velocity-1.1.7.jar
7K downloaded
Downloading: http://localhost:8081/content/groups/public/org/apache/velocity/velocity/1.5/velocity-1.5.jar
382K downloaded
Downloading: http://localhost:8081/content/groups/public/commons-collections/commons-collections/3.2/commons-collections-3.2.jar
557K downloaded
Downloading: http://localhost:8081/content/groups/public/commons-lang/commons-lang/2.1/commons-lang-2.1.jar
202K downloaded
Downloading: http://localhost:8081/content/groups/public/oro/oro/2.0.8/oro-2.0.8.jar
63K downloaded
Downloading: http://localhost:8081/content/groups/public/org/apache/maven/doxia/doxia-module-apt/1.0-alpha-10/doxia-module-apt-1.0-alpha-10.jar
45K downloaded
Downloading: http://localhost:8081/content/groups/public/org/apache/maven/doxia/doxia-module-fml/1.0-alpha-10/doxia-module-fml-1.0-alpha-10.jar
17K downloaded
Downloading: http://localhost:8081/content/groups/public/org/apache/maven/doxia/doxia-module-xdoc/1.0-alpha-10/doxia-module-xdoc-1.0-alpha-10.jar
26K downloaded
Downloading: http://localhost:8081/content/groups/public/org/codehaus/plexus/plexus-archiver/1.0-alpha-7/plexus-archiver-1.0-alpha-7.jar
138K downloaded
Downloading: http://localhost:8081/content/groups/public/org/mortbay/jetty/jetty/6.1.5/jetty-6.1.5.jar
474K downloaded
Downloading: http://localhost:8081/content/groups/public/org/mortbay/jetty/jetty-util/6.1.5/jetty-util-6.1.5.jar
134K downloaded
Downloading: http://localhost:8081/content/groups/public/org/mortbay/jetty/servlet-api-2.5/6.1.5/servlet-api-2.5-6.1.5.jar
129K downloaded
[INFO] [site:attach-descriptor]
Downloading: http://localhost:8081/content/groups/public/org/codehaus/plexus/plexus-container-default/1.0-alpha-43/plexus-container-default-1.0-alpha-43.pom
3K downloaded
Downloading: http://localhost:8081/content/groups/public/org/codehaus/plexus/plexus-containers/1.0-alpha-43/plexus-containers-1.0-alpha-43.pom
1K downloaded
Downloading: http://localhost:8081/content/groups/public/aspectj/aspectjrt/1.5.3/aspectjrt-1.5.3.pom
657b downloaded
Downloading: http://localhost:8081/content/groups/public/org/codehaus/plexus/plexus-classworlds/1.2-alpha-10/plexus-classworlds-1.2-alpha-10.pom
3K downloaded
Downloading: http://localhost:8081/content/groups/public/org/codehaus/plexus/plexus-utils/1.5.1/plexus-utils-1.5.1.pom
2K downloaded
Downloading: http://localhost:8081/content/groups/public/org/slf4j/slf4j-simple/1.5.2/slf4j-simple-1.5.2.pom
1K downloaded
Downloading: http://localhost:8081/content/groups/public/org/slf4j/slf4j-parent/1.5.2/slf4j-parent-1.5.2.pom
7K downloaded
Downloading: http://localhost:8081/content/groups/public/org/slf4j/slf4j-api/1.5.2/slf4j-api-1.5.2.pom
2K downloaded
[INFO] snapshot org.codehaus.plexus:plexus-i18n:1.0-beta-10-SNAPSHOT: checking for updates
from central
Downloading: http://localhost:8081/content/groups/public/org/codehaus/plexus/plexus-i18n/1.0-beta-10-SNAPSHOT/plexus-i18n-1.0-beta-10-SNAPSHOT.pom
Downloading: http://localhost:8081/content/groups/public/org/codehaus/plexus/plexus-container-default/1.0-alpha-43/plexus-container-default-1.0-alpha-43.jar
255K downloaded
Downloading: http://localhost:8081/content/groups/public/aspectj/aspectjrt/1.5.3/aspectjrt-1.5.3.jar
112K downloaded
Downloading: http://localhost:8081/content/groups/public/org/codehaus/plexus/plexus-utils/1.5.1/plexus-utils-1.5.1.jar
205K downloaded
Downloading: http://localhost:8081/content/groups/public/org/codehaus/plexus/plexus-classworlds/1.2-alpha-10/plexus-classworlds-1.2-alpha-10.jar
41K downloaded
Downloading: http://localhost:8081/content/groups/public/junit/junit/3.8.1/junit-3.8.1.jar
118K downloaded
Downloading: http://localhost:8081/content/groups/public/org/slf4j/slf4j-simple/1.5.2/slf4j-simple-1.5.2.jar
7K downloaded
Downloading: http://localhost:8081/content/groups/public/org/slf4j/slf4j-api/1.5.2/slf4j-api-1.5.2.jar
16K downloaded
Downloading: http://localhost:8081/content/groups/public/org/codehaus/plexus/plexus-i18n/1.0-beta-10-SNAPSHOT/plexus-i18n-1.0-beta-10-SNAPSHOT.jar
[INFO] ------------------------------------------------------------------------
[ERROR] BUILD ERROR
[INFO] ------------------------------------------------------------------------
[INFO] Failed to resolve artifact.

Missing:
----------
1) org.codehaus.plexus:plexus-i18n:jar:1.0-beta-10-SNAPSHOT

  Try downloading the file manually from the project website.

  Then, install it using the command: 
      mvn install:install-file -DgroupId=org.codehaus.plexus -DartifactId=plexus-i18n -Dversion=1.0-beta-10-SNAPSHOT
-Dpackaging=jar -Dfile=/path/to/file

  Alternatively, if you host your own repository you can deploy the file there: 
      mvn deploy:deploy-file -DgroupId=org.codehaus.plexus -DartifactId=plexus-i18n -Dversion=1.0-beta-10-SNAPSHOT
-Dpackaging=jar -Dfile=/path/to/file -Durl=[url] -DrepositoryId=[id]

  Path to dependency: 
  	1) org.apache.maven.mercury:mercury-pom:pom:1-SNAPSHOT
  	2) org.codehaus.plexus:plexus-i18n:jar:1.0-beta-10-SNAPSHOT

----------
1 required artifact is missing.

for artifact: 
  org.apache.maven.mercury:mercury-pom:pom:1-SNAPSHOT

from the specified remote repositories:
  Nexus (http://localhost:8081/content/groups/public)


[INFO] ------------------------------------------------------------------------
[INFO] Trace
org.apache.maven.lifecycle.LifecycleExecutionException: Missing:
----------
1) org.codehaus.plexus:plexus-i18n:jar:1.0-beta-10-SNAPSHOT

  Try downloading the file manually from the project website.

  Then, install it using the command: 
      mvn install:install-file -DgroupId=org.codehaus.plexus -DartifactId=plexus-i18n -Dversion=1.0-beta-10-SNAPSHOT
-Dpackaging=jar -Dfile=/path/to/file

  Alternatively, if you host your own repository you can deploy the file there: 
      mvn deploy:deploy-file -DgroupId=org.codehaus.plexus -DartifactId=plexus-i18n -Dversion=1.0-beta-10-SNAPSHOT
-Dpackaging=jar -Dfile=/path/to/file -Durl=[url] -DrepositoryId=[id]

  Path to dependency: 
  	1) org.apache.maven.mercury:mercury-pom:pom:1-SNAPSHOT
  	2) org.codehaus.plexus:plexus-i18n:jar:1.0-beta-10-SNAPSHOT

----------
1 required artifact is missing.

for artifact: 
  org.apache.maven.mercury:mercury-pom:pom:1-SNAPSHOT

from the specified remote repositories:
  Nexus (http://localhost:8081/content/groups/public)

	at org.apache.maven.lifecycle.DefaultLifecycleExecutor.executeGoals(DefaultLifecycleExecutor.java:575)
	at org.apache.maven.lifecycle.DefaultLifecycleExecutor.executeGoalWithLifecycle(DefaultLifecycleExecutor.java:499)
	at org.apache.maven.lifecycle.DefaultLifecycleExecutor.executeGoal(DefaultLifecycleExecutor.java:478)
	at org.apache.maven.lifecycle.DefaultLifecycleExecutor.executeGoalAndHandleFailures(DefaultLifecycleExecutor.java:330)
	at org.apache.maven.lifecycle.DefaultLifecycleExecutor.executeTaskSegments(DefaultLifecycleExecutor.java:291)
	at org.apache.maven.lifecycle.DefaultLifecycleExecutor.execute(DefaultLifecycleExecutor.java:142)
	at org.apache.maven.DefaultMaven.doExecute(DefaultMaven.java:336)
	at org.apache.maven.DefaultMaven.execute(DefaultMaven.java:129)
	at org.apache.maven.cli.MavenCli.main(MavenCli.java:287)
	at sun.reflect.NativeMethodAccessorImpl.invoke0(Native Method)
	at sun.reflect.NativeMethodAccessorImpl.invoke(NativeMethodAccessorImpl.java:39)
	at sun.reflect.DelegatingMethodAccessorImpl.invoke(DelegatingMethodAccessorImpl.java:25)
	at java.lang.reflect.Method.invoke(Method.java:597)
	at org.codehaus.classworlds.Launcher.launchEnhanced(Launcher.java:315)
	at org.codehaus.classworlds.Launcher.launch(Launcher.java:255)
	at org.codehaus.classworlds.Launcher.mainWithExitCode(Launcher.java:430)
	at org.codehaus.classworlds.Launcher.main(Launcher.java:375)
Caused by: org.apache.maven.artifact.resolver.MultipleArtifactsNotFoundException: Missing:
----------
1) org.codehaus.plexus:plexus-i18n:jar:1.0-beta-10-SNAPSHOT

  Try downloading the file manually from the project website.

  Then, install it using the command: 
      mvn install:install-file -DgroupId=org.codehaus.plexus -DartifactId=plexus-i18n -Dversion=1.0-beta-10-SNAPSHOT
-Dpackaging=jar -Dfile=/path/to/file

  Alternatively, if you host your own repository you can deploy the file there: 
      mvn deploy:deploy-file -DgroupId=org.codehaus.plexus -DartifactId=plexus-i18n -Dversion=1.0-beta-10-SNAPSHOT
-Dpackaging=jar -Dfile=/path/to/file -Durl=[url] -DrepositoryId=[id]

  Path to dependency: 
  	1) org.apache.maven.mercury:mercury-pom:pom:1-SNAPSHOT
  	2) org.codehaus.plexus:plexus-i18n:jar:1.0-beta-10-SNAPSHOT

----------
1 required artifact is missing.

for artifact: 
  org.apache.maven.mercury:mercury-pom:pom:1-SNAPSHOT

from the specified remote repositories:
  Nexus (http://localhost:8081/content/groups/public)

	at org.apache.maven.artifact.resolver.DefaultArtifactResolver.resolveTransitively(DefaultArtifactResolver.java:324)
	at org.apache.maven.artifact.resolver.DefaultArtifactResolver.resolveTransitively(DefaultArtifactResolver.java:288)
	at org.apache.maven.plugin.DefaultPluginManager.resolveTransitiveDependencies(DefaultPluginManager.java:1415)
	at org.apache.maven.plugin.DefaultPluginManager.executeMojo(DefaultPluginManager.java:405)
	at org.apache.maven.lifecycle.DefaultLifecycleExecutor.executeGoals(DefaultLifecycleExecutor.java:558)
	... 16 more
[INFO] ------------------------------------------------------------------------
[INFO] Total time: 5 seconds
[INFO] Finished at: Fri Aug 01 18:46:54 CDT 2008
[INFO] Final Memory: 19M/381M
[INFO] ------------------------------------------------------------------------


Mime
View raw message