maven-notifications mailing list archives

Site index · List index
Message view « Date » · « Thread »
Top « Date » · « Thread »
From Hudson <Hud...@sonatype.org>
Subject Build failed in Hudson: mercury #36
Date Sat, 02 Aug 2008 00:46:51 GMT
See http://ci.sonatype.org/job/mercury/36/changes

Changes:

[ogusakov] MetadataTree is now DependencyTreeBuilder to follow Maven tradition

[ogusakov] added environment to MetadataProcessor.getDependencies() to enable remote/distributed
processing of metadata

[ogusakov] organized imports

[ogusakov] moved POM processing APIs into a separate project with only one dependency:  mercury-artifact

[ogusakov] enhanced http deployer diagnostics, all test pass

[ogusakov] enhanced http deployer diagnostics, all test pass

------------------------------------------
started
Updating https://svn.apache.org/repos/asf/maven/sandbox/trunk/mercury
U         mercury-transport/mercury-transport-http/src/test/java/org/apache/maven/mercury/spi/http/server/HttpTestServer.java
U         mercury-transport/mercury-transport-http/src/test/java/org/apache/maven/mercury/spi/http/server/SecurePutServer.java
U         mercury-transport/mercury-transport-http/src/test/java/org/apache/maven/mercury/spi/http/server/BatchFilterTest.java
U         mercury-transport/mercury-transport-http/src/test/java/org/apache/maven/mercury/spi/http/client/JettyDeployerTest.java
AU        mercury-transport/mercury-transport-http/src/test/resources/testRepo/file4.so
U         mercury-transport/mercury-transport-http/src/main/java/org/apache/maven/mercury/spi/http/server/StagingBatchFilter.java
U         mercury-transport/mercury-transport-http/src/main/java/org/apache/maven/mercury/spi/http/server/BatchFilter.java
U         mercury-transport/mercury-transport-http/src/main/java/org/apache/maven/mercury/spi/http/validate/PomValidator.java
U         mercury-transport/mercury-transport-http/src/main/java/org/apache/maven/mercury/spi/http/client/FileExchange.java
U         mercury-transport/mercury-transport-http/src/main/java/org/apache/maven/mercury/spi/http/client/retrieve/FileGetExchange.java
U         mercury-transport/mercury-transport-http/src/main/java/org/apache/maven/mercury/spi/http/client/retrieve/RetrievalRequest.java
U         mercury-transport/mercury-transport-http/src/main/java/org/apache/maven/mercury/spi/http/client/retrieve/DefaultRetrievalRequest.java
U         mercury-transport/mercury-transport-http/src/main/java/org/apache/maven/mercury/spi/http/client/retrieve/DefaultRetriever.java
U         mercury-transport/mercury-transport-http/src/main/java/org/apache/maven/mercury/spi/http/client/HandshakeExchange.java
U         mercury-transport/mercury-transport-http/src/main/java/org/apache/maven/mercury/spi/http/client/deploy/DeployRequest.java
U         mercury-transport/mercury-transport-http/src/main/java/org/apache/maven/mercury/spi/http/client/deploy/DeploymentTarget.java
U         mercury-transport/mercury-transport-http/src/main/java/org/apache/maven/mercury/spi/http/client/deploy/DefaultDeployer.java
U         mercury-transport/mercury-transport-http/src/main/java/org/apache/maven/mercury/spi/http/client/deploy/FilePutExchange.java
U         mercury-transport/mercury-transport-http/src/main/java/org/apache/maven/mercury/transport/http/HttpReaderTransport.java
U         mercury-md/mercury-md-sat/src/test/java/org/apache/maven/mercury/repository/metadata/MetadataReaderTest.java
U         mercury-md/mercury-md-sat/src/test/java/org/apache/maven/mercury/repository/MetadataProcessorMock.java
D         mercury-md/mercury-md-sat/src/test/java/org/apache/maven/mercury/metadata/MetadataTreeTest.java
AU        mercury-md/mercury-md-sat/src/test/java/org/apache/maven/mercury/metadata/DependencyTreeBuilderTest.java
D         mercury-md/mercury-md-sat/src/main/java/org/apache/maven/mercury/metadata/MetadataTree.java
AU        mercury-md/mercury-md-sat/src/main/java/org/apache/maven/mercury/metadata/DependencyTreeBuilder.java
A         mercury-external/src/main/java/org
A         mercury-external/src/main/java/org/apache
A         mercury-external/src/main/java/org/apache/maven
A         mercury-external/src/main/java/org/apache/maven/mercury
A         mercury-external/src/main/java/org/apache/maven/mercury/builder
A         mercury-external/src/main/java/org/apache/maven/mercury/builder/api
A         mercury-external/src/main/java/org/apache/maven/mercury/builder/api/MetadataProcessor.java
A         mercury-external/src/main/java/org/apache/maven/mercury/builder/api/MetadataReader.java
A         mercury-external/src/main/java/org/apache/maven/mercury/builder/api/MetadataProcessingException.java
U         mercury-external/pom.xml
D         mercury-repo/mercury-repo-api/src/main/java/org/apache/maven/mercury/repository/api/MetadataReader.java
D         mercury-repo/mercury-repo-api/src/main/java/org/apache/maven/mercury/repository/api/MetadataProcessor.java
D         mercury-repo/mercury-repo-api/src/main/java/org/apache/maven/mercury/repository/api/MetadataProcessingException.java
U         mercury-repo/mercury-repo-api/src/main/java/org/apache/maven/mercury/repository/api/AbstracRepositoryReader.java
U         mercury-repo/mercury-repo-api/src/main/java/org/apache/maven/mercury/repository/api/RepositoryReader.java
U         mercury-repo/mercury-repo-api/src/main/java/org/apache/maven/mercury/repository/api/AbstractRepository.java
U         mercury-repo/mercury-repo-api/src/main/java/org/apache/maven/mercury/repository/api/RepositoryWriterFactory.java
U         mercury-repo/mercury-repo-api/src/main/java/org/apache/maven/mercury/repository/api/VirtualRepositoryReader.java
U         mercury-repo/mercury-repo-api/src/main/java/org/apache/maven/mercury/repository/api/Repository.java
U         mercury-repo/mercury-repo-api/src/main/java/org/apache/maven/mercury/repository/api/RepositoryReaderFactory.java
U         mercury-repo/mercury-repo-api/pom.xml
U         mercury-repo/mercury-repo-local-m2/src/main/java/org/apache/maven/mercury/repository/local/m2/LocalRepositoryReaderM2Factory.java
U         mercury-repo/mercury-repo-local-m2/src/main/java/org/apache/maven/mercury/repository/local/m2/LocalRepositoryWriterM2.java
U         mercury-repo/mercury-repo-local-m2/src/main/java/org/apache/maven/mercury/repository/local/m2/LocalRepositoryM2.java
U         mercury-repo/mercury-repo-local-m2/src/main/java/org/apache/maven/mercury/repository/local/m2/LocalRepositoryReaderM2.java
U         mercury-repo/mercury-repo-local-m2/src/main/java/org/apache/maven/mercury/repository/local/m2/LocalRepositoryWriterM2Factory.java
U         mercury-repo/mercury-repo-remote-m2/src/main/java/org/apache/maven/mercury/repository/remote/m2/RemoteRepositoryReaderM2Factory.java
U         mercury-repo/mercury-repo-remote-m2/src/main/java/org/apache/maven/mercury/repository/remote/m2/RemoteRepositoryM2.java
U         mercury-repo/mercury-repo-remote-m2/src/main/java/org/apache/maven/mercury/repository/remote/m2/RemoteRepositoryReaderM2.java
At revision 681920
[mercury] $ /opt/maven/2.0/bin/mvn clean deploy -B -U -e -Dmaven.repo.local=/home/j2ee-hudson/repos/mercury
-Pstrict -Dsurefire.useFile=false
+ Error stacktraces are turned on.
[INFO] Scanning for projects...
[INFO] Reactor build order: 
[INFO]   Mercury parent POM
[INFO]   Mercury Artifact
[INFO]   Mercury Metadata Reactor
[INFO]   Mercury shared MD models
[INFO]   Mercury Transport Reactor
[INFO]   Mercury transport APIs
[INFO]   Mercury External Dependencies
[INFO]   Mercury Repository reactor
[INFO]   Mercury Repository APIs
[INFO]   Mercury Local M2 Repository
[INFO]   Mercury Jetty HTTP transport implementation
[INFO]   Mercury Remote M2 Repository
[INFO]   Mercury dependency calulator
[INFO]   Mercury Reactor
[INFO] ------------------------------------------------------------------------
[INFO] Building Mercury parent POM
[INFO]    task-segment: [clean, deploy]
[INFO] ------------------------------------------------------------------------
[INFO] [clean:clean]
[INFO] [site:attach-descriptor]
[INFO] snapshot org.codehaus.plexus:plexus-i18n:1.0-beta-10-SNAPSHOT: checking for updates
from central
Downloading: http://localhost:8081/content/groups/public/org/codehaus/plexus/plexus-i18n/1.0-beta-10-SNAPSHOT/plexus-i18n-1.0-beta-10-SNAPSHOT.pom
Downloading: http://localhost:8081/content/groups/public/org/codehaus/plexus/plexus-i18n/1.0-beta-10-SNAPSHOT/plexus-i18n-1.0-beta-10-SNAPSHOT.jar
[INFO] ------------------------------------------------------------------------
[ERROR] BUILD ERROR
[INFO] ------------------------------------------------------------------------
[INFO] Failed to resolve artifact.

Missing:
----------
1) org.codehaus.plexus:plexus-i18n:jar:1.0-beta-10-SNAPSHOT

  Try downloading the file manually from the project website.

  Then, install it using the command: 
      mvn install:install-file -DgroupId=org.codehaus.plexus -DartifactId=plexus-i18n -Dversion=1.0-beta-10-SNAPSHOT
-Dpackaging=jar -Dfile=/path/to/file

  Alternatively, if you host your own repository you can deploy the file there: 
      mvn deploy:deploy-file -DgroupId=org.codehaus.plexus -DartifactId=plexus-i18n -Dversion=1.0-beta-10-SNAPSHOT
-Dpackaging=jar -Dfile=/path/to/file -Durl=[url] -DrepositoryId=[id]

  Path to dependency: 
  	1) org.apache.maven.mercury:mercury-pom:pom:1-SNAPSHOT
  	2) org.codehaus.plexus:plexus-i18n:jar:1.0-beta-10-SNAPSHOT

----------
1 required artifact is missing.

for artifact: 
  org.apache.maven.mercury:mercury-pom:pom:1-SNAPSHOT

from the specified remote repositories:
  Nexus (http://localhost:8081/content/groups/public)


[INFO] ------------------------------------------------------------------------
[INFO] Trace
org.apache.maven.lifecycle.LifecycleExecutionException: Missing:
----------
1) org.codehaus.plexus:plexus-i18n:jar:1.0-beta-10-SNAPSHOT

  Try downloading the file manually from the project website.

  Then, install it using the command: 
      mvn install:install-file -DgroupId=org.codehaus.plexus -DartifactId=plexus-i18n -Dversion=1.0-beta-10-SNAPSHOT
-Dpackaging=jar -Dfile=/path/to/file

  Alternatively, if you host your own repository you can deploy the file there: 
      mvn deploy:deploy-file -DgroupId=org.codehaus.plexus -DartifactId=plexus-i18n -Dversion=1.0-beta-10-SNAPSHOT
-Dpackaging=jar -Dfile=/path/to/file -Durl=[url] -DrepositoryId=[id]

  Path to dependency: 
  	1) org.apache.maven.mercury:mercury-pom:pom:1-SNAPSHOT
  	2) org.codehaus.plexus:plexus-i18n:jar:1.0-beta-10-SNAPSHOT

----------
1 required artifact is missing.

for artifact: 
  org.apache.maven.mercury:mercury-pom:pom:1-SNAPSHOT

from the specified remote repositories:
  Nexus (http://localhost:8081/content/groups/public)

	at org.apache.maven.lifecycle.DefaultLifecycleExecutor.executeGoals(DefaultLifecycleExecutor.java:575)
	at org.apache.maven.lifecycle.DefaultLifecycleExecutor.executeGoalWithLifecycle(DefaultLifecycleExecutor.java:499)
	at org.apache.maven.lifecycle.DefaultLifecycleExecutor.executeGoal(DefaultLifecycleExecutor.java:478)
	at org.apache.maven.lifecycle.DefaultLifecycleExecutor.executeGoalAndHandleFailures(DefaultLifecycleExecutor.java:330)
	at org.apache.maven.lifecycle.DefaultLifecycleExecutor.executeTaskSegments(DefaultLifecycleExecutor.java:291)
	at org.apache.maven.lifecycle.DefaultLifecycleExecutor.execute(DefaultLifecycleExecutor.java:142)
	at org.apache.maven.DefaultMaven.doExecute(DefaultMaven.java:336)
	at org.apache.maven.DefaultMaven.execute(DefaultMaven.java:129)
	at org.apache.maven.cli.MavenCli.main(MavenCli.java:287)
	at sun.reflect.NativeMethodAccessorImpl.invoke0(Native Method)
	at sun.reflect.NativeMethodAccessorImpl.invoke(NativeMethodAccessorImpl.java:39)
	at sun.reflect.DelegatingMethodAccessorImpl.invoke(DelegatingMethodAccessorImpl.java:25)
	at java.lang.reflect.Method.invoke(Method.java:597)
	at org.codehaus.classworlds.Launcher.launchEnhanced(Launcher.java:315)
	at org.codehaus.classworlds.Launcher.launch(Launcher.java:255)
	at org.codehaus.classworlds.Launcher.mainWithExitCode(Launcher.java:430)
	at org.codehaus.classworlds.Launcher.main(Launcher.java:375)
Caused by: org.apache.maven.artifact.resolver.MultipleArtifactsNotFoundException: Missing:
----------
1) org.codehaus.plexus:plexus-i18n:jar:1.0-beta-10-SNAPSHOT

  Try downloading the file manually from the project website.

  Then, install it using the command: 
      mvn install:install-file -DgroupId=org.codehaus.plexus -DartifactId=plexus-i18n -Dversion=1.0-beta-10-SNAPSHOT
-Dpackaging=jar -Dfile=/path/to/file

  Alternatively, if you host your own repository you can deploy the file there: 
      mvn deploy:deploy-file -DgroupId=org.codehaus.plexus -DartifactId=plexus-i18n -Dversion=1.0-beta-10-SNAPSHOT
-Dpackaging=jar -Dfile=/path/to/file -Durl=[url] -DrepositoryId=[id]

  Path to dependency: 
  	1) org.apache.maven.mercury:mercury-pom:pom:1-SNAPSHOT
  	2) org.codehaus.plexus:plexus-i18n:jar:1.0-beta-10-SNAPSHOT

----------
1 required artifact is missing.

for artifact: 
  org.apache.maven.mercury:mercury-pom:pom:1-SNAPSHOT

from the specified remote repositories:
  Nexus (http://localhost:8081/content/groups/public)

	at org.apache.maven.artifact.resolver.DefaultArtifactResolver.resolveTransitively(DefaultArtifactResolver.java:324)
	at org.apache.maven.artifact.resolver.DefaultArtifactResolver.resolveTransitively(DefaultArtifactResolver.java:288)
	at org.apache.maven.plugin.DefaultPluginManager.resolveTransitiveDependencies(DefaultPluginManager.java:1415)
	at org.apache.maven.plugin.DefaultPluginManager.executeMojo(DefaultPluginManager.java:405)
	at org.apache.maven.lifecycle.DefaultLifecycleExecutor.executeGoals(DefaultLifecycleExecutor.java:558)
	... 16 more
[INFO] ------------------------------------------------------------------------
[INFO] Total time: 3 seconds
[INFO] Finished at: Fri Aug 01 19:46:51 CDT 2008
[INFO] Final Memory: 19M/381M
[INFO] ------------------------------------------------------------------------


Mime
View raw message