maven-notifications mailing list archives

Site index · List index
Message view « Date » · « Thread »
Top « Date » · « Thread »
From Hudson <Hud...@sonatype.org>
Subject Build failed in Hudson: maven-components-trunk #19
Date Mon, 04 Aug 2008 11:19:38 GMT
See http://ci.sonatype.org/job/maven-components-trunk/19/changes

Changes:

[Vincent Siveton] o merged from r682323
Issue id: o merge

------------------------------------------
[...truncated 5475 lines...]
[DEBUG]   org.codehaus.plexus:plexus-utils:jar:1.5.5:compile (selected for compile)
[DEBUG]   org.codehaus.plexus:plexus-interpolation:jar:1.1:compile (selected for compile)
[DEBUG]   org.apache.maven.artifact:maven-artifact:jar:3.0-SNAPSHOT:compile (selected for
compile)
[DEBUG]     org.codehaus.plexus:plexus-utils:jar:1.5.1:compile (applying version: 1.5.5)
[DEBUG]     org.codehaus.plexus:plexus-container-default:jar:1.0-alpha-44:compile (applying
version: 1.0-alpha-48)
[DEBUG]     org.apache.maven.wagon:wagon-provider-api:jar:1.0-beta-3:compile (selected for
compile)
[DEBUG]       org.codehaus.plexus:plexus-utils:jar:1.4.2:compile (applying version: 1.5.5)
[DEBUG]     aspectj:aspectjrt:jar:1.5.3:compile (selected for compile)
[DEBUG]   org.codehaus.plexus:plexus-container-default:jar:1.0-alpha-48:compile (selected
for compile)
[DEBUG]     org.codehaus.plexus:plexus-utils:jar:1.4.5:compile (applying version: 1.5.5)
[DEBUG]     org.codehaus.plexus:plexus-classworlds:jar:1.2-alpha-13:compile (selected for
compile)
[DEBUG]       junit:junit:jar:3.8.1:compile (selected for compile)
[DEBUG]     org.apache.xbean:xbean-reflect:jar:3.4:compile (selected for compile)
[DEBUG]       log4j:log4j:jar:1.2.12:compile (selected for compile)
[DEBUG]       commons-logging:commons-logging-api:jar:1.1:compile (selected for compile)
[DEBUG]     junit:junit:jar:3.8.1:compile (selected for compile)
[DEBUG]   aspectj:aspectjrt:jar:1.5.3:compile (selected for compile)
[DEBUG]   org.apache.maven.wagon:wagon-file:jar:1.0-beta-3:test (selected for test)
[DEBUG]   org.codehaus.woodstox:wstx-asl:jar:3.2.6:compile (selected for compile)
[DEBUG]     stax:stax-api:jar:1.0.1:compile (selected for compile)
[DEBUG]   org.apache.maven.shared:maven-shared-model:jar:1.0-SNAPSHOT:compile (selected for
compile)
[DEBUG]     javax.xml.stream:stax-api:jar:1.0-2:compile (selected for compile)
[DEBUG]   junit:junit:jar:3.8.1:test (not setting scope to: compile; local scope test wins)
[DEBUG]   junit:junit:jar:3.8.1:test (selected for test)
[DEBUG] Configuring mojo 'org.apache.maven.plugins:maven-remote-resources-plugin:1.0-beta-2:process'
-->
[DEBUG]   (f) appendedResourcesDirectory = http://ci.sonatype.org/job/maven-components-trunk/ws/maven-2.1.x/maven-project/src/main/appended-resources

[DEBUG]   (f) attached = true
[DEBUG]   (f) localRepository = [local] -> file:///home/j2ee-hudson/repos/maven-2.1.x
[DEBUG]   (f) mavenSession = org.apache.maven.execution.MavenSession@395d601f
[DEBUG]   (f) outputDirectory = http://ci.sonatype.org/job/maven-components-trunk/ws/maven-2.1.x/maven-project/target/maven-shared-archive-resources

[DEBUG]   (f) project = MavenProject: org.apache.maven:maven-project:2.1-SNAPSHOT @ http://ci.sonatype.org/job/maven-components-trunk/ws/maven-2.1.x/maven-project/pom.xml

[DEBUG]   (f) remoteArtifactRepositories = [[central] -> http://Nexus, [apache.snapshots]
-> http://people.apache.org/repo/m2-snapshot-repository/, [codehaus.snapshots] -> http://snapshots.repository.codehaus.org/]
[DEBUG]   (f) repositories = [org.apache.maven.model.Repository@714fdb76, org.apache.maven.model.Repository@31d15a18,
org.apache.maven.model.Repository@2771f735]
[DEBUG]   (f) resourceBundles = [org.apache:apache-jar-resource-bundle:1.3]
[DEBUG]   (f) resources = [Resource {targetPath: null, filtering: false, FileSet {directory:
http://ci.sonatype.org/job/maven-components-trunk/ws/maven-2.1.x/maven-project/src/main/resources,
 PatternSet [includes: {}, excludes: {}]}}]
[DEBUG]   (f) skip = false
[DEBUG] -- end configuration --
[INFO] [remote-resources:process {execution: default}]
[DEBUG] Supplemental data models won't be loaded.  No models specified.
[DEBUG] Building project for org.apache.maven:maven-workspace:jar:2.1-SNAPSHOT:compile
[DEBUG] Adding project with groupId [org.apache.maven]
[DEBUG] Building project for org.codehaus.plexus:plexus-container-default:jar:1.0-alpha-48:compile
[DEBUG] Adding project with groupId [org.codehaus.plexus]
[DEBUG] Building project for aspectj:aspectjrt:jar:1.5.3:compile
[DEBUG] Adding project with groupId [aspectj]
[DEBUG] Building project for org.codehaus.plexus:plexus-utils:jar:1.5.5:compile
[DEBUG] Adding project with groupId [org.codehaus.plexus]
[DEBUG] Building project for org.codehaus.plexus:plexus-classworlds:jar:1.2-alpha-13:compile
[DEBUG] Adding project with groupId [org.codehaus.plexus]
[DEBUG] Building project for org.apache.xbean:xbean-reflect:jar:3.4:compile
[DEBUG] Adding project with groupId [org.apache.xbean]
[DEBUG] Building project for log4j:log4j:jar:1.2.12:compile
[DEBUG] Adding project with groupId [log4j]
[DEBUG] Building project for commons-logging:commons-logging-api:jar:1.1:compile
[DEBUG] Adding project with groupId [commons-logging]
[DEBUG] Building project for org.apache.maven:maven-profile:jar:2.1-SNAPSHOT:compile
[DEBUG] Adding project with groupId [org.apache.maven]
[DEBUG] Building project for org.apache.maven:maven-model:jar:2.1-SNAPSHOT:compile
[DEBUG] Adding project with groupId [org.apache.maven]
[DEBUG] Building project for org.codehaus.plexus:plexus-interpolation:jar:1.1:compile
[DEBUG] Adding project with groupId [org.codehaus.plexus]
[DEBUG] Building project for org.apache.maven.artifact:maven-artifact:jar:3.0-SNAPSHOT:compile
[DEBUG] Adding project with groupId [org.apache.maven.artifact]
[DEBUG] Building project for org.apache.maven.wagon:wagon-provider-api:jar:1.0-beta-3:compile
[DEBUG] Adding project with groupId [org.apache.maven.wagon]
[DEBUG] Building project for org.codehaus.woodstox:wstx-asl:jar:3.2.6:compile
[DEBUG] Adding project with groupId [org.codehaus.woodstox]
[DEBUG] Building project for stax:stax-api:jar:1.0.1:compile
[DEBUG] Adding project with groupId [stax]
[DEBUG] Building project for org.apache.maven.shared:maven-shared-model:jar:1.0-SNAPSHOT:compile
[DEBUG] Adding project with groupId [org.apache.maven.shared]
[DEBUG] Building project for javax.xml.stream:stax-api:jar:1.0-2:compile
[DEBUG] Adding project with groupId [javax.xml.stream]
[DEBUG] Configuring mojo 'org.apache.maven.plugins:maven-resources-plugin:2.2:resources' -->
[DEBUG]   (f) filters = []
[DEBUG]   (f) outputDirectory = http://ci.sonatype.org/job/maven-components-trunk/ws/maven-2.1.x/maven-project/target/classes

[DEBUG]   (f) project = MavenProject: org.apache.maven:maven-project:2.1-SNAPSHOT @ http://ci.sonatype.org/job/maven-components-trunk/ws/maven-2.1.x/maven-project/pom.xml

[DEBUG]   (f) resources = [Resource {targetPath: null, filtering: false, FileSet {directory:
http://ci.sonatype.org/job/maven-components-trunk/ws/maven-2.1.x/maven-project/src/main/resources,
 PatternSet [includes: {}, excludes: {}]}}, Resource {targetPath: null, filtering: false,
FileSet {directory: http://ci.sonatype.org/job/maven-components-trunk/ws/maven-2.1.x/maven-project/target/maven-shared-archive-resources,
 PatternSet [includes: {}, excludes: {}]}}]
[DEBUG] -- end configuration --
[INFO] [resources:resources]
[INFO] Using default encoding to copy filtered resources.
[DEBUG] org.apache.maven:maven-project:jar:2.1-SNAPSHOT (selected for null)
[DEBUG]   active project artifact:
	artifact = org.apache.maven:maven-workspace:jar:2.1-SNAPSHOT:compile;
	project: MavenProject: org.apache.maven:maven-workspace:2.1-SNAPSHOT @ http://ci.sonatype.org/job/maven-components-trunk/ws/maven-2.1.x/maven-workspace/pom.xml
 (selected for compile)
[DEBUG]     org.codehaus.plexus:plexus-container-default:jar:1.0-alpha-48:compile (selected
for compile)
[DEBUG]       aspectj:aspectjrt:jar:1.5.3:compile (selected for compile)
[DEBUG]       org.codehaus.plexus:plexus-utils:jar:1.4.5:compile (applying version: 1.5.5)
[DEBUG]       org.codehaus.plexus:plexus-utils:jar:1.5.5:compile (selected for compile)
[DEBUG]       org.codehaus.plexus:plexus-classworlds:jar:1.2-alpha-13:compile (selected for
compile)
[DEBUG]         junit:junit:jar:3.8.1:compile (selected for compile)
[DEBUG]       org.apache.xbean:xbean-reflect:jar:3.4:compile (selected for compile)
[DEBUG]         log4j:log4j:jar:1.2.12:compile (selected for compile)
[DEBUG]         commons-logging:commons-logging-api:jar:1.1:compile (selected for compile)
[DEBUG]       junit:junit:jar:3.8.1:compile (selected for compile)
[DEBUG]   active project artifact:
	artifact = org.apache.maven:maven-profile:jar:2.1-SNAPSHOT:compile;
	project: MavenProject: org.apache.maven:maven-profile:2.1-SNAPSHOT @ http://ci.sonatype.org/job/maven-components-trunk/ws/maven-2.1.x/maven-profile/pom.xml
 (selected for compile)
[DEBUG]     active project artifact:
	artifact = org.apache.maven:maven-model:jar:2.1-SNAPSHOT:compile;
	project: MavenProject: org.apache.maven:maven-model:2.1-SNAPSHOT @ http://ci.sonatype.org/job/maven-components-trunk/ws/maven-2.1.x/maven-model/pom.xml
 (selected for compile)
[DEBUG]     org.codehaus.plexus:plexus-utils:jar:1.5.5:compile (selected for compile)
[DEBUG]   active project artifact:
	artifact = org.apache.maven:maven-model:jar:2.1-SNAPSHOT:compile;
	project: MavenProject: org.apache.maven:maven-model:2.1-SNAPSHOT @ http://ci.sonatype.org/job/maven-components-trunk/ws/maven-2.1.x/maven-model/pom.xml
 (selected for compile)
[DEBUG]   org.codehaus.plexus:plexus-utils:jar:1.5.5:compile (selected for compile)
[DEBUG]   org.codehaus.plexus:plexus-interpolation:jar:1.1:compile (selected for compile)
[DEBUG]   org.apache.maven.artifact:maven-artifact:jar:3.0-SNAPSHOT:compile (selected for
compile)
[DEBUG]     org.codehaus.plexus:plexus-utils:jar:1.5.1:compile (applying version: 1.5.5)
[DEBUG]     org.codehaus.plexus:plexus-container-default:jar:1.0-alpha-44:compile (applying
version: 1.0-alpha-48)
[DEBUG]     org.apache.maven.wagon:wagon-provider-api:jar:1.0-beta-3:compile (selected for
compile)
[DEBUG]       org.codehaus.plexus:plexus-utils:jar:1.4.2:compile (applying version: 1.5.5)
[DEBUG]     aspectj:aspectjrt:jar:1.5.3:compile (selected for compile)
[DEBUG]   org.codehaus.plexus:plexus-container-default:jar:1.0-alpha-48:compile (selected
for compile)
[DEBUG]     org.codehaus.plexus:plexus-utils:jar:1.4.5:compile (applying version: 1.5.5)
[DEBUG]     org.codehaus.plexus:plexus-classworlds:jar:1.2-alpha-13:compile (selected for
compile)
[DEBUG]       junit:junit:jar:3.8.1:compile (selected for compile)
[DEBUG]     org.apache.xbean:xbean-reflect:jar:3.4:compile (selected for compile)
[DEBUG]       log4j:log4j:jar:1.2.12:compile (selected for compile)
[DEBUG]       commons-logging:commons-logging-api:jar:1.1:compile (selected for compile)
[DEBUG]     junit:junit:jar:3.8.1:compile (selected for compile)
[DEBUG]   aspectj:aspectjrt:jar:1.5.3:compile (selected for compile)
[DEBUG]   org.apache.maven.wagon:wagon-file:jar:1.0-beta-3:test (selected for test)
[DEBUG]   org.codehaus.woodstox:wstx-asl:jar:3.2.6:compile (selected for compile)
[DEBUG]     stax:stax-api:jar:1.0.1:compile (selected for compile)
[DEBUG]   org.apache.maven.shared:maven-shared-model:jar:1.0-SNAPSHOT:compile (selected for
compile)
[DEBUG]     javax.xml.stream:stax-api:jar:1.0-2:compile (selected for compile)
[DEBUG]   junit:junit:jar:3.8.1:test (not setting scope to: compile; local scope test wins)
[DEBUG]   junit:junit:jar:3.8.1:test (selected for test)
[DEBUG] Configuring mojo 'org.apache.maven.plugins:maven-compiler-plugin:2.0.2:compile' -->
[DEBUG]   (f) basedir = http://ci.sonatype.org/job/maven-components-trunk/ws/maven-2.1.x/maven-project

[DEBUG]   (f) buildDirectory = http://ci.sonatype.org/job/maven-components-trunk/ws/maven-2.1.x/maven-project/target

[DEBUG]   (f) classpathElements = [http://ci.sonatype.org/job/maven-components-trunk/ws/maven-2.1.x/maven-project/target/classes,
 http://ci.sonatype.org/job/maven-components-trunk/ws/maven-2.1.x/maven-workspace/target/classes,
 /home/j2ee-hudson/repos/maven-2.1.x/org/codehaus/plexus/plexus-container-default/1.0-alpha-48/plexus-container-default-1.0-alpha-48.jar,
/home/j2ee-hudson/repos/maven-2.1.x/aspectj/aspectjrt/1.5.3/aspectjrt-1.5.3.jar, /home/j2ee-hudson/repos/maven-2.1.x/org/codehaus/plexus/plexus-utils/1.5.5/plexus-utils-1.5.5.jar,
/home/j2ee-hudson/repos/maven-2.1.x/org/codehaus/plexus/plexus-classworlds/1.2-alpha-13/plexus-classworlds-1.2-alpha-13.jar,
/home/j2ee-hudson/repos/maven-2.1.x/org/apache/xbean/xbean-reflect/3.4/xbean-reflect-3.4.jar,
/home/j2ee-hudson/repos/maven-2.1.x/log4j/log4j/1.2.12/log4j-1.2.12.jar, /home/j2ee-hudson/repos/maven-2.1.x/commons-logging/commons-logging-api/1.1/commons-logging-api-1.1.jar,
http://ci.sonatype.org/job/maven-components-trunk/ws/maven-2.1.x/maven-profile/target/classes,
 http://ci.sonatype.org/job/maven-components-trunk/ws/maven-2.1.x/maven-model/target/classes,
 /home/j2ee-hudson/repos/maven-2.1.x/org/codehaus/plexus/plexus-interpolation/1.1/plexus-interpolation-1.1.jar,
/home/j2ee-hudson/repos/maven-2.1.x/org/apache/maven/artifact/maven-artifact/3.0-SNAPSHOT/maven-artifact-3.0-SNAPSHOT.jar,
/home/j2ee-hudson/repos/maven-2.1.x/org/apache/maven/wagon/wagon-provider-api/1.0-beta-3/wagon-provider-api-1.0-beta-3.jar,
/home/j2ee-hudson/repos/maven-2.1.x/org/codehaus/woodstox/wstx-asl/3.2.6/wstx-asl-3.2.6.jar,
/home/j2ee-hudson/repos/maven-2.1.x/stax/stax-api/1.0.1/stax-api-1.0.1.jar, /home/j2ee-hudson/repos/maven-2.1.x/org/apache/maven/shared/maven-shared-model/1.0-SNAPSHOT/maven-shared-model-1.0-SNAPSHOT.jar,
/home/j2ee-hudson/repos/maven-2.1.x/javax/xml/stream/stax-api/1.0-2/stax-api-1.0-2.jar]
[DEBUG]   (f) compileSourceRoots = [http://ci.sonatype.org/job/maven-components-trunk/ws/maven-2.1.x/maven-project/src/main/java]

[DEBUG]   (f) compilerId = javac
[DEBUG]   (f) debug = true
[DEBUG]   (f) failOnError = true
[DEBUG]   (f) fork = false
[DEBUG]   (f) optimize = false
[DEBUG]   (f) outputDirectory = http://ci.sonatype.org/job/maven-components-trunk/ws/maven-2.1.x/maven-project/target/classes

[DEBUG]   (f) outputFileName = maven-project-2.1-SNAPSHOT
[DEBUG]   (f) projectArtifact = org.apache.maven:maven-project:jar:2.1-SNAPSHOT
[DEBUG]   (f) showDeprecation = false
[DEBUG]   (f) showWarnings = false
[DEBUG]   (f) source = 1.5
[DEBUG]   (f) staleMillis = 0
[DEBUG]   (f) target = 1.5
[DEBUG]   (f) verbose = false
[DEBUG] -- end configuration --
[INFO] [compiler:compile]
[DEBUG] Using compiler 'javac'.
[DEBUG] Source directories: [http://ci.sonatype.org/job/maven-components-trunk/ws/maven-2.1.x/maven-project/src/main/java]

[DEBUG] Classpath: [http://ci.sonatype.org/job/maven-components-trunk/ws/maven-2.1.x/maven-project/target/classes

 http://ci.sonatype.org/job/maven-components-trunk/ws/maven-2.1.x/maven-workspace/target/classes

 /home/j2ee-hudson/repos/maven-2.1.x/org/codehaus/plexus/plexus-container-default/1.0-alpha-48/plexus-container-default-1.0-alpha-48.jar
 /home/j2ee-hudson/repos/maven-2.1.x/aspectj/aspectjrt/1.5.3/aspectjrt-1.5.3.jar
 /home/j2ee-hudson/repos/maven-2.1.x/org/codehaus/plexus/plexus-utils/1.5.5/plexus-utils-1.5.5.jar
 /home/j2ee-hudson/repos/maven-2.1.x/org/codehaus/plexus/plexus-classworlds/1.2-alpha-13/plexus-classworlds-1.2-alpha-13.jar
 /home/j2ee-hudson/repos/maven-2.1.x/org/apache/xbean/xbean-reflect/3.4/xbean-reflect-3.4.jar
 /home/j2ee-hudson/repos/maven-2.1.x/log4j/log4j/1.2.12/log4j-1.2.12.jar
 /home/j2ee-hudson/repos/maven-2.1.x/commons-logging/commons-logging-api/1.1/commons-logging-api-1.1.jar
 http://ci.sonatype.org/job/maven-components-trunk/ws/maven-2.1.x/maven-profile/target/classes

 http://ci.sonatype.org/job/maven-components-trunk/ws/maven-2.1.x/maven-model/target/classes

 /home/j2ee-hudson/repos/maven-2.1.x/org/codehaus/plexus/plexus-interpolation/1.1/plexus-interpolation-1.1.jar
 /home/j2ee-hudson/repos/maven-2.1.x/org/apache/maven/artifact/maven-artifact/3.0-SNAPSHOT/maven-artifact-3.0-SNAPSHOT.jar
 /home/j2ee-hudson/repos/maven-2.1.x/org/apache/maven/wagon/wagon-provider-api/1.0-beta-3/wagon-provider-api-1.0-beta-3.jar
 /home/j2ee-hudson/repos/maven-2.1.x/org/codehaus/woodstox/wstx-asl/3.2.6/wstx-asl-3.2.6.jar
 /home/j2ee-hudson/repos/maven-2.1.x/stax/stax-api/1.0.1/stax-api-1.0.1.jar
 /home/j2ee-hudson/repos/maven-2.1.x/org/apache/maven/shared/maven-shared-model/1.0-SNAPSHOT/maven-shared-model-1.0-SNAPSHOT.jar
 /home/j2ee-hudson/repos/maven-2.1.x/javax/xml/stream/stax-api/1.0-2/stax-api-1.0-2.jar]
[DEBUG] Output directory: http://ci.sonatype.org/job/maven-components-trunk/ws/maven-2.1.x/maven-project/target/classes

[DEBUG] Classpath:
[DEBUG]  http://ci.sonatype.org/job/maven-components-trunk/ws/maven-2.1.x/maven-project/target/classes

[DEBUG]  http://ci.sonatype.org/job/maven-components-trunk/ws/maven-2.1.x/maven-workspace/target/classes

[DEBUG]  /home/j2ee-hudson/repos/maven-2.1.x/org/codehaus/plexus/plexus-container-default/1.0-alpha-48/plexus-container-default-1.0-alpha-48.jar
[DEBUG]  /home/j2ee-hudson/repos/maven-2.1.x/aspectj/aspectjrt/1.5.3/aspectjrt-1.5.3.jar
[DEBUG]  /home/j2ee-hudson/repos/maven-2.1.x/org/codehaus/plexus/plexus-utils/1.5.5/plexus-utils-1.5.5.jar
[DEBUG]  /home/j2ee-hudson/repos/maven-2.1.x/org/codehaus/plexus/plexus-classworlds/1.2-alpha-13/plexus-classworlds-1.2-alpha-13.jar
[DEBUG]  /home/j2ee-hudson/repos/maven-2.1.x/org/apache/xbean/xbean-reflect/3.4/xbean-reflect-3.4.jar
[DEBUG]  /home/j2ee-hudson/repos/maven-2.1.x/log4j/log4j/1.2.12/log4j-1.2.12.jar
[DEBUG]  /home/j2ee-hudson/repos/maven-2.1.x/commons-logging/commons-logging-api/1.1/commons-logging-api-1.1.jar
[DEBUG]  http://ci.sonatype.org/job/maven-components-trunk/ws/maven-2.1.x/maven-profile/target/classes

[DEBUG]  http://ci.sonatype.org/job/maven-components-trunk/ws/maven-2.1.x/maven-model/target/classes

[DEBUG]  /home/j2ee-hudson/repos/maven-2.1.x/org/codehaus/plexus/plexus-interpolation/1.1/plexus-interpolation-1.1.jar
[DEBUG]  /home/j2ee-hudson/repos/maven-2.1.x/org/apache/maven/artifact/maven-artifact/3.0-SNAPSHOT/maven-artifact-3.0-SNAPSHOT.jar
[DEBUG]  /home/j2ee-hudson/repos/maven-2.1.x/org/apache/maven/wagon/wagon-provider-api/1.0-beta-3/wagon-provider-api-1.0-beta-3.jar
[DEBUG]  /home/j2ee-hudson/repos/maven-2.1.x/org/codehaus/woodstox/wstx-asl/3.2.6/wstx-asl-3.2.6.jar
[DEBUG]  /home/j2ee-hudson/repos/maven-2.1.x/stax/stax-api/1.0.1/stax-api-1.0.1.jar
[DEBUG]  /home/j2ee-hudson/repos/maven-2.1.x/org/apache/maven/shared/maven-shared-model/1.0-SNAPSHOT/maven-shared-model-1.0-SNAPSHOT.jar
[DEBUG]  /home/j2ee-hudson/repos/maven-2.1.x/javax/xml/stream/stax-api/1.0-2/stax-api-1.0-2.jar
[DEBUG] Source roots:
[DEBUG]  http://ci.sonatype.org/job/maven-components-trunk/ws/maven-2.1.x/maven-project/src/main/java

[INFO] Compiling 82 source files to http://ci.sonatype.org/job/maven-components-trunk/ws/maven-2.1.x/maven-project/target/classes

[INFO] ------------------------------------------------------------------------
[ERROR] BUILD FAILURE
[INFO] ------------------------------------------------------------------------
[INFO] Compilation failure
http://ci.sonatype.org/job/maven-components-trunk/ws/maven-2.1.x/maven-project/src/main/java/org/apache/maven/project/builder/impl/DefaultProjectBuilder.java
:[157,41] cannot find symbol
symbol  : method transform(java.util.List<org.apache.maven.shared.model.DomainModel>,org.apache.maven.project.builder.PomClassicTransformer,org.apache.maven.project.builder.PomClassicTransformer,<nulltype>,java.util.List<org.apache.maven.shared.model.InterpolatorProperty>)
location: class org.apache.maven.shared.model.ModelTransformerContext



http://ci.sonatype.org/job/maven-components-trunk/ws/maven-2.1.x/maven-project/src/main/java/org/apache/maven/project/builder/impl/DefaultProjectBuilder.java
:[157,41] cannot find symbol
symbol  : method transform(java.util.List<org.apache.maven.shared.model.DomainModel>,org.apache.maven.project.builder.PomClassicTransformer,org.apache.maven.project.builder.PomClassicTransformer,<nulltype>,java.util.List<org.apache.maven.shared.model.InterpolatorProperty>)
location: class org.apache.maven.shared.model.ModelTransformerContext


[INFO] ------------------------------------------------------------------------
[DEBUG] Trace
org.apache.maven.BuildFailureException: Compilation failure
http://ci.sonatype.org/job/maven-components-trunk/ws/maven-2.1.x/maven-project/src/main/java/org/apache/maven/project/builder/impl/DefaultProjectBuilder.java
:[157,41] cannot find symbol
symbol  : method transform(java.util.List<org.apache.maven.shared.model.DomainModel>,org.apache.maven.project.builder.PomClassicTransformer,org.apache.maven.project.builder.PomClassicTransformer,<nulltype>,java.util.List<org.apache.maven.shared.model.InterpolatorProperty>)
location: class org.apache.maven.shared.model.ModelTransformerContext


	at org.apache.maven.lifecycle.DefaultLifecycleExecutor.executeGoals(DefaultLifecycleExecutor.java:579)
	at org.apache.maven.lifecycle.DefaultLifecycleExecutor.executeGoalWithLifecycle(DefaultLifecycleExecutor.java:499)
	at org.apache.maven.lifecycle.DefaultLifecycleExecutor.executeGoal(DefaultLifecycleExecutor.java:478)
	at org.apache.maven.lifecycle.DefaultLifecycleExecutor.executeGoalAndHandleFailures(DefaultLifecycleExecutor.java:330)
	at org.apache.maven.lifecycle.DefaultLifecycleExecutor.executeTaskSegments(DefaultLifecycleExecutor.java:291)
	at org.apache.maven.lifecycle.DefaultLifecycleExecutor.execute(DefaultLifecycleExecutor.java:142)
	at org.apache.maven.DefaultMaven.doExecute(DefaultMaven.java:336)
	at org.apache.maven.DefaultMaven.execute(DefaultMaven.java:129)
	at org.apache.maven.cli.MavenCli.main(MavenCli.java:287)
	at sun.reflect.NativeMethodAccessorImpl.invoke0(Native Method)
	at sun.reflect.NativeMethodAccessorImpl.invoke(NativeMethodAccessorImpl.java:39)
	at sun.reflect.DelegatingMethodAccessorImpl.invoke(DelegatingMethodAccessorImpl.java:25)
	at java.lang.reflect.Method.invoke(Method.java:585)
	at org.codehaus.classworlds.Launcher.launchEnhanced(Launcher.java:315)
	at org.codehaus.classworlds.Launcher.launch(Launcher.java:255)
	at org.codehaus.classworlds.Launcher.mainWithExitCode(Launcher.java:430)
	at org.codehaus.classworlds.Launcher.main(Launcher.java:375)
Caused by: org.apache.maven.plugin.CompilationFailureException: Compilation failure
http://ci.sonatype.org/job/maven-components-trunk/ws/maven-2.1.x/maven-project/src/main/java/org/apache/maven/project/builder/impl/DefaultProjectBuilder.java
:[157,41] cannot find symbol
symbol  : method transform(java.util.List<org.apache.maven.shared.model.DomainModel>,org.apache.maven.project.builder.PomClassicTransformer,org.apache.maven.project.builder.PomClassicTransformer,<nulltype>,java.util.List<org.apache.maven.shared.model.InterpolatorProperty>)
location: class org.apache.maven.shared.model.ModelTransformerContext


	at org.apache.maven.plugin.AbstractCompilerMojo.execute(AbstractCompilerMojo.java:516)
	at org.apache.maven.plugin.CompilerMojo.execute(CompilerMojo.java:114)
	at org.apache.maven.plugin.DefaultPluginManager.executeMojo(DefaultPluginManager.java:451)
	at org.apache.maven.lifecycle.DefaultLifecycleExecutor.executeGoals(DefaultLifecycleExecutor.java:558)
	... 16 more
[INFO] ------------------------------------------------------------------------
[INFO] Total time: 30 seconds
[INFO] Finished at: Mon Aug 04 06:19:37 CDT 2008
[INFO] Final Memory: 48M/419M
[INFO] ------------------------------------------------------------------------


Mime
View raw message