maven-notifications mailing list archives: July 2008

Site index · List index
Message list1 · 2 · 3 · 4 · 5 · 6 · 7 · Next »Thread · Author · Date
Build failed in Hudson: Maven-2.1.x #187
Hudson   Build failed in Hudson: Maven-2.1.x #187 Wed, 02 Jul, 16:04
Hudson     Build failed in Hudson: Maven-2.1.x #188 Wed, 02 Jul, 22:02
Hudson       Build failed in Hudson: Maven-2.1.x #189 Thu, 03 Jul, 12:17
Hudson         Hudson build is back to normal: Maven-2.1.x #190 Thu, 03 Jul, 13:40
[continuum] BUILD FAILURE: Maven 2.1.x (trunk) - Integration Test Executor - Build Def: default maven2 buildDefinition
Contin...@vmbuild.apache.org   [continuum] BUILD FAILURE: Maven 2.1.x (trunk) - Integration Test Executor - Build Def: default maven2 buildDefinition Wed, 02 Jul, 17:47
Contin...@vmbuild.apache.org   [continuum] BUILD FAILURE: Maven 2.1.x (trunk) - Integration Test Executor - Build Def: default maven2 buildDefinition Wed, 02 Jul, 19:52
Contin...@vmbuild.apache.org   [continuum] BUILD FAILURE: Maven 2.1.x (trunk) - Integration Test Executor - Build Def: default maven2 buildDefinition Wed, 02 Jul, 21:47
Contin...@vmbuild.apache.org   [continuum] BUILD FAILURE: Maven 2.1.x (trunk) - Integration Test Executor - Build Def: default maven2 buildDefinition Thu, 03 Jul, 15:28
Contin...@vmbuild.apache.org   [continuum] BUILD FAILURE: Maven 2.1.x (trunk) - Integration Test Executor - Build Def: default maven2 buildDefinition Thu, 03 Jul, 17:47
Contin...@vmbuild.apache.org   [continuum] BUILD FAILURE: Maven 2.1.x (trunk) - Integration Test Executor - Build Def: default maven2 buildDefinition Thu, 03 Jul, 22:14
Contin...@vmbuild.apache.org   [continuum] BUILD FAILURE: Maven 2.1.x (trunk) - Integration Test Executor - Build Def: default maven2 buildDefinition Fri, 04 Jul, 08:05
Contin...@vmbuild.apache.org   [continuum] BUILD FAILURE: Maven 2.1.x (trunk) - Integration Test Executor - Build Def: default maven2 buildDefinition Fri, 04 Jul, 17:48
Contin...@vmbuild.apache.org   [continuum] BUILD FAILURE: Maven 2.1.x (trunk) - Integration Test Executor - Build Def: default maven2 buildDefinition Fri, 04 Jul, 19:47
Contin...@vmbuild.apache.org   [continuum] BUILD FAILURE: Maven 2.1.x (trunk) - Integration Test Executor - Build Def: default maven2 buildDefinition Sat, 05 Jul, 16:15
Contin...@vmbuild.apache.org   [continuum] BUILD FAILURE: Maven 2.1.x (trunk) - Integration Test Executor - Build Def: default maven2 buildDefinition Sat, 05 Jul, 17:53
Contin...@vmbuild.apache.org   [continuum] BUILD FAILURE: Maven 2.1.x (trunk) - Integration Test Executor - Build Def: default maven2 buildDefinition Sat, 05 Jul, 19:23
Contin...@vmbuild.apache.org   [continuum] BUILD FAILURE: Maven 2.1.x (trunk) - Integration Test Executor - Build Def: default maven2 buildDefinition Sun, 06 Jul, 20:43
Contin...@vmbuild.apache.org   [continuum] BUILD FAILURE: Maven 2.1.x (trunk) - Integration Test Executor - Build Def: default maven2 buildDefinition Wed, 09 Jul, 04:29
Contin...@vmbuild.apache.org   [continuum] BUILD FAILURE: Maven 2.1.x (trunk) - Integration Test Executor - Build Def: default maven2 buildDefinition Wed, 09 Jul, 07:42
Contin...@vmbuild.apache.org   [continuum] BUILD FAILURE: Maven 2.1.x (trunk) - Integration Test Executor - Build Def: default maven2 buildDefinition Tue, 15 Jul, 18:36
Contin...@vmbuild.apache.org   [continuum] BUILD FAILURE: Maven 2.1.x (trunk) - Integration Test Executor - Build Def: default maven2 buildDefinition Tue, 22 Jul, 17:17
Contin...@vmbuild.apache.org   [continuum] BUILD FAILURE: Maven 2.1.x (trunk) - Integration Test Executor - Build Def: default maven2 buildDefinition Wed, 23 Jul, 00:41
Contin...@vmbuild.apache.org   [continuum] BUILD FAILURE: Maven 2.1.x (trunk) - Integration Test Executor - Build Def: default maven2 buildDefinition Wed, 23 Jul, 03:14
Contin...@vmbuild.apache.org   [continuum] BUILD FAILURE: Maven 2.1.x (trunk) - Integration Test Executor - Build Def: default maven2 buildDefinition Wed, 23 Jul, 05:35
Contin...@vmbuild.apache.org   [continuum] BUILD FAILURE: Maven 2.1.x (trunk) - Integration Test Executor - Build Def: default maven2 buildDefinition Wed, 23 Jul, 15:52
Contin...@vmbuild.apache.org   [continuum] BUILD FAILURE: Maven 2.1.x (trunk) - Integration Test Executor - Build Def: default maven2 buildDefinition Thu, 24 Jul, 18:36
Contin...@vmbuild.apache.org   [continuum] BUILD FAILURE: Maven 2.1.x (trunk) - Integration Test Executor - Build Def: default maven2 buildDefinition Fri, 25 Jul, 04:38
Contin...@vmbuild.apache.org   [continuum] BUILD FAILURE: Maven 2.1.x (trunk) - Integration Test Executor - Build Def: default maven2 buildDefinition Fri, 25 Jul, 16:44
Contin...@vmbuild.apache.org   [continuum] BUILD FAILURE: Maven 2.1.x (trunk) - Integration Test Executor - Build Def: default maven2 buildDefinition Fri, 25 Jul, 18:34
Contin...@vmbuild.apache.org   [continuum] BUILD FAILURE: Maven 2.1.x (trunk) - Integration Test Executor - Build Def: default maven2 buildDefinition Fri, 25 Jul, 21:47
Contin...@vmbuild.apache.org   [continuum] BUILD FAILURE: Maven 2.1.x (trunk) - Integration Test Executor - Build Def: default maven2 buildDefinition Sat, 26 Jul, 05:49
Contin...@vmbuild.apache.org   [continuum] BUILD FAILURE: Maven 2.1.x (trunk) - Integration Test Executor - Build Def: default maven2 buildDefinition Sat, 26 Jul, 07:04
Contin...@vmbuild.apache.org   [continuum] BUILD FAILURE: Maven 2.1.x (trunk) - Integration Test Executor - Build Def: default maven2 buildDefinition Sat, 26 Jul, 10:40
Contin...@vmbuild.apache.org   [continuum] BUILD FAILURE: Maven 2.1.x (trunk) - Integration Test Executor - Build Def: default maven2 buildDefinition Sun, 27 Jul, 16:33
Contin...@vmbuild.apache.org   [continuum] BUILD FAILURE: Maven 2.1.x (trunk) - Integration Test Executor - Build Def: default maven2 buildDefinition Sun, 27 Jul, 19:14
Contin...@vmbuild.apache.org   [continuum] BUILD FAILURE: Maven 2.1.x (trunk) - Integration Test Executor - Build Def: default maven2 buildDefinition Tue, 29 Jul, 00:26
Contin...@vmbuild.apache.org   [continuum] BUILD FAILURE: Maven 2.1.x (trunk) - Integration Test Executor - Build Def: default maven2 buildDefinition Tue, 29 Jul, 04:19
Contin...@vmbuild.apache.org   [continuum] BUILD FAILURE: Maven 2.1.x (trunk) - Integration Test Executor - Build Def: default maven2 buildDefinition Wed, 30 Jul, 22:41
Contin...@vmbuild.apache.org   [continuum] BUILD FAILURE: Maven 2.1.x (trunk) - Integration Test Executor - Build Def: default maven2 buildDefinition Thu, 31 Jul, 02:33
Contin...@vmbuild.apache.org   [continuum] BUILD FAILURE: Maven 2.1.x (trunk) - Integration Test Executor - Build Def: default maven2 buildDefinition Thu, 31 Jul, 06:56
Contin...@vmbuild.apache.org   [continuum] BUILD FAILURE: Maven 2.1.x (trunk) - Integration Test Executor - Build Def: default maven2 buildDefinition Thu, 31 Jul, 16:39
Hudson Hudson build is unstable: Maven-Plugins » Maven IDEA Plugin #68 Wed, 02 Jul, 22:41
Hudson   Hudson build is still unstable: Maven-Plugins » Maven IDEA Plugin #69 Thu, 03 Jul, 14:13
Hudson     Hudson build is still unstable: Maven-Plugins » Maven IDEA Plugin #70 Thu, 03 Jul, 21:29
Hudson       Hudson build is still unstable: Maven-Plugins » Maven IDEA Plugin #71 Thu, 03 Jul, 22:21
Hudson         Hudson build is still unstable: Maven-Plugins » Maven IDEA Plugin #72 Fri, 04 Jul, 05:52
Hudson           Hudson build is still unstable: Maven-Plugins » Maven IDEA Plugin #73 Fri, 04 Jul, 06:27
Hudson             Hudson build is still unstable: Maven-Plugins » Maven IDEA Plugin #74 Fri, 04 Jul, 09:33
Hudson               Hudson build is still unstable: Maven-Plugins » Maven IDEA Plugin #75 Fri, 04 Jul, 15:26
Hudson                 Hudson build is still unstable: Maven-Plugins » Maven IDEA Plugin #76 Fri, 04 Jul, 17:35
Hudson                   Hudson build is still unstable: Maven-Plugins » Maven IDEA Plugin #77 Fri, 04 Jul, 18:00
Hudson Build failed in Hudson: Maven-Plugins » Maven Dependency Plugin #68 Wed, 02 Jul, 22:41
Hudson   Build failed in Hudson: Maven-Plugins » Maven Dependency Plugin #69 Thu, 03 Jul, 14:13
Hudson     Build failed in Hudson: Maven-Plugins » Maven Dependency Plugin #70 Thu, 03 Jul, 21:29
Hudson       Build failed in Hudson: Maven-Plugins » Maven Dependency Plugin #71 Thu, 03 Jul, 22:21
Hudson         Build failed in Hudson: Maven-Plugins » Maven Dependency Plugin #72 Fri, 04 Jul, 05:52
Hudson           Build failed in Hudson: Maven-Plugins » Maven Dependency Plugin #73 Fri, 04 Jul, 06:27
Hudson             Build failed in Hudson: Maven-Plugins » Maven Dependency Plugin #74 Fri, 04 Jul, 09:33
Hudson               Build failed in Hudson: Maven-Plugins » Maven Dependency Plugin #75 Fri, 04 Jul, 15:26
Hudson                 Build failed in Hudson: Maven-Plugins » Maven Dependency Plugin #76 Fri, 04 Jul, 17:35
Hudson                   Build failed in Hudson: Maven-Plugins » Maven Dependency Plugin #77 Fri, 04 Jul, 18:00
Hudson Build failed in Hudson: Maven-Plugins » Maven Patch Plugin #68 Wed, 02 Jul, 22:41
Hudson   Build failed in Hudson: Maven-Plugins » Maven Patch Plugin #69 Thu, 03 Jul, 14:13
Hudson     Build failed in Hudson: Maven-Plugins » Maven Patch Plugin #70 Thu, 03 Jul, 21:29
Hudson       Build failed in Hudson: Maven-Plugins » Maven Patch Plugin #71 Thu, 03 Jul, 22:21
Hudson         Build failed in Hudson: Maven-Plugins » Maven Patch Plugin #72 Fri, 04 Jul, 05:52
Hudson           Build failed in Hudson: Maven-Plugins » Maven Patch Plugin #73 Fri, 04 Jul, 06:27
Hudson             Build failed in Hudson: Maven-Plugins » Maven Patch Plugin #74 Fri, 04 Jul, 09:33
Hudson               Build failed in Hudson: Maven-Plugins » Maven Patch Plugin #75 Fri, 04 Jul, 15:26
Hudson                 Build failed in Hudson: Maven-Plugins » Maven Patch Plugin #76 Fri, 04 Jul, 17:35
Hudson                   Build failed in Hudson: Maven-Plugins » Maven Patch Plugin #77 Fri, 04 Jul, 18:00
Hudson Hudson build is unstable: Maven-Plugins » Maven Ear plugin #68 Wed, 02 Jul, 22:41
Hudson   Hudson build is still unstable: Maven-Plugins » Maven Ear plugin #69 Thu, 03 Jul, 14:13
Hudson     Hudson build is still unstable: Maven-Plugins » Maven Ear plugin #70 Thu, 03 Jul, 21:29
Hudson       Hudson build is still unstable: Maven-Plugins » Maven Ear plugin #71 Thu, 03 Jul, 22:21
Hudson         Hudson build is still unstable: Maven-Plugins » Maven Ear plugin #72 Fri, 04 Jul, 05:52
Hudson           Hudson build is still unstable: Maven-Plugins » Maven Ear plugin #73 Fri, 04 Jul, 06:27
Hudson             Hudson build is still unstable: Maven-Plugins » Maven Ear plugin #74 Fri, 04 Jul, 09:33
Hudson               Hudson build is still unstable: Maven-Plugins » Maven Ear plugin #75 Fri, 04 Jul, 15:26
Hudson                 Hudson build is still unstable: Maven-Plugins » Maven Ear plugin #76 Fri, 04 Jul, 17:35
Hudson                   Hudson build is still unstable: Maven-Plugins » Maven Ear plugin #77 Fri, 04 Jul, 18:00
Hudson Build failed in Hudson: Maven-Plugins » Maven Assembly Plugin #68 Wed, 02 Jul, 22:41
Hudson   Build failed in Hudson: Maven-Plugins » Maven Assembly Plugin #69 Thu, 03 Jul, 14:13
Hudson     Build failed in Hudson: Maven-Plugins » Maven Assembly Plugin #70 Thu, 03 Jul, 21:29
Hudson       Build failed in Hudson: Maven-Plugins » Maven Assembly Plugin #71 Thu, 03 Jul, 22:21
Hudson         Build failed in Hudson: Maven-Plugins » Maven Assembly Plugin #72 Fri, 04 Jul, 05:52
Hudson           Build failed in Hudson: Maven-Plugins » Maven Assembly Plugin #73 Fri, 04 Jul, 06:27
Hudson             Build failed in Hudson: Maven-Plugins » Maven Assembly Plugin #74 Fri, 04 Jul, 09:33
Hudson               Build failed in Hudson: Maven-Plugins » Maven Assembly Plugin #75 Fri, 04 Jul, 15:26
Hudson                 Build failed in Hudson: Maven-Plugins » Maven Assembly Plugin #76 Fri, 04 Jul, 17:35
Hudson                   Build failed in Hudson: Maven-Plugins » Maven Assembly Plugin #77 Fri, 04 Jul, 18:00
Hudson Hudson build is unstable: Maven-Plugins » Maven Eclipse Plugin #68 Wed, 02 Jul, 22:41
Hudson   Hudson build is still unstable: Maven-Plugins » Maven Eclipse Plugin #69 Thu, 03 Jul, 14:13
Hudson     Hudson build is still unstable: Maven-Plugins » Maven Eclipse Plugin #70 Thu, 03 Jul, 21:29
Hudson       Hudson build is still unstable: Maven-Plugins » Maven Eclipse Plugin #71 Thu, 03 Jul, 22:21
Hudson         Hudson build is still unstable: Maven-Plugins » Maven Eclipse Plugin #72 Fri, 04 Jul, 05:52
Hudson           Hudson build is back to stable: Maven-Plugins » Maven Eclipse Plugin #73 Fri, 04 Jul, 06:27
Build failed in Hudson: Maven-2.1.x-ITs #151
Hudson   Build failed in Hudson: Maven-2.1.x-ITs #151 Thu, 03 Jul, 13:35
Hudson     Build failed in Hudson: Maven-2.1.x-ITs #152 Thu, 03 Jul, 14:08
Hudson       Build failed in Hudson: Maven-2.1.x-ITs #153 Thu, 03 Jul, 17:03
Hudson         Build failed in Hudson: Maven-2.1.x-ITs #154 Thu, 03 Jul, 17:19
Hudson           Build failed in Hudson: Maven-2.1.x-ITs #155 Thu, 03 Jul, 21:51
Hudson             Build failed in Hudson: Maven-2.1.x-ITs #156 Fri, 04 Jul, 04:05
Hudson               Build failed in Hudson: Maven-2.1.x-ITs #157 Fri, 04 Jul, 05:39
Hudson                 Build failed in Hudson: Maven-2.1.x-ITs #158 Fri, 04 Jul, 15:04
Hudson                   Build failed in Hudson: Maven-2.1.x-ITs #159 Fri, 04 Jul, 15:36
Hudson                     Build failed in Hudson: Maven-2.1.x-ITs #160 Fri, 04 Jul, 16:19
Hudson                       Build failed in Hudson: Maven-2.1.x-ITs #161 Fri, 04 Jul, 17:53
Hudson                         Build failed in Hudson: Maven-2.1.x-ITs #162 Sat, 05 Jul, 12:37
Hudson                           Build failed in Hudson: Maven-2.1.x-ITs #163 Sat, 05 Jul, 17:34
Hudson                             Build failed in Hudson: Maven-2.1.x-ITs #164 Sun, 06 Jul, 16:21
Hudson                               Build failed in Hudson: Maven-2.1.x-ITs #165 Sun, 06 Jul, 16:37
Hudson                                 Build failed in Hudson: Maven-2.1.x-ITs #166 Sun, 06 Jul, 16:58
Hudson                                   Build failed in Hudson: Maven-2.1.x-ITs #167 Sun, 06 Jul, 17:34
Hudson                                     Build failed in Hudson: Maven-2.1.x-ITs #168 Sun, 06 Jul, 18:32
Hudson                                       Build failed in Hudson: Maven-2.1.x-ITs #169 Sun, 06 Jul, 19:04
Hudson                                         Build failed in Hudson: Maven-2.1.x-ITs #170 Sun, 06 Jul, 23:33
Hudson                                           Build failed in Hudson: Maven-2.1.x-ITs #171 Mon, 07 Jul, 00:33
Hudson                                             Hudson build is back to normal: Maven-2.1.x-ITs #172 Mon, 07 Jul, 04:15
Hudson build is back to normal: enforcer » Enforcer Rules #33
Hudson   Hudson build is back to normal: enforcer » Enforcer Rules #33 Thu, 03 Jul, 16:42
Hudson Build failed in Hudson: Maven-2.0.x-ITs #144 Thu, 03 Jul, 18:10
Hudson   Build failed in Hudson: Maven-2.0.x-ITs #145 Fri, 04 Jul, 19:04
Hudson Build failed in Hudson: Maven-Plugins » Maven Site Plugin #70 Thu, 03 Jul, 21:29
Hudson   Build failed in Hudson: Maven-Plugins » Maven Site Plugin #71 Thu, 03 Jul, 22:21
Hudson Build failed in Hudson: Maven-Plugins » Maven Site Plugin #73 Fri, 04 Jul, 06:27
Hudson   Build failed in Hudson: Maven-Plugins » Maven Site Plugin #74 Fri, 04 Jul, 09:33
Hudson     Build failed in Hudson: Maven-Plugins » Maven Site Plugin #75 Fri, 04 Jul, 15:26
Hudson       Build failed in Hudson: Maven-Plugins » Maven Site Plugin #76 Fri, 04 Jul, 17:35
Hudson         Build failed in Hudson: Maven-Plugins » Maven Site Plugin #77 Fri, 04 Jul, 18:00
Contin...@vmbuild.apache.org [continuum] BUILD FAILURE: Maven 2.0.x Branch - Maven Distribution - Build Def: default maven2 buildDefinition Fri, 04 Jul, 08:13
Hudson Hudson build became unstable: Maven-Plugins » Maven Eclipse Plugin #74 Fri, 04 Jul, 09:33
Hudson   Hudson build is still unstable: Maven-Plugins » Maven Eclipse Plugin #75 Fri, 04 Jul, 15:26
Hudson     Hudson build is still unstable: Maven-Plugins » Maven Eclipse Plugin #76 Fri, 04 Jul, 17:35
Hudson       Hudson build is still unstable: Maven-Plugins » Maven Eclipse Plugin #77 Fri, 04 Jul, 18:00
[continuum] BUILD SUCCESSFUL: Maven 2.0.x Branch - Maven Distribution - Build Def: default maven2 buildDefinition
Contin...@vmbuild.apache.org   [continuum] BUILD SUCCESSFUL: Maven 2.0.x Branch - Maven Distribution - Build Def: default maven2 buildDefinition Fri, 04 Jul, 11:19
Contin...@vmbuild.apache.org   [continuum] BUILD SUCCESSFUL: Maven 2.0.x Branch - Maven Distribution - Build Def: default maven2 buildDefinition Tue, 08 Jul, 15:12
Hudson Build failed in Hudson: Maven-Plugins » Maven Plugins #78 Fri, 04 Jul, 20:39
Hudson   Hudson build is back to normal: Maven-Plugins » Maven Plugins #79 Fri, 04 Jul, 21:21
Hudson Build failed in Hudson: Maven-Plugins » Maven Patch Plugin #79 Fri, 04 Jul, 21:21
Hudson   Build failed in Hudson: Maven-Plugins » Maven Patch Plugin #80 Fri, 04 Jul, 22:13
Hudson     Build failed in Hudson: Maven-Plugins » Maven Patch Plugin #81 Sat, 05 Jul, 04:24
Hudson       Build failed in Hudson: Maven-Plugins » Maven Patch Plugin #82 Sat, 05 Jul, 04:49
Hudson         Build failed in Hudson: Maven-Plugins » Maven Patch Plugin #86 Thu, 24 Jul, 01:44
Hudson           Build failed in Hudson: Maven-Plugins » Maven Patch Plugin #87 Thu, 24 Jul, 12:54
Hudson             Build failed in Hudson: Maven-Plugins » Maven Patch Plugin #88 Thu, 24 Jul, 13:18
Hudson               Build failed in Hudson: Maven-Plugins » Maven Patch Plugin #89 Thu, 24 Jul, 17:47
Hudson                 Build failed in Hudson: Maven-Plugins » Maven Patch Plugin #90 Thu, 24 Jul, 21:47
Hudson                   Build failed in Hudson: Maven-Plugins » Maven Patch Plugin #91 Thu, 24 Jul, 22:36
Hudson                     Build failed in Hudson: Maven-Plugins » Maven Patch Plugin #92 Fri, 25 Jul, 00:16
Hudson                       Build failed in Hudson: Maven-Plugins » Maven Patch Plugin #93 Fri, 25 Jul, 01:28
Hudson                         Build failed in Hudson: Maven-Plugins » Maven Patch Plugin #94 Fri, 25 Jul, 09:17
Hudson                           Build failed in Hudson: Maven-Plugins » Maven Patch Plugin #95 Fri, 25 Jul, 12:51
Hudson                             Build failed in Hudson: Maven-Plugins » Maven Patch Plugin #96 Fri, 25 Jul, 13:37
Hudson                               Build failed in Hudson: Maven-Plugins » Maven Patch Plugin #97 Fri, 25 Jul, 15:21
Hudson                                 Build failed in Hudson: Maven-Plugins » Maven Patch Plugin #98 Sat, 26 Jul, 00:18
Hudson                                   Build failed in Hudson: Maven-Plugins » Maven Patch Plugin #99 Sat, 26 Jul, 06:28
Hudson                                     Build failed in Hudson: Maven-Plugins » Maven Patch Plugin #100 Sat, 26 Jul, 13:24
Hudson                                       Build failed in Hudson: Maven-Plugins » Maven Patch Plugin #101 Sat, 26 Jul, 14:57
Hudson                                         Build failed in Hudson: Maven-Plugins » Maven Patch Plugin #102 Sat, 26 Jul, 17:15
Hudson                                           Build failed in Hudson: Maven-Plugins » Maven Patch Plugin #103 Sat, 26 Jul, 17:36
Hudson                                             Build failed in Hudson: Maven-Plugins » Maven Patch Plugin #104 Sat, 26 Jul, 18:51
Hudson                                               Build failed in Hudson: Maven-Plugins » Maven Patch Plugin #105 Sat, 26 Jul, 21:11
Hudson                                                 Build failed in Hudson: Maven-Plugins » Maven Patch Plugin #106 Sat, 26 Jul, 21:33
Hudson                                                   Build failed in Hudson: Maven-Plugins » Maven Patch Plugin #107 Sun, 27 Jul, 20:48
Hudson                                                     Build failed in Hudson: Maven-Plugins » Maven Patch Plugin #108 Sun, 27 Jul, 22:33
Hudson                                                       Build failed in Hudson: Maven-Plugins » Maven Patch Plugin #109 Sun, 27 Jul, 22:54
Hudson                                                         Build failed in Hudson: Maven-Plugins » Maven Patch Plugin #110 Mon, 28 Jul, 04:56
Hudson                                                           Build failed in Hudson: Maven-Plugins » Maven Patch Plugin #111 Mon, 28 Jul, 09:48
Hudson                                                             Build failed in Hudson: Maven-Plugins » Maven Patch Plugin #112 Mon, 28 Jul, 10:55
Hudson                                                               Build failed in Hudson: Maven-Plugins » Maven Patch Plugin #113 Mon, 28 Jul, 13:13
Hudson                                                                 Build failed in Hudson: Maven-Plugins » Maven Patch Plugin #114 Mon, 28 Jul, 13:44
Hudson                                                                   Build failed in Hudson: Maven-Plugins » Maven Patch Plugin #115 Mon, 28 Jul, 14:55
Hudson                                                                     Build failed in Hudson: Maven-Plugins » Maven Patch Plugin #116 Mon, 28 Jul, 17:38
Hudson                                                                       Build failed in Hudson: Maven-Plugins » Maven Patch Plugin #117 Mon, 28 Jul, 21:50
Hudson                                                                         Build failed in Hudson: Maven-Plugins » Maven Patch Plugin #118 Mon, 28 Jul, 22:54
Hudson                                                                           Build failed in Hudson: Maven-Plugins » Maven Patch Plugin #119 Mon, 28 Jul, 23:41
Hudson                                                                             Build failed in Hudson: Maven-Plugins » Maven Patch Plugin #120 Tue, 29 Jul, 01:43
Hudson                                                                               Build failed in Hudson: Maven-Plugins » Maven Patch Plugin #121 Tue, 29 Jul, 02:41
Hudson                                                                                 Build failed in Hudson: Maven-Plugins » Maven Patch Plugin #122 Tue, 29 Jul, 03:46
Hudson Hudson build is unstable: Maven-Plugins » Maven Ear plugin #79 Fri, 04 Jul, 21:21
Hudson   Hudson build is still unstable: Maven-Plugins » Maven Ear plugin #80 Fri, 04 Jul, 22:13
Hudson     Hudson build is still unstable: Maven-Plugins » Maven Ear plugin #81 Sat, 05 Jul, 04:24
Hudson       Hudson build is still unstable: Maven-Plugins » Maven Ear plugin #82 Sat, 05 Jul, 04:49
Hudson         Hudson build is still unstable: Maven-Plugins » Maven Ear plugin #86 Thu, 24 Jul, 01:44
Hudson           Hudson build is still unstable: Maven-Plugins » Maven Ear plugin #87 Thu, 24 Jul, 12:54
Hudson             Hudson build is still unstable: Maven-Plugins » Maven Ear plugin #88 Thu, 24 Jul, 13:18
Hudson               Hudson build is still unstable: Maven-Plugins » Maven Ear plugin #89 Thu, 24 Jul, 17:47
Hudson                 Hudson build is still unstable: Maven-Plugins » Maven Ear plugin #90 Thu, 24 Jul, 21:47
Hudson                   Hudson build is still unstable: Maven-Plugins » Maven Ear plugin #91 Thu, 24 Jul, 22:36
Hudson                     Hudson build is still unstable: Maven-Plugins » Maven Ear plugin #92 Fri, 25 Jul, 00:16
Hudson                       Hudson build is still unstable: Maven-Plugins » Maven Ear plugin #93 Fri, 25 Jul, 01:28
Hudson                         Hudson build is still unstable: Maven-Plugins » Maven Ear plugin #94 Fri, 25 Jul, 09:17
Hudson                           Hudson build is still unstable: Maven-Plugins » Maven Ear plugin #95 Fri, 25 Jul, 12:51
Hudson                             Hudson build is still unstable: Maven-Plugins » Maven Ear plugin #96 Fri, 25 Jul, 13:37
Hudson                               Hudson build is still unstable: Maven-Plugins » Maven Ear plugin #97 Fri, 25 Jul, 15:21
Hudson                                 Hudson build is still unstable: Maven-Plugins » Maven Ear plugin #98 Sat, 26 Jul, 00:18
Hudson                                   Hudson build is still unstable: Maven-Plugins » Maven Ear plugin #99 Sat, 26 Jul, 06:28
Hudson                                     Hudson build is still unstable: Maven-Plugins » Maven Ear plugin #100 Sat, 26 Jul, 13:24
Hudson                                       Hudson build is still unstable: Maven-Plugins » Maven Ear plugin #101 Sat, 26 Jul, 14:57
Hudson                                         Hudson build is still unstable: Maven-Plugins » Maven Ear plugin #102 Sat, 26 Jul, 17:15
Hudson                                           Hudson build is still unstable: Maven-Plugins » Maven Ear plugin #103 Sat, 26 Jul, 17:36
Hudson                                             Hudson build is still unstable: Maven-Plugins » Maven Ear plugin #104 Sat, 26 Jul, 18:51
Hudson                                               Hudson build is still unstable: Maven-Plugins » Maven Ear plugin #105 Sat, 26 Jul, 21:11
Hudson                                                 Hudson build is still unstable: Maven-Plugins » Maven Ear plugin #106 Sat, 26 Jul, 21:33
Hudson                                                   Hudson build is still unstable: Maven-Plugins » Maven Ear plugin #107 Sun, 27 Jul, 20:48
Hudson                                                     Hudson build is still unstable: Maven-Plugins » Maven Ear plugin #108 Sun, 27 Jul, 22:33
Hudson                                                       Hudson build is still unstable: Maven-Plugins » Maven Ear plugin #109 Sun, 27 Jul, 22:54
Hudson                                                         Hudson build is still unstable: Maven-Plugins » Maven Ear plugin #110 Mon, 28 Jul, 04:56
Hudson                                                           Hudson build is still unstable: Maven-Plugins » Maven Ear plugin #111 Mon, 28 Jul, 09:48
Hudson                                                             Hudson build is still unstable: Maven-Plugins » Maven Ear plugin #112 Mon, 28 Jul, 10:55
Hudson                                                               Hudson build is still unstable: Maven-Plugins » Maven Ear plugin #113 Mon, 28 Jul, 13:13
Hudson                                                                 Hudson build is still unstable: Maven-Plugins » Maven Ear plugin #114 Mon, 28 Jul, 13:44
Hudson                                                                   Hudson build is still unstable: Maven-Plugins » Maven Ear plugin #115 Mon, 28 Jul, 14:55
Hudson                                                                     Hudson build is still unstable: Maven-Plugins » Maven Ear plugin #116 Mon, 28 Jul, 17:38
Hudson                                                                       Hudson build is still unstable: Maven-Plugins » Maven Ear plugin #117 Mon, 28 Jul, 21:50
Hudson                                                                         Hudson build is still unstable: Maven-Plugins » Maven Ear plugin #118 Mon, 28 Jul, 22:54
Hudson                                                                           Hudson build is still unstable: Maven-Plugins » Maven Ear plugin #119 Mon, 28 Jul, 23:41
Hudson                                                                             Hudson build is still unstable: Maven-Plugins » Maven Ear plugin #120 Tue, 29 Jul, 01:43
Hudson                                                                               Hudson build is still unstable: Maven-Plugins » Maven Ear plugin #121 Tue, 29 Jul, 02:41
Hudson                                                                                 Hudson build is still unstable: Maven-Plugins » Maven Ear plugin #122 Tue, 29 Jul, 03:46
Hudson                                                                                   Hudson build is still unstable: Maven-Plugins » Maven Ear plugin #123 Tue, 29 Jul, 05:01
Hudson                                                                                     Hudson build is still unstable: Maven-Plugins » Maven Ear plugin #124 Tue, 29 Jul, 09:23
Hudson                                                                                       Hudson build is still unstable: Maven-Plugins » Maven Ear plugin #125 Tue, 29 Jul, 11:09
Hudson                                                                                         Hudson build is still unstable: Maven-Plugins » Maven Ear plugin #126 Tue, 29 Jul, 12:34
Hudson                                                                                           Hudson build is still unstable: Maven-Plugins » Maven Ear plugin #127 Tue, 29 Jul, 13:47
Hudson Build failed in Hudson: Maven-Plugins » Maven Assembly Plugin #79 Fri, 04 Jul, 21:21
Hudson   Build failed in Hudson: Maven-Plugins » Maven Assembly Plugin #80 Fri, 04 Jul, 22:13
Hudson     Build failed in Hudson: Maven-Plugins » Maven Assembly Plugin #81 Sat, 05 Jul, 04:24
Hudson       Build failed in Hudson: Maven-Plugins » Maven Assembly Plugin #82 Sat, 05 Jul, 04:49
Hudson         Build failed in Hudson: Maven-Plugins » Maven Assembly Plugin #86 Thu, 24 Jul, 01:44
Hudson           Build failed in Hudson: Maven-Plugins » Maven Assembly Plugin #87 Thu, 24 Jul, 12:54
Hudson             Build failed in Hudson: Maven-Plugins » Maven Assembly Plugin #88 Thu, 24 Jul, 13:18
Hudson               Build failed in Hudson: Maven-Plugins » Maven Assembly Plugin #89 Thu, 24 Jul, 17:47
Hudson                 Build failed in Hudson: Maven-Plugins » Maven Assembly Plugin #90 Thu, 24 Jul, 21:47
Hudson                   Build failed in Hudson: Maven-Plugins » Maven Assembly Plugin #91 Thu, 24 Jul, 22:36
Hudson                     Build failed in Hudson: Maven-Plugins » Maven Assembly Plugin #92 Fri, 25 Jul, 00:16
Hudson                       Build failed in Hudson: Maven-Plugins » Maven Assembly Plugin #93 Fri, 25 Jul, 01:28
Hudson                         Build failed in Hudson: Maven-Plugins » Maven Assembly Plugin #94 Fri, 25 Jul, 09:17
Hudson                           Build failed in Hudson: Maven-Plugins » Maven Assembly Plugin #95 Fri, 25 Jul, 12:51
Hudson                             Build failed in Hudson: Maven-Plugins » Maven Assembly Plugin #96 Fri, 25 Jul, 13:37
Hudson                               Build failed in Hudson: Maven-Plugins » Maven Assembly Plugin #97 Fri, 25 Jul, 15:21
Hudson                                 Build failed in Hudson: Maven-Plugins » Maven Assembly Plugin #98 Sat, 26 Jul, 00:18
Hudson                                   Build failed in Hudson: Maven-Plugins » Maven Assembly Plugin #99 Sat, 26 Jul, 06:28
Hudson                                     Build failed in Hudson: Maven-Plugins » Maven Assembly Plugin #100 Sat, 26 Jul, 13:24
Hudson                                       Build failed in Hudson: Maven-Plugins » Maven Assembly Plugin #101 Sat, 26 Jul, 14:57
Hudson                                         Build failed in Hudson: Maven-Plugins » Maven Assembly Plugin #102 Sat, 26 Jul, 17:15
Hudson                                           Build failed in Hudson: Maven-Plugins » Maven Assembly Plugin #103 Sat, 26 Jul, 17:36
Hudson                                             Build failed in Hudson: Maven-Plugins » Maven Assembly Plugin #104 Sat, 26 Jul, 18:51
Hudson                                               Build failed in Hudson: Maven-Plugins » Maven Assembly Plugin #105 Sat, 26 Jul, 21:11
Hudson                                                 Build failed in Hudson: Maven-Plugins » Maven Assembly Plugin #106 Sat, 26 Jul, 21:33
Hudson                                                   Build failed in Hudson: Maven-Plugins » Maven Assembly Plugin #107 Sun, 27 Jul, 20:48
Hudson                                                     Build failed in Hudson: Maven-Plugins » Maven Assembly Plugin #108 Sun, 27 Jul, 22:33
Hudson                                                       Build failed in Hudson: Maven-Plugins » Maven Assembly Plugin #109 Sun, 27 Jul, 22:54
Hudson                                                         Build failed in Hudson: Maven-Plugins » Maven Assembly Plugin #110 Mon, 28 Jul, 04:56
Hudson                                                           Build failed in Hudson: Maven-Plugins » Maven Assembly Plugin #111 Mon, 28 Jul, 09:48
Hudson                                                             Build failed in Hudson: Maven-Plugins » Maven Assembly Plugin #112 Mon, 28 Jul, 10:55
Hudson                                                               Build failed in Hudson: Maven-Plugins » Maven Assembly Plugin #113 Mon, 28 Jul, 13:13
Hudson                                                                 Build failed in Hudson: Maven-Plugins » Maven Assembly Plugin #114 Mon, 28 Jul, 13:44
Hudson                                                                   Build failed in Hudson: Maven-Plugins » Maven Assembly Plugin #115 Mon, 28 Jul, 14:55
Hudson                                                                     Build failed in Hudson: Maven-Plugins » Maven Assembly Plugin #116 Mon, 28 Jul, 17:38
Hudson                                                                       Build failed in Hudson: Maven-Plugins » Maven Assembly Plugin #117 Mon, 28 Jul, 21:50
Hudson                                                                         Build failed in Hudson: Maven-Plugins » Maven Assembly Plugin #118 Mon, 28 Jul, 22:54
Hudson                                                                           Build failed in Hudson: Maven-Plugins » Maven Assembly Plugin #119 Mon, 28 Jul, 23:41
Hudson                                                                             Build failed in Hudson: Maven-Plugins » Maven Assembly Plugin #120 Tue, 29 Jul, 01:43
Hudson                                                                               Build failed in Hudson: Maven-Plugins » Maven Assembly Plugin #121 Tue, 29 Jul, 02:41
Hudson                                                                                 Build failed in Hudson: Maven-Plugins » Maven Assembly Plugin #122 Tue, 29 Jul, 03:46
Hudson                                                                                   Build failed in Hudson: Maven-Plugins » Maven Assembly Plugin #123 Tue, 29 Jul, 05:01
Hudson                                                                                     Build failed in Hudson: Maven-Plugins » Maven Assembly Plugin #124 Tue, 29 Jul, 09:23
Hudson                                                                                       Build failed in Hudson: Maven-Plugins » Maven Assembly Plugin #125 Tue, 29 Jul, 11:09
Hudson                                                                                         Build failed in Hudson: Maven-Plugins » Maven Assembly Plugin #126 Tue, 29 Jul, 12:34
Hudson                                                                                           Build failed in Hudson: Maven-Plugins » Maven Assembly Plugin #127 Tue, 29 Jul, 13:47
Hudson                                                                                             Build failed in Hudson: Maven-Plugins » Maven Assembly Plugin #128 Tue, 29 Jul, 17:07
Hudson                                                                                               Build failed in Hudson: Maven-Plugins » Maven Assembly Plugin #129 Tue, 29 Jul, 22:04
Hudson                                                                                                 Build failed in Hudson: Maven-Plugins » Maven Assembly Plugin #130 Wed, 30 Jul, 00:25
Hudson                                                                                                   Build failed in Hudson: Maven-Plugins » Maven Assembly Plugin #131 Wed, 30 Jul, 06:47
Hudson                                                                                                     Build failed in Hudson: Maven-Plugins » Maven Assembly Plugin #132 Wed, 30 Jul, 14:45
Hudson                                                                                                       Build failed in Hudson: Maven-Plugins » Maven Assembly Plugin #133 Wed, 30 Jul, 16:30
Hudson                                                                                                         Build failed in Hudson: Maven-Plugins » Maven Assembly Plugin #134 Thu, 31 Jul, 00:16
Hudson                                                                                                           Build failed in Hudson: Maven-Plugins » Maven Assembly Plugin #135 Thu, 31 Jul, 01:13
Hudson                                                                                                             Build failed in Hudson: Maven-Plugins » Maven Assembly Plugin #136 Thu, 31 Jul, 13:32
Hudson Hudson build is unstable: Maven-Plugins » Maven Eclipse Plugin #79 Fri, 04 Jul, 21:21
Hudson   Hudson build is still unstable: Maven-Plugins » Maven Eclipse Plugin #80 Fri, 04 Jul, 22:13
Hudson     Build failed in Hudson: Maven-Plugins » Maven Eclipse Plugin #81 Sat, 05 Jul, 04:24
Hudson       Hudson build is unstable: Maven-Plugins » Maven Eclipse Plugin #82 Sat, 05 Jul, 04:49
Hudson         Hudson build is still unstable: Maven-Plugins » Maven Eclipse Plugin #86 Thu, 24 Jul, 01:44
Hudson           Hudson build is still unstable: Maven-Plugins » Maven Eclipse Plugin #87 Thu, 24 Jul, 12:54
Hudson             Hudson build is still unstable: Maven-Plugins » Maven Eclipse Plugin #88 Thu, 24 Jul, 13:18
Hudson               Hudson build is still unstable: Maven-Plugins » Maven Eclipse Plugin #89 Thu, 24 Jul, 17:47
Hudson                 Hudson build is still unstable: Maven-Plugins » Maven Eclipse Plugin #90 Thu, 24 Jul, 21:47
Hudson                   Hudson build is still unstable: Maven-Plugins » Maven Eclipse Plugin #91 Thu, 24 Jul, 22:36
Hudson                     Hudson build is still unstable: Maven-Plugins » Maven Eclipse Plugin #92 Fri, 25 Jul, 00:16
Hudson                       Hudson build is still unstable: Maven-Plugins » Maven Eclipse Plugin #93 Fri, 25 Jul, 01:28
Hudson                         Hudson build is still unstable: Maven-Plugins » Maven Eclipse Plugin #94 Fri, 25 Jul, 09:17
Hudson                           Hudson build is still unstable: Maven-Plugins » Maven Eclipse Plugin #95 Fri, 25 Jul, 12:51
Hudson                             Hudson build is still unstable: Maven-Plugins » Maven Eclipse Plugin #96 Fri, 25 Jul, 13:37
Hudson                               Hudson build is still unstable: Maven-Plugins » Maven Eclipse Plugin #97 Fri, 25 Jul, 15:21
Hudson                                 Hudson build is still unstable: Maven-Plugins » Maven Eclipse Plugin #98 Sat, 26 Jul, 00:18
Hudson                                   Hudson build is still unstable: Maven-Plugins » Maven Eclipse Plugin #99 Sat, 26 Jul, 06:28
Hudson                                     Hudson build is still unstable: Maven-Plugins » Maven Eclipse Plugin #100 Sat, 26 Jul, 13:24
Hudson                                       Hudson build is still unstable: Maven-Plugins » Maven Eclipse Plugin #101 Sat, 26 Jul, 14:57
Hudson                                         Hudson build is still unstable: Maven-Plugins » Maven Eclipse Plugin #102 Sat, 26 Jul, 17:15
Hudson                                           Hudson build is still unstable: Maven-Plugins » Maven Eclipse Plugin #103 Sat, 26 Jul, 17:36
Hudson                                             Hudson build is back to stable: Maven-Plugins » Maven Eclipse Plugin #104 Sat, 26 Jul, 18:51
Hudson Hudson build is unstable: Maven-Plugins » Maven IDEA Plugin #79 Fri, 04 Jul, 21:21
Hudson   Hudson build is still unstable: Maven-Plugins » Maven IDEA Plugin #80 Fri, 04 Jul, 22:13
Hudson     Build failed in Hudson: Maven-Plugins » Maven IDEA Plugin #81 Sat, 05 Jul, 04:24
Hudson       Hudson build is unstable: Maven-Plugins » Maven IDEA Plugin #82 Sat, 05 Jul, 04:49
Hudson         Hudson build is still unstable: Maven-Plugins » Maven IDEA Plugin #83 Sat, 19 Jul, 17:28
Hudson           Build failed in Hudson: Maven-Plugins » Maven IDEA Plugin #84 Sat, 19 Jul, 21:29
Hudson             Hudson build is unstable: Maven-Plugins » Maven IDEA Plugin #85 Sat, 19 Jul, 21:31
Hudson               Hudson build is back to stable: Maven-Plugins » Maven IDEA Plugin #86 Thu, 24 Jul, 01:44
Hudson Build failed in Hudson: Maven-Plugins » Maven Site Plugin #79 Fri, 04 Jul, 21:21
Hudson   Build failed in Hudson: Maven-Plugins » Maven Site Plugin #80 Fri, 04 Jul, 22:13
Hudson Build failed in Hudson: Maven-Plugins » Maven Dependency Plugin #79 Fri, 04 Jul, 21:21
Hudson   Build failed in Hudson: Maven-Plugins » Maven Dependency Plugin #80 Fri, 04 Jul, 22:13
Hudson     Build failed in Hudson: Maven-Plugins » Maven Dependency Plugin #81 Sat, 05 Jul, 04:24
Hudson       Build failed in Hudson: Maven-Plugins » Maven Dependency Plugin #82 Sat, 05 Jul, 04:49
Hudson         Build failed in Hudson: Maven-Plugins » Maven Dependency Plugin #86 Thu, 24 Jul, 01:44
Hudson           Build failed in Hudson: Maven-Plugins » Maven Dependency Plugin #87 Thu, 24 Jul, 12:54
Hudson             Build failed in Hudson: Maven-Plugins » Maven Dependency Plugin #88 Thu, 24 Jul, 13:18
Hudson               Build failed in Hudson: Maven-Plugins » Maven Dependency Plugin #89 Thu, 24 Jul, 17:47
Hudson                 Build failed in Hudson: Maven-Plugins » Maven Dependency Plugin #90 Thu, 24 Jul, 21:47
Hudson                   Build failed in Hudson: Maven-Plugins » Maven Dependency Plugin #91 Thu, 24 Jul, 22:36
Hudson                     Build failed in Hudson: Maven-Plugins » Maven Dependency Plugin #92 Fri, 25 Jul, 00:16
Hudson                       Build failed in Hudson: Maven-Plugins » Maven Dependency Plugin #93 Fri, 25 Jul, 01:28
Hudson                         Build failed in Hudson: Maven-Plugins » Maven Dependency Plugin #94 Fri, 25 Jul, 09:17
Hudson                           Build failed in Hudson: Maven-Plugins » Maven Dependency Plugin #95 Fri, 25 Jul, 12:51
Hudson                             Build failed in Hudson: Maven-Plugins » Maven Dependency Plugin #96 Fri, 25 Jul, 13:37
Hudson                               Build failed in Hudson: Maven-Plugins » Maven Dependency Plugin #97 Fri, 25 Jul, 15:21
Hudson                                 Build failed in Hudson: Maven-Plugins » Maven Dependency Plugin #98 Sat, 26 Jul, 00:18
Hudson                                   Build failed in Hudson: Maven-Plugins » Maven Dependency Plugin #99 Sat, 26 Jul, 06:28
Hudson                                     Build failed in Hudson: Maven-Plugins » Maven Dependency Plugin #100 Sat, 26 Jul, 13:24
Hudson                                       Build failed in Hudson: Maven-Plugins » Maven Dependency Plugin #101 Sat, 26 Jul, 14:57
Hudson                                         Build failed in Hudson: Maven-Plugins » Maven Dependency Plugin #102 Sat, 26 Jul, 17:15
Hudson                                           Build failed in Hudson: Maven-Plugins » Maven Dependency Plugin #103 Sat, 26 Jul, 17:36
Hudson                                             Build failed in Hudson: Maven-Plugins » Maven Dependency Plugin #104 Sat, 26 Jul, 18:51
Hudson                                               Build failed in Hudson: Maven-Plugins » Maven Dependency Plugin #105 Sat, 26 Jul, 21:11
Hudson                                                 Build failed in Hudson: Maven-Plugins » Maven Dependency Plugin #106 Sat, 26 Jul, 21:33
Hudson                                                   Build failed in Hudson: Maven-Plugins » Maven Dependency Plugin #107 Sun, 27 Jul, 20:48
Hudson                                                     Build failed in Hudson: Maven-Plugins » Maven Dependency Plugin #108 Sun, 27 Jul, 22:33
Hudson                                                       Build failed in Hudson: Maven-Plugins » Maven Dependency Plugin #109 Sun, 27 Jul, 22:54
Hudson                                                         Build failed in Hudson: Maven-Plugins » Maven Dependency Plugin #110 Mon, 28 Jul, 04:56
Hudson                                                           Build failed in Hudson: Maven-Plugins » Maven Dependency Plugin #111 Mon, 28 Jul, 09:48
Hudson                                                             Build failed in Hudson: Maven-Plugins » Maven Dependency Plugin #112 Mon, 28 Jul, 10:55
Hudson                                                               Build failed in Hudson: Maven-Plugins » Maven Dependency Plugin #113 Mon, 28 Jul, 13:13
Hudson                                                                 Build failed in Hudson: Maven-Plugins » Maven Dependency Plugin #114 Mon, 28 Jul, 13:44
Hudson                                                                   Build failed in Hudson: Maven-Plugins » Maven Dependency Plugin #115 Mon, 28 Jul, 14:55
Hudson                                                                     Build failed in Hudson: Maven-Plugins » Maven Dependency Plugin #116 Mon, 28 Jul, 17:38
Hudson                                                                       Build failed in Hudson: Maven-Plugins » Maven Dependency Plugin #117 Mon, 28 Jul, 21:50
Hudson                                                                         Build failed in Hudson: Maven-Plugins » Maven Dependency Plugin #118 Mon, 28 Jul, 22:54
Hudson                                                                           Build failed in Hudson: Maven-Plugins » Maven Dependency Plugin #119 Mon, 28 Jul, 23:41
Hudson                                                                             Build failed in Hudson: Maven-Plugins » Maven Dependency Plugin #120 Tue, 29 Jul, 01:43
Hudson                                                                               Build failed in Hudson: Maven-Plugins » Maven Dependency Plugin #121 Tue, 29 Jul, 02:41
Hudson                                                                                 Build failed in Hudson: Maven-Plugins » Maven Dependency Plugin #122 Tue, 29 Jul, 03:46
Hudson                                                                                   Build failed in Hudson: Maven-Plugins » Maven Dependency Plugin #123 Tue, 29 Jul, 05:01
Hudson                                                                                     Build failed in Hudson: Maven-Plugins » Maven Dependency Plugin #124 Tue, 29 Jul, 09:23
Hudson                                                                                       Build failed in Hudson: Maven-Plugins » Maven Dependency Plugin #125 Tue, 29 Jul, 11:09
Hudson                                                                                         Build failed in Hudson: Maven-Plugins » Maven Dependency Plugin #126 Tue, 29 Jul, 12:34
Hudson                                                                                           Build failed in Hudson: Maven-Plugins » Maven Dependency Plugin #127 Tue, 29 Jul, 13:47
Hudson                                                                                             Build failed in Hudson: Maven-Plugins » Maven Dependency Plugin #128 Tue, 29 Jul, 17:07
Hudson                                                                                               Build failed in Hudson: Maven-Plugins » Maven Dependency Plugin #129 Tue, 29 Jul, 22:04
Hudson                                                                                                 Build failed in Hudson: Maven-Plugins » Maven Dependency Plugin #130 Wed, 30 Jul, 00:25
Hudson                                                                                                   Build failed in Hudson: Maven-Plugins » Maven Dependency Plugin #131 Wed, 30 Jul, 06:47
Hudson                                                                                                     Build failed in Hudson: Maven-Plugins » Maven Dependency Plugin #132 Wed, 30 Jul, 14:45
Hudson                                                                                                       Build failed in Hudson: Maven-Plugins » Maven Dependency Plugin #133 Wed, 30 Jul, 16:30
Hudson                                                                                                         Build failed in Hudson: Maven-Plugins » Maven Dependency Plugin #134 Thu, 31 Jul, 00:16
Hudson                                                                                                           Build failed in Hudson: Maven-Plugins » Maven Dependency Plugin #135 Thu, 31 Jul, 01:13
Hudson                                                                                                             Build failed in Hudson: Maven-Plugins » Maven Dependency Plugin #136 Thu, 31 Jul, 13:32
Hudson Build failed in Hudson: Maven-Plugins » Maven Linkcheck Plugin #81 Sat, 05 Jul, 04:24
Hudson   Hudson build is back to normal: Maven-Plugins » Maven Linkcheck Plugin #82 Sat, 05 Jul, 04:49
Hudson Build failed in Hudson: Maven-Plugins » Maven One Plugin #81 Sat, 05 Jul, 04:24
Hudson   Hudson build is back to normal: Maven-Plugins » Maven One Plugin #82 Sat, 05 Jul, 04:49
Hudson Build failed in Hudson: Maven-Plugins » Maven Help Plugin #81 Sat, 05 Jul, 04:24
Hudson   Hudson build is back to normal: Maven-Plugins » Maven Help Plugin #82 Sat, 05 Jul, 04:49
Hudson Build failed in Hudson: Maven-Plugins » Maven EJB Plugin #81 Sat, 05 Jul, 04:24
Hudson   Hudson build is back to normal: Maven-Plugins » Maven EJB Plugin #82 Sat, 05 Jul, 04:49
Hudson Build failed in Hudson: Maven-Plugins » Maven GPG Plugin #81 Sat, 05 Jul, 04:24
Hudson Build failed in Hudson: Maven-Plugins » Maven Install Plugin #81 Sat, 05 Jul, 04:24
Hudson   Hudson build is back to normal: Maven-Plugins » Maven Install Plugin #82 Sat, 05 Jul, 04:49
Hudson Build failed in Hudson: mercury #1 Sat, 05 Jul, 16:46
Hudson   Build failed in Hudson: mercury #2 Tue, 15 Jul, 00:46
Hudson     Build failed in Hudson: mercury #3 Tue, 15 Jul, 06:46
Hudson       Build failed in Hudson: mercury #4 Tue, 15 Jul, 21:46
Hudson         Build failed in Hudson: mercury #5 Wed, 16 Jul, 04:46
Hudson           Build failed in Hudson: mercury #6 Thu, 17 Jul, 04:46
Hudson             Build failed in Hudson: mercury #7 Thu, 17 Jul, 05:46
Hudson               Build failed in Hudson: mercury #8 Fri, 18 Jul, 05:46
Hudson                 Build failed in Hudson: mercury #9 Sat, 19 Jul, 01:46
Hudson                   Build failed in Hudson: mercury #10 Sat, 19 Jul, 06:46
Hudson                     Build failed in Hudson: mercury #11 Wed, 23 Jul, 08:46
Hudson                       Build failed in Hudson: mercury #12 Thu, 24 Jul, 05:46
Hudson                         Build failed in Hudson: mercury #13 Thu, 24 Jul, 06:46
Hudson                           Build failed in Hudson: mercury #14 Thu, 24 Jul, 07:46
Hudson                             Build failed in Hudson: mercury #15 Thu, 24 Jul, 10:46
Hudson                               Build failed in Hudson: mercury #16 Thu, 24 Jul, 16:46
Hudson                                 Build failed in Hudson: mercury #17 Thu, 24 Jul, 20:52
Hudson                                   Build failed in Hudson: mercury #18 Fri, 25 Jul, 00:46
Hudson                                     Build failed in Hudson: mercury #19 Fri, 25 Jul, 05:46
Hudson                                       Build failed in Hudson: mercury #20 Fri, 25 Jul, 08:46
Hudson                                         Build failed in Hudson: mercury #21 Fri, 25 Jul, 18:46
Hudson                                           Build failed in Hudson: mercury #22 Sat, 26 Jul, 02:46
Hudson                                             Build failed in Hudson: mercury #23 Sat, 26 Jul, 16:47
Hudson                                               Build failed in Hudson: mercury #24 Mon, 28 Jul, 20:46
Hudson                                                 Build failed in Hudson: mercury #25 Mon, 28 Jul, 21:46
Hudson                                                   Build failed in Hudson: mercury #26 Tue, 29 Jul, 11:09
Hudson                                                     Build failed in Hudson: mercury #27 Tue, 29 Jul, 17:46
Hudson                                                       Build failed in Hudson: mercury #28 Wed, 30 Jul, 00:25
Hudson                                                         Build failed in Hudson: mercury #29 Wed, 30 Jul, 06:09
Hudson                                                           Build failed in Hudson: mercury #30 Wed, 30 Jul, 23:48
Hudson                                                             Build failed in Hudson: mercury #31 Thu, 31 Jul, 05:46
Hudson                                                               Build failed in Hudson: mercury #32 Thu, 31 Jul, 20:47
[continuum] BUILD SUCCESSFUL: Maven 2.1.x (trunk) - Integration Test Executor - Build Def: default maven2 buildDefinition
Contin...@vmbuild.apache.org   [continuum] BUILD SUCCESSFUL: Maven 2.1.x (trunk) - Integration Test Executor - Build Def: default maven2 buildDefinition Sun, 06 Jul, 17:30
Contin...@vmbuild.apache.org   [continuum] BUILD SUCCESSFUL: Maven 2.1.x (trunk) - Integration Test Executor - Build Def: default maven2 buildDefinition Sun, 06 Jul, 22:16
Contin...@vmbuild.apache.org   [continuum] BUILD SUCCESSFUL: Maven 2.1.x (trunk) - Integration Test Executor - Build Def: default maven2 buildDefinition Tue, 08 Jul, 13:50
Contin...@vmbuild.apache.org   [continuum] BUILD SUCCESSFUL: Maven 2.1.x (trunk) - Integration Test Executor - Build Def: default maven2 buildDefinition Wed, 09 Jul, 23:01
Contin...@vmbuild.apache.org   [continuum] BUILD SUCCESSFUL: Maven 2.1.x (trunk) - Integration Test Executor - Build Def: default maven2 buildDefinition Tue, 15 Jul, 20:30
Contin...@vmbuild.apache.org   [continuum] BUILD SUCCESSFUL: Maven 2.1.x (trunk) - Integration Test Executor - Build Def: default maven2 buildDefinition Wed, 23 Jul, 07:35
Contin...@vmbuild.apache.org   [continuum] BUILD SUCCESSFUL: Maven 2.1.x (trunk) - Integration Test Executor - Build Def: default maven2 buildDefinition Wed, 23 Jul, 17:55
Hudson Build failed in Hudson: maven-artifact #43 Mon, 07 Jul, 03:46
Hudson   Hudson build is back to normal: maven-artifact #44 Mon, 07 Jul, 03:56
[continuum] BUILD SUCCESSFUL: Maven Artifact - Maven Artifact - Build Def: default maven2 buildDefinition
Contin...@vmbuild.apache.org   [continuum] BUILD SUCCESSFUL: Maven Artifact - Maven Artifact - Build Def: default maven2 buildDefinition Mon, 07 Jul, 05:47
Contin...@vmbuild.apache.org   [continuum] BUILD SUCCESSFUL: Maven Artifact - Maven Artifact - Build Def: default maven2 buildDefinition Tue, 08 Jul, 12:02
Apache Hudson Server Build failed in Hudson: Maven-2.1-with-bootstrap #1 Mon, 07 Jul, 17:47
Apache Hudson Server   Build failed in Hudson: Maven-2.1-with-bootstrap #2 Mon, 07 Jul, 18:06
Apache Hudson Server     Build failed in Hudson: Maven-2.1-with-bootstrap #3 Mon, 07 Jul, 18:27
Apache Hudson Server       Hudson build is back to normal: Maven-2.1-with-bootstrap #4 Mon, 07 Jul, 18:41
Contin...@vmbuild.apache.org [continuum] BUILD ERROR: Maven 2.1.x (trunk) - Apache Maven - Build Def: default maven2 buildDefinition Tue, 08 Jul, 07:02
Contin...@vmbuild.apache.org [continuum] BUILD ERROR: Maven 2.0.x Branch - Integration Test Executor - Build Def: default maven2 buildDefinition Tue, 08 Jul, 07:03
[continuum] BUILD ERROR: Maven Integration Testing - Integration Test Support Artifacts - Build Def: default maven2 buildDefinition
Contin...@vmbuild.apache.org   [continuum] BUILD ERROR: Maven Integration Testing - Integration Test Support Artifacts - Build Def: default maven2 buildDefinition Tue, 08 Jul, 07:03
Contin...@vmbuild.apache.org   [continuum] BUILD ERROR: Maven Integration Testing - Integration Test Support Artifacts - Build Def: default maven2 buildDefinition Sat, 12 Jul, 02:52
Contin...@vmbuild.apache.org [continuum] BUILD ERROR: Maven 2.1.x (trunk) - Integration Tests for Maven Embedder - Build Def: default maven2 buildDefinition Tue, 08 Jul, 07:03
Contin...@vmbuild.apache.org [continuum] BUILD ERROR: Maven 2.0.x Branch - Maven Script Support Root - Build Def: default maven2 buildDefinition Tue, 08 Jul, 07:05
Message list1 · 2 · 3 · 4 · 5 · 6 · 7 · Next »Thread · Author · Date
Box list
Jul 2014116
Jun 2014341
May 2014161
Apr 2014146
Mar 2014336
Feb 2014308
Jan 2014189
Dec 2013319
Nov 2013274
Oct 2013167
Sep 2013486
Aug 2013263
Jul 2013726
Jun 2013722
May 2013378
Apr 2013313
Mar 2013467
Feb 2013520
Jan 20131437
Dec 20121778
Nov 2012775
Oct 20121224
Sep 2012791
Aug 2012362
Jul 2012232
Jun 2012149
May 2012189
Apr 2012115
Mar 201257
Feb 2012155
Jan 2012170
Dec 2011244
Nov 2011187
Oct 2011139
Sep 2011190
Aug 2011276
Jul 201194
Jun 20114
Apr 201162
Mar 201176
Feb 201154
Jan 201185
Dec 201079
Nov 201061
Oct 201058
Sep 20101
Aug 201057
Jul 201037
Jun 201020
May 201075
Apr 201053
Mar 201012
Feb 201030
Jan 201071
Dec 2009104
Nov 200919
Oct 200931
Sep 2009193
Aug 2009268
Jul 2009193
Jun 2009147
May 200975
Apr 200979
Mar 2009134
Feb 2009657
Jan 200983
Dec 2008349
Nov 2008288
Oct 2008986
Sep 2008842
Aug 2008707
Jul 2008887
Jun 2008167
May 200821
Apr 2008231
Mar 2008438
Feb 2008317
Jan 2008205
Dec 2007185
Nov 2007532
Oct 2007439
Sep 2007699
Aug 20071294
Jul 2007351
Jun 20072211
May 2007273
Apr 2007262
Mar 2007534
Feb 20071648
Jan 20072359
Dec 2006575
Nov 2006357
Oct 2006642
Sep 2006660
Aug 20061662
Jul 20061320
Jun 2006473
May 20064700
Apr 20061113
Mar 20061048