maven-notifications mailing list archives: July 2008

Site index · List index
Message list1 · 2 · 3 · 4 · 5 · 6 · 7 · 8 · 9 · Next »Thread · Author · Date
Hudson Build failed in Hudson: Maven-2.1.x #187 Wed, 02 Jul, 16:04
Contin...@vmbuild.apache.org [continuum] BUILD FAILURE: Maven 2.1.x (trunk) - Integration Test Executor - Build Def: default maven2 buildDefinition Wed, 02 Jul, 17:47
Contin...@vmbuild.apache.org [continuum] BUILD FAILURE: Maven 2.1.x (trunk) - Integration Test Executor - Build Def: default maven2 buildDefinition Wed, 02 Jul, 19:52
Contin...@vmbuild.apache.org [continuum] BUILD FAILURE: Maven 2.1.x (trunk) - Integration Test Executor - Build Def: default maven2 buildDefinition Wed, 02 Jul, 21:47
Hudson Build failed in Hudson: Maven-2.1.x #188 Wed, 02 Jul, 22:02
Hudson Hudson build is unstable: Maven-Plugins » Maven Eclipse Plugin #68 Wed, 02 Jul, 22:41
Hudson Build failed in Hudson: Maven-Plugins » Maven Patch Plugin #68 Wed, 02 Jul, 22:41
Hudson Hudson build is unstable: Maven-Plugins » Maven IDEA Plugin #68 Wed, 02 Jul, 22:41
Hudson Build failed in Hudson: Maven-Plugins » Maven Dependency Plugin #68 Wed, 02 Jul, 22:41
Hudson Build failed in Hudson: Maven-Plugins » Maven Assembly Plugin #68 Wed, 02 Jul, 22:41
Hudson Hudson build is unstable: Maven-Plugins » Maven Ear plugin #68 Wed, 02 Jul, 22:41
Hudson Build failed in Hudson: Maven-2.1.x #189 Thu, 03 Jul, 12:17
Hudson Build failed in Hudson: Maven-2.1.x-ITs #151 Thu, 03 Jul, 13:35
Hudson Hudson build is back to normal: Maven-2.1.x #190 Thu, 03 Jul, 13:40
Hudson Build failed in Hudson: Maven-2.1.x-ITs #152 Thu, 03 Jul, 14:08
Hudson Build failed in Hudson: Maven-Plugins » Maven Assembly Plugin #69 Thu, 03 Jul, 14:13
Hudson Build failed in Hudson: Maven-Plugins » Maven Dependency Plugin #69 Thu, 03 Jul, 14:13
Hudson Hudson build is still unstable: Maven-Plugins » Maven Eclipse Plugin #69 Thu, 03 Jul, 14:13
Hudson Hudson build is still unstable: Maven-Plugins » Maven Ear plugin #69 Thu, 03 Jul, 14:13
Hudson Build failed in Hudson: Maven-Plugins » Maven Patch Plugin #69 Thu, 03 Jul, 14:13
Hudson Hudson build is still unstable: Maven-Plugins » Maven IDEA Plugin #69 Thu, 03 Jul, 14:13
Contin...@vmbuild.apache.org [continuum] BUILD FAILURE: Maven 2.1.x (trunk) - Integration Test Executor - Build Def: default maven2 buildDefinition Thu, 03 Jul, 15:28
Hudson Hudson build is back to normal: enforcer » Enforcer Rules #33 Thu, 03 Jul, 16:42
Hudson Build failed in Hudson: Maven-2.1.x-ITs #153 Thu, 03 Jul, 17:03
Hudson Build failed in Hudson: Maven-2.1.x-ITs #154 Thu, 03 Jul, 17:19
Contin...@vmbuild.apache.org [continuum] BUILD FAILURE: Maven 2.1.x (trunk) - Integration Test Executor - Build Def: default maven2 buildDefinition Thu, 03 Jul, 17:47
Hudson Build failed in Hudson: Maven-2.0.x-ITs #144 Thu, 03 Jul, 18:10
Hudson Build failed in Hudson: Maven-Plugins » Maven Patch Plugin #70 Thu, 03 Jul, 21:29
Hudson Build failed in Hudson: Maven-Plugins » Maven Site Plugin #70 Thu, 03 Jul, 21:29
Hudson Build failed in Hudson: Maven-Plugins » Maven Dependency Plugin #70 Thu, 03 Jul, 21:29
Hudson Hudson build is still unstable: Maven-Plugins » Maven Eclipse Plugin #70 Thu, 03 Jul, 21:29
Hudson Hudson build is still unstable: Maven-Plugins » Maven IDEA Plugin #70 Thu, 03 Jul, 21:29
Hudson Hudson build is still unstable: Maven-Plugins » Maven Ear plugin #70 Thu, 03 Jul, 21:29
Hudson Build failed in Hudson: Maven-Plugins » Maven Assembly Plugin #70 Thu, 03 Jul, 21:29
Hudson Build failed in Hudson: Maven-2.1.x-ITs #155 Thu, 03 Jul, 21:51
Contin...@vmbuild.apache.org [continuum] BUILD FAILURE: Maven 2.1.x (trunk) - Integration Test Executor - Build Def: default maven2 buildDefinition Thu, 03 Jul, 22:14
Hudson Build failed in Hudson: Maven-Plugins » Maven Site Plugin #71 Thu, 03 Jul, 22:21
Hudson Hudson build is still unstable: Maven-Plugins » Maven Ear plugin #71 Thu, 03 Jul, 22:21
Hudson Hudson build is still unstable: Maven-Plugins » Maven Eclipse Plugin #71 Thu, 03 Jul, 22:21
Hudson Build failed in Hudson: Maven-Plugins » Maven Dependency Plugin #71 Thu, 03 Jul, 22:21
Hudson Hudson build is still unstable: Maven-Plugins » Maven IDEA Plugin #71 Thu, 03 Jul, 22:21
Hudson Build failed in Hudson: Maven-Plugins » Maven Assembly Plugin #71 Thu, 03 Jul, 22:21
Hudson Build failed in Hudson: Maven-Plugins » Maven Patch Plugin #71 Thu, 03 Jul, 22:21
Hudson Build failed in Hudson: Maven-2.1.x-ITs #156 Fri, 04 Jul, 04:05
Hudson Build failed in Hudson: Maven-2.1.x-ITs #157 Fri, 04 Jul, 05:39
Hudson Build failed in Hudson: Maven-Plugins » Maven Patch Plugin #72 Fri, 04 Jul, 05:52
Hudson Build failed in Hudson: Maven-Plugins » Maven Dependency Plugin #72 Fri, 04 Jul, 05:52
Hudson Hudson build is still unstable: Maven-Plugins » Maven IDEA Plugin #72 Fri, 04 Jul, 05:52
Hudson Hudson build is still unstable: Maven-Plugins » Maven Eclipse Plugin #72 Fri, 04 Jul, 05:52
Hudson Build failed in Hudson: Maven-Plugins » Maven Assembly Plugin #72 Fri, 04 Jul, 05:52
Hudson Hudson build is still unstable: Maven-Plugins » Maven Ear plugin #72 Fri, 04 Jul, 05:52
Hudson Hudson build is still unstable: Maven-Plugins » Maven IDEA Plugin #73 Fri, 04 Jul, 06:27
Hudson Build failed in Hudson: Maven-Plugins » Maven Assembly Plugin #73 Fri, 04 Jul, 06:27
Hudson Build failed in Hudson: Maven-Plugins » Maven Site Plugin #73 Fri, 04 Jul, 06:27
Hudson Build failed in Hudson: Maven-Plugins » Maven Dependency Plugin #73 Fri, 04 Jul, 06:27
Hudson Build failed in Hudson: Maven-Plugins » Maven Patch Plugin #73 Fri, 04 Jul, 06:27
Hudson Hudson build is still unstable: Maven-Plugins » Maven Ear plugin #73 Fri, 04 Jul, 06:27
Hudson Hudson build is back to stable: Maven-Plugins » Maven Eclipse Plugin #73 Fri, 04 Jul, 06:27
Contin...@vmbuild.apache.org [continuum] BUILD FAILURE: Maven 2.1.x (trunk) - Integration Test Executor - Build Def: default maven2 buildDefinition Fri, 04 Jul, 08:05
Contin...@vmbuild.apache.org [continuum] BUILD FAILURE: Maven 2.0.x Branch - Maven Distribution - Build Def: default maven2 buildDefinition Fri, 04 Jul, 08:13
Hudson Hudson build is still unstable: Maven-Plugins » Maven Ear plugin #74 Fri, 04 Jul, 09:33
Hudson Build failed in Hudson: Maven-Plugins » Maven Site Plugin #74 Fri, 04 Jul, 09:33
Hudson Build failed in Hudson: Maven-Plugins » Maven Patch Plugin #74 Fri, 04 Jul, 09:33
Hudson Build failed in Hudson: Maven-Plugins » Maven Assembly Plugin #74 Fri, 04 Jul, 09:33
Hudson Hudson build became unstable: Maven-Plugins » Maven Eclipse Plugin #74 Fri, 04 Jul, 09:33
Hudson Hudson build is still unstable: Maven-Plugins » Maven IDEA Plugin #74 Fri, 04 Jul, 09:33
Hudson Build failed in Hudson: Maven-Plugins » Maven Dependency Plugin #74 Fri, 04 Jul, 09:33
Contin...@vmbuild.apache.org [continuum] BUILD SUCCESSFUL: Maven 2.0.x Branch - Maven Distribution - Build Def: default maven2 buildDefinition Fri, 04 Jul, 11:19
Hudson Build failed in Hudson: Maven-2.1.x-ITs #158 Fri, 04 Jul, 15:04
Hudson Hudson build is still unstable: Maven-Plugins » Maven Eclipse Plugin #75 Fri, 04 Jul, 15:26
Hudson Build failed in Hudson: Maven-Plugins » Maven Patch Plugin #75 Fri, 04 Jul, 15:26
Hudson Hudson build is still unstable: Maven-Plugins » Maven Ear plugin #75 Fri, 04 Jul, 15:26
Hudson Build failed in Hudson: Maven-Plugins » Maven Site Plugin #75 Fri, 04 Jul, 15:26
Hudson Build failed in Hudson: Maven-Plugins » Maven Dependency Plugin #75 Fri, 04 Jul, 15:26
Hudson Hudson build is still unstable: Maven-Plugins » Maven IDEA Plugin #75 Fri, 04 Jul, 15:26
Hudson Build failed in Hudson: Maven-Plugins » Maven Assembly Plugin #75 Fri, 04 Jul, 15:26
Hudson Build failed in Hudson: Maven-2.1.x-ITs #159 Fri, 04 Jul, 15:36
Hudson Build failed in Hudson: Maven-2.1.x-ITs #160 Fri, 04 Jul, 16:19
Hudson Build failed in Hudson: Maven-Plugins » Maven Assembly Plugin #76 Fri, 04 Jul, 17:35
Hudson Hudson build is still unstable: Maven-Plugins » Maven Eclipse Plugin #76 Fri, 04 Jul, 17:35
Hudson Hudson build is still unstable: Maven-Plugins » Maven Ear plugin #76 Fri, 04 Jul, 17:35
Hudson Build failed in Hudson: Maven-Plugins » Maven Dependency Plugin #76 Fri, 04 Jul, 17:35
Hudson Build failed in Hudson: Maven-Plugins » Maven Site Plugin #76 Fri, 04 Jul, 17:35
Hudson Build failed in Hudson: Maven-Plugins » Maven Patch Plugin #76 Fri, 04 Jul, 17:35
Hudson Hudson build is still unstable: Maven-Plugins » Maven IDEA Plugin #76 Fri, 04 Jul, 17:35
Contin...@vmbuild.apache.org [continuum] BUILD FAILURE: Maven 2.1.x (trunk) - Integration Test Executor - Build Def: default maven2 buildDefinition Fri, 04 Jul, 17:48
Hudson Build failed in Hudson: Maven-2.1.x-ITs #161 Fri, 04 Jul, 17:53
Hudson Hudson build is still unstable: Maven-Plugins » Maven Ear plugin #77 Fri, 04 Jul, 18:00
Hudson Build failed in Hudson: Maven-Plugins » Maven Patch Plugin #77 Fri, 04 Jul, 18:00
Hudson Build failed in Hudson: Maven-Plugins » Maven Site Plugin #77 Fri, 04 Jul, 18:00
Hudson Build failed in Hudson: Maven-Plugins » Maven Dependency Plugin #77 Fri, 04 Jul, 18:00
Hudson Hudson build is still unstable: Maven-Plugins » Maven Eclipse Plugin #77 Fri, 04 Jul, 18:00
Hudson Hudson build is still unstable: Maven-Plugins » Maven IDEA Plugin #77 Fri, 04 Jul, 18:00
Hudson Build failed in Hudson: Maven-Plugins » Maven Assembly Plugin #77 Fri, 04 Jul, 18:00
Hudson Build failed in Hudson: Maven-2.0.x-ITs #145 Fri, 04 Jul, 19:04
Contin...@vmbuild.apache.org [continuum] BUILD FAILURE: Maven 2.1.x (trunk) - Integration Test Executor - Build Def: default maven2 buildDefinition Fri, 04 Jul, 19:47
Hudson Build failed in Hudson: Maven-Plugins » Maven Plugins #78 Fri, 04 Jul, 20:39
Hudson Hudson build is unstable: Maven-Plugins » Maven Ear plugin #79 Fri, 04 Jul, 21:21
Hudson Hudson build is unstable: Maven-Plugins » Maven IDEA Plugin #79 Fri, 04 Jul, 21:21
Hudson Build failed in Hudson: Maven-Plugins » Maven Patch Plugin #79 Fri, 04 Jul, 21:21
Message list1 · 2 · 3 · 4 · 5 · 6 · 7 · 8 · 9 · Next »Thread · Author · Date
Box list
Apr 2015289
Mar 2015273
Feb 2015179
Jan 2015399
Dec 2014420
Nov 2014618
Oct 2014426
Sep 2014304
Aug 2014246
Jul 2014317
Jun 2014341
May 2014161
Apr 2014146
Mar 2014336
Feb 2014308
Jan 2014189
Dec 2013319
Nov 2013274
Oct 2013167
Sep 2013486
Aug 2013263
Jul 2013726
Jun 2013722
May 2013378
Apr 2013313
Mar 2013467
Feb 2013520
Jan 20131437
Dec 20121778
Nov 2012775
Oct 20121224
Sep 2012791
Aug 2012362
Jul 2012232
Jun 2012149
May 2012189
Apr 2012115
Mar 201257
Feb 2012155
Jan 2012170
Dec 2011244
Nov 2011187
Oct 2011139
Sep 2011190
Aug 2011276
Jul 201194
Jun 20114
Apr 201162
Mar 201176
Feb 201154
Jan 201185
Dec 201079
Nov 201061
Oct 201058
Sep 20101
Aug 201057
Jul 201037
Jun 201020
May 201075
Apr 201053
Mar 201012
Feb 201030
Jan 201071
Dec 2009104
Nov 200919
Oct 200931
Sep 2009193
Aug 2009268
Jul 2009193
Jun 2009147
May 200975
Apr 200979
Mar 2009134
Feb 2009657
Jan 200983
Dec 2008349
Nov 2008288
Oct 2008986
Sep 2008842
Aug 2008707
Jul 2008887
Jun 2008167
May 200821
Apr 2008231
Mar 2008438
Feb 2008317
Jan 2008205
Dec 2007185
Nov 2007532
Oct 2007439
Sep 2007699
Aug 20071294
Jul 2007351
Jun 20072211
May 2007273
Apr 2007262
Mar 2007534
Feb 20071648
Jan 20072359
Dec 2006575
Nov 2006357
Oct 2006642
Sep 2006660
Aug 20061662
Jul 20061320
Jun 2006473
May 20064700
Apr 20061113
Mar 20061048