maven-notifications mailing list archives

Site index · List index
Message view « Date » · « Thread »
Top « Date » · « Thread »
From Hudson <Hud...@sonatype.org>
Subject Build failed in Hudson: Maven-2.1.x-ITs #151
Date Thu, 03 Jul 2008 13:35:08 GMT
See http://ci.sonatype.org/job/Maven-2.1.x-ITs/151/changes

------------------------------------------
[...truncated 469 lines...]
Downloading: http://localhost:8081/nexus/content/groups/public/org/apache/maven/maven-project/2.1-SNAPSHOT/maven-project-2.1-20080630.165123-189.pom
2K downloaded
Downloading: http://localhost:8081/nexus/content/groups/public/org/codehaus/plexus/plexus-interpolation/1.0/plexus-interpolation-1.0.pom
1K downloaded
Downloading: http://localhost:8081/nexus/content/groups/public/org/codehaus/plexus/plexus-interactivity-api/1.0-alpha-6/plexus-interactivity-api-1.0-alpha-6.pom
726b downloaded
Downloading: http://localhost:8081/nexus/content/groups/public/org/codehaus/plexus/plexus-interactivity/1.0-alpha-6/plexus-interactivity-1.0-alpha-6.pom
1K downloaded
[INFO] snapshot org.apache.maven:maven-toolchain:2.1-SNAPSHOT: checking for updates from central
[INFO] snapshot org.apache.maven:maven-toolchain:2.1-SNAPSHOT: checking for updates from apache.snapshots
[INFO] snapshot org.apache.maven:maven-toolchain:2.1-SNAPSHOT: checking for updates from codehaus.snapshots
Downloading: http://localhost:8081/nexus/content/groups/public/org/apache/maven/maven-toolchain/2.1-SNAPSHOT/maven-toolchain-2.1-20080630.165123-147.pom
2K downloaded
Downloading: http://localhost:8081/nexus/content/groups/public/org/apache/maven/wagon/wagon-http-lightweight/1.0-beta-3/wagon-http-lightweight-1.0-beta-3.pom
1K downloaded
Downloading: http://localhost:8081/nexus/content/groups/public/org/apache/maven/wagon/wagon-providers/1.0-beta-3/wagon-providers-1.0-beta-3.pom
1K downloaded
Downloading: http://localhost:8081/nexus/content/groups/public/org/apache/maven/wagon/wagon/1.0-beta-3/wagon-1.0-beta-3.pom
8K downloaded
Downloading: http://localhost:8081/nexus/content/groups/public/org/apache/maven/wagon/wagon-http-shared/1.0-beta-3/wagon-http-shared-1.0-beta-3.pom
1K downloaded
Downloading: http://localhost:8081/nexus/content/groups/public/nekohtml/xercesMinimal/1.9.6.2/xercesMinimal-1.9.6.2.pom
390b downloaded
Downloading: http://localhost:8081/nexus/content/groups/public/nekohtml/nekohtml/1.9.6.2/nekohtml-1.9.6.2.pom
704b downloaded
Downloading: http://localhost:8081/nexus/content/groups/public/org/apache/maven/wagon/wagon-provider-api/1.0-beta-3/wagon-provider-api-1.0-beta-3.pom
906b downloaded
Downloading: http://localhost:8081/nexus/content/groups/public/org/apache/maven/wagon/wagon-ssh/1.0-beta-3/wagon-ssh-1.0-beta-3.pom
1K downloaded
Downloading: http://localhost:8081/nexus/content/groups/public/com/jcraft/jsch/0.1.38/jsch-0.1.38.pom
967b downloaded
Downloading: http://localhost:8081/nexus/content/groups/public/org/apache/maven/wagon/wagon-ssh-common/1.0-beta-3/wagon-ssh-common-1.0-beta-3.pom
968b downloaded
Downloading: http://localhost:8081/nexus/content/groups/public/org/apache/maven/wagon/wagon-ssh-external/1.0-beta-3/wagon-ssh-external-1.0-beta-3.pom
1K downloaded
Downloading: http://localhost:8081/nexus/content/groups/public/org/apache/maven/wagon/wagon-file/1.0-beta-3/wagon-file-1.0-beta-3.pom
575b downloaded
[INFO] snapshot org.apache.maven.its:core-integration-tests:2.1-SNAPSHOT: checking for updates
from central
[INFO] snapshot org.apache.maven.its:core-integration-tests:2.1-SNAPSHOT: checking for updates
from apache.snapshots
[INFO] snapshot org.apache.maven.its:core-integration-tests:2.1-SNAPSHOT: checking for updates
from codehaus.snapshots
Downloading: http://localhost:8081/nexus/content/groups/public/org/apache/maven/its/core-integration-tests/2.1-SNAPSHOT/core-integration-tests-2.1-20080702.220140-33.pom
1K downloaded
[INFO] snapshot org.apache.maven.its:core-integration-testing:2.1-SNAPSHOT: checking for updates
from central
[INFO] snapshot org.apache.maven.its:core-integration-testing:2.1-SNAPSHOT: checking for updates
from apache.snapshots
[INFO] snapshot org.apache.maven.its:core-integration-testing:2.1-SNAPSHOT: checking for updates
from codehaus.snapshots
Downloading: http://localhost:8081/nexus/content/groups/public/org/apache/maven/its/core-integration-testing/2.1-SNAPSHOT/core-integration-testing-2.1-20080702.220140-34.pom
2K downloaded
[INFO] snapshot org.apache.maven.its:maven-integration-test-helper:2.1-SNAPSHOT: checking
for updates from central
[INFO] snapshot org.apache.maven.its:maven-integration-test-helper:2.1-SNAPSHOT: checking
for updates from apache.snapshots
[INFO] snapshot org.apache.maven.its:maven-integration-test-helper:2.1-SNAPSHOT: checking
for updates from codehaus.snapshots
Downloading: http://localhost:8081/nexus/content/groups/public/org/apache/maven/its/maven-integration-test-helper/2.1-SNAPSHOT/maven-integration-test-helper-2.1-20080702.220140-34.pom
911b downloaded
[INFO] snapshot org.apache.maven.shared:maven-verifier:1.2-SNAPSHOT: checking for updates
from central
[INFO] snapshot org.apache.maven.shared:maven-verifier:1.2-SNAPSHOT: checking for updates
from apache.snapshots
[INFO] snapshot org.apache.maven.shared:maven-verifier:1.2-SNAPSHOT: checking for updates
from codehaus.snapshots
Downloading: http://localhost:8081/nexus/content/groups/public/org/apache/maven/shared/maven-verifier/1.2-SNAPSHOT/maven-verifier-1.2-20080630.154437-105.pom
1K downloaded
Downloading: http://localhost:8081/nexus/content/groups/public/org/apache/maven/shared/maven-shared-components/9/maven-shared-components-9.pom
3K downloaded
Downloading: http://localhost:8081/nexus/content/groups/public/org/apache/maven/maven-embedder/2.1-SNAPSHOT/maven-embedder-2.1-20080630.165123-176.jar
72K downloaded
Downloading: http://localhost:8081/nexus/content/groups/public/org/apache/maven/maven-core/2.1-SNAPSHOT/maven-core-2.1-20080630.165123-186.jar
343K downloaded
Downloading: http://localhost:8081/nexus/content/groups/public/org/apache/maven/maven-workspace/2.1-SNAPSHOT/maven-workspace-2.1-20080703.121645-162.jar
8K downloaded
Downloading: http://localhost:8081/nexus/content/groups/public/org/codehaus/plexus/plexus-container-default/1.0-alpha-48/plexus-container-default-1.0-alpha-48.jar
263K downloaded
Downloading: http://localhost:8081/nexus/content/groups/public/aspectj/aspectjrt/1.5.3/aspectjrt-1.5.3.jar
112K downloaded
Downloading: http://localhost:8081/nexus/content/groups/public/org/codehaus/plexus/plexus-utils/1.5.4/plexus-utils-1.5.4.jar
244K downloaded
Downloading: http://localhost:8081/nexus/content/groups/public/org/codehaus/plexus/plexus-classworlds/1.2-alpha-12/plexus-classworlds-1.2-alpha-12.jar
41K downloaded
Downloading: http://localhost:8081/nexus/content/groups/public/junit/junit/3.8.1/junit-3.8.1.jar
118K downloaded
Downloading: http://localhost:8081/nexus/content/groups/public/org/apache/xbean/xbean-reflect/3.4/xbean-reflect-3.4.jar
130K downloaded
Downloading: http://localhost:8081/nexus/content/groups/public/log4j/log4j/1.2.12/log4j-1.2.12.jar
349K downloaded
Downloading: http://localhost:8081/nexus/content/groups/public/commons-logging/commons-logging-api/1.1/commons-logging-api-1.1.jar
43K downloaded
Downloading: http://localhost:8081/nexus/content/groups/public/org/apache/maven/maven-lifecycle/2.1-SNAPSHOT/maven-lifecycle-2.1-20080703.121645-201.jar
43K downloaded
Downloading: http://localhost:8081/nexus/content/groups/public/org/apache/maven/maven-reporting-api/2.1-SNAPSHOT/maven-reporting-api-2.1-20080703.121645-183.jar
9K downloaded
Downloading: http://localhost:8081/nexus/content/groups/public/org/apache/maven/doxia/doxia-sink-api/1.0-alpha-9/doxia-sink-api-1.0-alpha-9.jar
9K downloaded
Downloading: http://localhost:8081/nexus/content/groups/public/org/apache/maven/maven-profile/2.1-SNAPSHOT/maven-profile-2.1-20080703.121645-202.jar
34K downloaded
Downloading: http://localhost:8081/nexus/content/groups/public/org/apache/maven/maven-model/2.1-SNAPSHOT/maven-model-2.1-20080703.121645-205.jar
90K downloaded
Downloading: http://localhost:8081/nexus/content/groups/public/org/apache/maven/artifact/maven-artifact/3.0-SNAPSHOT/maven-artifact-3.0-SNAPSHOT.jar
Downloading: http://localhost:8081/nexus/content/groups/public/org/apache/maven/maven-plugin-api/2.1-SNAPSHOT/maven-plugin-api-2.1-20080630.165123-192.jar
42K downloaded
Downloading: http://localhost:8081/nexus/content/groups/public/org/apache/maven/maven-project/2.1-SNAPSHOT/maven-project-2.1-20080630.165123-189.jar
230K downloaded
Downloading: http://localhost:8081/nexus/content/groups/public/org/codehaus/plexus/plexus-interpolation/1.0/plexus-interpolation-1.0.jar
33K downloaded
Downloading: http://localhost:8081/nexus/content/groups/public/commons-cli/commons-cli/1.0/commons-cli-1.0.jar
29K downloaded
Downloading: http://localhost:8081/nexus/content/groups/public/org/codehaus/plexus/plexus-interactivity-api/1.0-alpha-6/plexus-interactivity-api-1.0-alpha-6.jar
11K downloaded
Downloading: http://localhost:8081/nexus/content/groups/public/org/apache/maven/maven-toolchain/2.1-SNAPSHOT/maven-toolchain-2.1-20080630.165123-147.jar
34K downloaded
Downloading: http://localhost:8081/nexus/content/groups/public/org/apache/maven/wagon/wagon-http-lightweight/1.0-beta-3/wagon-http-lightweight-1.0-beta-3.jar
13K downloaded
Downloading: http://localhost:8081/nexus/content/groups/public/org/apache/maven/wagon/wagon-http-shared/1.0-beta-3/wagon-http-shared-1.0-beta-3.jar
18K downloaded
Downloading: http://localhost:8081/nexus/content/groups/public/nekohtml/xercesMinimal/1.9.6.2/xercesMinimal-1.9.6.2.jar
38K downloaded
Downloading: http://localhost:8081/nexus/content/groups/public/nekohtml/nekohtml/1.9.6.2/nekohtml-1.9.6.2.jar
109K downloaded
Downloading: http://localhost:8081/nexus/content/groups/public/org/apache/maven/wagon/wagon-provider-api/1.0-beta-3/wagon-provider-api-1.0-beta-3.jar
50K downloaded
Downloading: http://localhost:8081/nexus/content/groups/public/org/apache/maven/wagon/wagon-ssh/1.0-beta-3/wagon-ssh-1.0-beta-3.jar
27K downloaded
Downloading: http://localhost:8081/nexus/content/groups/public/com/jcraft/jsch/0.1.38/jsch-0.1.38.jar
173K downloaded
Downloading: http://localhost:8081/nexus/content/groups/public/org/apache/maven/wagon/wagon-ssh-common/1.0-beta-3/wagon-ssh-common-1.0-beta-3.jar
23K downloaded
Downloading: http://localhost:8081/nexus/content/groups/public/org/apache/maven/wagon/wagon-ssh-external/1.0-beta-3/wagon-ssh-external-1.0-beta-3.jar
13K downloaded
Downloading: http://localhost:8081/nexus/content/groups/public/org/apache/maven/wagon/wagon-file/1.0-beta-3/wagon-file-1.0-beta-3.jar
9K downloaded
Downloading: http://localhost:8081/nexus/content/groups/public/org/apache/maven/its/core-integration-tests/2.1-SNAPSHOT/core-integration-tests-2.1-20080702.220140-33-tests.jar
978K downloaded
Downloading: http://localhost:8081/nexus/content/groups/public/org/apache/maven/its/maven-integration-test-helper/2.1-SNAPSHOT/maven-integration-test-helper-2.1-20080702.220140-34.jar
8K downloaded
Downloading: http://localhost:8081/nexus/content/groups/public/org/apache/maven/maven-artifact/2.0.5/maven-artifact-2.0.5.jar
83K downloaded
Downloading: http://localhost:8081/nexus/content/groups/public/org/apache/maven/shared/maven-verifier/1.2-SNAPSHOT/maven-verifier-1.2-20080630.154437-105.jar
79K downloaded
[INFO] ------------------------------------------------------------------------
[ERROR] BUILD ERROR
[INFO] ------------------------------------------------------------------------
[INFO] Failed to resolve artifact.

Missing:
----------
1) org.apache.maven.artifact:maven-artifact:jar:3.0-SNAPSHOT

  Try downloading the file manually from the project website.

  Then, install it using the command: 
      mvn install:install-file -DgroupId=org.apache.maven.artifact -DartifactId=maven-artifact
-Dversion=3.0-SNAPSHOT -Dpackaging=jar -Dfile=/path/to/file

  Alternatively, if you host your own repository you can deploy the file there: 
      mvn deploy:deploy-file -DgroupId=org.apache.maven.artifact -DartifactId=maven-artifact
-Dversion=3.0-SNAPSHOT -Dpackaging=jar -Dfile=/path/to/file -Durl=[url] -DrepositoryId=[id]

  Path to dependency: 
  	1) org.apache.maven:maven-core-it-runner:jar:2.1-SNAPSHOT
  	2) org.apache.maven:maven-distribution:tar.gz:bin:2.1-SNAPSHOT
  	3) org.apache.maven:maven-core:jar:2.1-SNAPSHOT
  	4) org.apache.maven.artifact:maven-artifact:jar:3.0-SNAPSHOT

----------
1 required artifact is missing.

for artifact: 
  org.apache.maven:maven-core-it-runner:jar:2.1-SNAPSHOT

from the specified remote repositories:
  Nexus (http://localhost:8081/nexus/content/groups/public)


[INFO] ------------------------------------------------------------------------
[INFO] Trace
org.apache.maven.lifecycle.LifecycleExecutionException: Missing:
----------
1) org.apache.maven.artifact:maven-artifact:jar:3.0-SNAPSHOT

  Try downloading the file manually from the project website.

  Then, install it using the command: 
      mvn install:install-file -DgroupId=org.apache.maven.artifact -DartifactId=maven-artifact
-Dversion=3.0-SNAPSHOT -Dpackaging=jar -Dfile=/path/to/file

  Alternatively, if you host your own repository you can deploy the file there: 
      mvn deploy:deploy-file -DgroupId=org.apache.maven.artifact -DartifactId=maven-artifact
-Dversion=3.0-SNAPSHOT -Dpackaging=jar -Dfile=/path/to/file -Durl=[url] -DrepositoryId=[id]

  Path to dependency: 
  	1) org.apache.maven:maven-core-it-runner:jar:2.1-SNAPSHOT
  	2) org.apache.maven:maven-distribution:tar.gz:bin:2.1-SNAPSHOT
  	3) org.apache.maven:maven-core:jar:2.1-SNAPSHOT
  	4) org.apache.maven.artifact:maven-artifact:jar:3.0-SNAPSHOT

----------
1 required artifact is missing.

for artifact: 
  org.apache.maven:maven-core-it-runner:jar:2.1-SNAPSHOT

from the specified remote repositories:
  Nexus (http://localhost:8081/nexus/content/groups/public)

	at org.apache.maven.lifecycle.DefaultLifecycleExecutor.executeGoals(DefaultLifecycleExecutor.java:575)
	at org.apache.maven.lifecycle.DefaultLifecycleExecutor.executeGoalWithLifecycle(DefaultLifecycleExecutor.java:499)
	at org.apache.maven.lifecycle.DefaultLifecycleExecutor.executeGoal(DefaultLifecycleExecutor.java:478)
	at org.apache.maven.lifecycle.DefaultLifecycleExecutor.executeGoalAndHandleFailures(DefaultLifecycleExecutor.java:330)
	at org.apache.maven.lifecycle.DefaultLifecycleExecutor.executeTaskSegments(DefaultLifecycleExecutor.java:291)
	at org.apache.maven.lifecycle.DefaultLifecycleExecutor.execute(DefaultLifecycleExecutor.java:142)
	at org.apache.maven.DefaultMaven.doExecute(DefaultMaven.java:336)
	at org.apache.maven.DefaultMaven.execute(DefaultMaven.java:129)
	at org.apache.maven.cli.MavenCli.main(MavenCli.java:287)
	at sun.reflect.NativeMethodAccessorImpl.invoke0(Native Method)
	at sun.reflect.NativeMethodAccessorImpl.invoke(NativeMethodAccessorImpl.java:39)
	at sun.reflect.DelegatingMethodAccessorImpl.invoke(DelegatingMethodAccessorImpl.java:25)
	at java.lang.reflect.Method.invoke(Method.java:585)
	at org.codehaus.classworlds.Launcher.launchEnhanced(Launcher.java:315)
	at org.codehaus.classworlds.Launcher.launch(Launcher.java:255)
	at org.codehaus.classworlds.Launcher.mainWithExitCode(Launcher.java:430)
	at org.codehaus.classworlds.Launcher.main(Launcher.java:375)
Caused by: org.apache.maven.artifact.resolver.MultipleArtifactsNotFoundException: Missing:
----------
1) org.apache.maven.artifact:maven-artifact:jar:3.0-SNAPSHOT

  Try downloading the file manually from the project website.

  Then, install it using the command: 
      mvn install:install-file -DgroupId=org.apache.maven.artifact -DartifactId=maven-artifact
-Dversion=3.0-SNAPSHOT -Dpackaging=jar -Dfile=/path/to/file

  Alternatively, if you host your own repository you can deploy the file there: 
      mvn deploy:deploy-file -DgroupId=org.apache.maven.artifact -DartifactId=maven-artifact
-Dversion=3.0-SNAPSHOT -Dpackaging=jar -Dfile=/path/to/file -Durl=[url] -DrepositoryId=[id]

  Path to dependency: 
  	1) org.apache.maven:maven-core-it-runner:jar:2.1-SNAPSHOT
  	2) org.apache.maven:maven-distribution:tar.gz:bin:2.1-SNAPSHOT
  	3) org.apache.maven:maven-core:jar:2.1-SNAPSHOT
  	4) org.apache.maven.artifact:maven-artifact:jar:3.0-SNAPSHOT

----------
1 required artifact is missing.

for artifact: 
  org.apache.maven:maven-core-it-runner:jar:2.1-SNAPSHOT

from the specified remote repositories:
  Nexus (http://localhost:8081/nexus/content/groups/public)

	at org.apache.maven.artifact.resolver.DefaultArtifactResolver.resolveTransitively(DefaultArtifactResolver.java:324)
	at org.apache.maven.artifact.resolver.DefaultArtifactResolver.resolveTransitively(DefaultArtifactResolver.java:288)
	at org.apache.maven.plugin.DefaultPluginManager.resolveTransitiveDependencies(DefaultPluginManager.java:1415)
	at org.apache.maven.plugin.DefaultPluginManager.executeMojo(DefaultPluginManager.java:405)
	at org.apache.maven.lifecycle.DefaultLifecycleExecutor.executeGoals(DefaultLifecycleExecutor.java:558)
	... 16 more
[INFO] ------------------------------------------------------------------------
[INFO] Total time: 25 seconds
[INFO] Finished at: Thu Jul 03 08:35:08 CDT 2008
[INFO] Final Memory: 32M/415M
[INFO] ------------------------------------------------------------------------


Mime
View raw message