maven-notifications mailing list archives

Site index · List index
Message view « Date » · « Thread »
Top « Date » · « Thread »
From Hudson <Hud...@sonatype.org>
Subject Build failed in Hudson: Maven-2.1.x #189
Date Thu, 03 Jul 2008 12:17:07 GMT
See http://ci.sonatype.org/job/Maven-2.1.x/189/changes

Changes:

[mkleint] current model's remote repositories need to be calculated before the parent/origin
is stored in lineage.
fixes this scenario (as found in svn:https://www.dev.java.net/svn/grizzly/trunk)
project defines remote custom repository and also has build extension that is only available
at that remote repository. it defines RELEASE as the version of the extension artifact.

------------------------------------------
[...truncated 5970 lines...]
[DEBUG]   (f) deploymentRepository = [apache.snapshots] -> http://localhost:8081/nexus/content/repositories/maven.snapshots
[DEBUG]   (s) localRepository = [local] -> file:///home/j2ee-hudson/repos/Maven-2.1.x
[DEBUG]   (f) packaging = jar
[DEBUG]   (f) pomFile = http://ci.sonatype.org/job/Maven-2.1.x/ws/maven-2.1.x/maven-profile/pom.xml

[DEBUG]   (f) updateReleaseInfo = false
[DEBUG] -- end configuration --
[INFO] [deploy:deploy]
altDeploymentRepository = null
[INFO] Retrieving previous build number from apache.snapshots
Uploading: http://localhost:8081/nexus/content/repositories/maven.snapshots/org/apache/maven/maven-profile/2.1-SNAPSHOT/maven-profile-2.1-20080703.121645-202.jar
34K uploaded
[INFO] Retrieving previous metadata from apache.snapshots
[INFO] Uploading repository metadata for: 'snapshot org.apache.maven:maven-profile:2.1-SNAPSHOT'
[INFO] Uploading project information for maven-profile 2.1-20080703.121645-202
[INFO] Retrieving previous metadata from apache.snapshots
[INFO] Uploading repository metadata for: 'artifact org.apache.maven:maven-profile'
[INFO] ------------------------------------------------------------------------
[INFO] Building Maven Plugin API
[INFO]    task-segment: [clean, deploy]
[INFO] ------------------------------------------------------------------------
[DEBUG] Configuring mojo 'org.apache.maven.plugins:maven-clean-plugin:2.2:clean' -->
[DEBUG]   (f) directory = http://ci.sonatype.org/job/Maven-2.1.x/ws/maven-2.1.x/maven-plugin-api/target

[DEBUG]   (f) failOnError = true
[DEBUG]   (f) followSymLinks = false
[DEBUG]   (f) outputDirectory = http://ci.sonatype.org/job/Maven-2.1.x/ws/maven-2.1.x/maven-plugin-api/target/classes

[DEBUG]   (f) project = MavenProject: org.apache.maven:maven-plugin-api:2.1-SNAPSHOT @ http://ci.sonatype.org/job/Maven-2.1.x/ws/maven-2.1.x/maven-plugin-api/pom.xml

[DEBUG]   (f) reportDirectory = http://ci.sonatype.org/job/Maven-2.1.x/ws/maven-2.1.x/maven-plugin-api/target/site

[DEBUG]   (f) skip = false
[DEBUG]   (f) testOutputDirectory = http://ci.sonatype.org/job/Maven-2.1.x/ws/maven-2.1.x/maven-plugin-api/target/test-classes

[DEBUG]   (f) verbose = false
[DEBUG] -- end configuration --
[INFO] [clean:clean]
[DEBUG] org.apache.maven:maven-plugin-api:jar:2.1-SNAPSHOT (selected for null)
[INFO] snapshot org.apache.maven.artifact:maven-artifact:3.0-SNAPSHOT: checking for updates
from central
[INFO] snapshot org.apache.maven.artifact:maven-artifact:3.0-SNAPSHOT: checking for updates
from apache.snapshots
[INFO] snapshot org.apache.maven.artifact:maven-artifact:3.0-SNAPSHOT: checking for updates
from codehaus.snapshots
[DEBUG] maven-artifact: using locally installed snapshot
[DEBUG] Trying repository codehaus.snapshots
Downloading: http://localhost:8081/nexus/content/groups/public/org/apache/maven/artifact/maven-artifact/3.0-SNAPSHOT/maven-artifact-3.0-SNAPSHOT.pom
[DEBUG] Artifact not found - using stub model: Unable to locate resource in repository

  org.apache.maven.artifact:maven-artifact:pom:3.0-SNAPSHOT

from the specified remote repositories:
  Nexus (http://localhost:8081/nexus/content/groups/public)

[DEBUG] Using defaults for missing POM org.apache.maven.artifact:maven-artifact:pom:3.0-SNAPSHOT:compile
[DEBUG]   org.apache.maven.artifact:maven-artifact:jar:3.0-SNAPSHOT:compile (selected for
compile)
[DEBUG]   org.codehaus.plexus:plexus-container-default:jar:1.0-alpha-48:compile (selected
for compile)
[DEBUG]     aspectj:aspectjrt:jar:1.5.3:compile (selected for compile)
[DEBUG]     org.codehaus.plexus:plexus-utils:jar:1.4.5:compile (applying version: 1.5.4)
[DEBUG]     org.codehaus.plexus:plexus-utils:jar:1.5.4:compile (selected for compile)
[DEBUG]     org.codehaus.plexus:plexus-classworlds:jar:1.2-alpha-13:compile (applying version:
1.2-alpha-12)
[DEBUG]     org.codehaus.plexus:plexus-classworlds:jar:1.2-alpha-12:compile (selected for
compile)
[DEBUG]       junit:junit:jar:3.8.1:compile (selected for compile)
[DEBUG]     org.apache.xbean:xbean-reflect:jar:3.4:compile (selected for compile)
[DEBUG]       log4j:log4j:jar:1.2.12:compile (selected for compile)
[DEBUG]       commons-logging:commons-logging-api:jar:1.1:compile (selected for compile)
[DEBUG]     junit:junit:jar:3.8.1:compile (selected for compile)
[DEBUG]   junit:junit:jar:3.8.1:test (not setting scope to: compile; local scope test wins)
[DEBUG]   junit:junit:jar:3.8.1:test (selected for test)
[DEBUG] maven-artifact: using locally installed snapshot
[DEBUG] Trying repository codehaus.snapshots
Downloading: http://localhost:8081/nexus/content/groups/public/org/apache/maven/artifact/maven-artifact/3.0-SNAPSHOT/maven-artifact-3.0-SNAPSHOT.jar
[DEBUG] Unable to locate resource in repository

Try downloading the file manually from the project website.

Then, install it using the command: 
    mvn install:install-file -DgroupId=org.apache.maven.artifact -DartifactId=maven-artifact
-Dversion=3.0-SNAPSHOT -Dpackaging=jar -Dfile=/path/to/file

Alternatively, if you host your own repository you can deploy the file there: 
    mvn deploy:deploy-file -DgroupId=org.apache.maven.artifact -DartifactId=maven-artifact
-Dversion=3.0-SNAPSHOT -Dpackaging=jar -Dfile=/path/to/file -Durl=[url] -DrepositoryId=[id]

Path to dependency: 
	1) org.apache.maven:maven-plugin-api:jar:2.1-SNAPSHOT
	2) org.apache.maven.artifact:maven-artifact:jar:3.0-SNAPSHOT


  org.apache.maven.artifact:maven-artifact:jar:3.0-SNAPSHOT

from the specified remote repositories:
  Nexus (http://localhost:8081/nexus/content/groups/public)

org.apache.maven.artifact.resolver.ArtifactNotFoundException: Unable to locate resource in
repository

Try downloading the file manually from the project website.

Then, install it using the command: 
    mvn install:install-file -DgroupId=org.apache.maven.artifact -DartifactId=maven-artifact
-Dversion=3.0-SNAPSHOT -Dpackaging=jar -Dfile=/path/to/file

Alternatively, if you host your own repository you can deploy the file there: 
    mvn deploy:deploy-file -DgroupId=org.apache.maven.artifact -DartifactId=maven-artifact
-Dversion=3.0-SNAPSHOT -Dpackaging=jar -Dfile=/path/to/file -Durl=[url] -DrepositoryId=[id]

Path to dependency: 
	1) org.apache.maven:maven-plugin-api:jar:2.1-SNAPSHOT
	2) org.apache.maven.artifact:maven-artifact:jar:3.0-SNAPSHOT


  org.apache.maven.artifact:maven-artifact:jar:3.0-SNAPSHOT

from the specified remote repositories:
  Nexus (http://localhost:8081/nexus/content/groups/public)

	at org.apache.maven.artifact.resolver.DefaultArtifactResolver.resolve(DefaultArtifactResolver.java:212)
	at org.apache.maven.artifact.resolver.DefaultArtifactResolver.resolve(DefaultArtifactResolver.java:74)
	at org.apache.maven.artifact.resolver.DefaultArtifactResolver.resolveTransitively(DefaultArtifactResolver.java:311)
	at org.apache.maven.artifact.resolver.DefaultArtifactResolver.resolveTransitively(DefaultArtifactResolver.java:288)
	at org.apache.maven.plugin.DefaultPluginManager.resolveTransitiveDependencies(DefaultPluginManager.java:1415)
	at org.apache.maven.plugin.DefaultPluginManager.executeMojo(DefaultPluginManager.java:405)
	at org.apache.maven.lifecycle.DefaultLifecycleExecutor.executeGoals(DefaultLifecycleExecutor.java:558)
	at org.apache.maven.lifecycle.DefaultLifecycleExecutor.executeGoalWithLifecycle(DefaultLifecycleExecutor.java:499)
	at org.apache.maven.lifecycle.DefaultLifecycleExecutor.executeGoal(DefaultLifecycleExecutor.java:478)
	at org.apache.maven.lifecycle.DefaultLifecycleExecutor.executeGoalAndHandleFailures(DefaultLifecycleExecutor.java:330)
	at org.apache.maven.lifecycle.DefaultLifecycleExecutor.executeTaskSegments(DefaultLifecycleExecutor.java:291)
	at org.apache.maven.lifecycle.DefaultLifecycleExecutor.execute(DefaultLifecycleExecutor.java:142)
	at org.apache.maven.DefaultMaven.doExecute(DefaultMaven.java:336)
	at org.apache.maven.DefaultMaven.execute(DefaultMaven.java:129)
	at org.apache.maven.cli.MavenCli.main(MavenCli.java:287)
	at sun.reflect.NativeMethodAccessorImpl.invoke0(Native Method)
	at sun.reflect.NativeMethodAccessorImpl.invoke(NativeMethodAccessorImpl.java:39)
	at sun.reflect.DelegatingMethodAccessorImpl.invoke(DelegatingMethodAccessorImpl.java:25)
	at java.lang.reflect.Method.invoke(Method.java:585)
	at org.codehaus.classworlds.Launcher.launchEnhanced(Launcher.java:315)
	at org.codehaus.classworlds.Launcher.launch(Launcher.java:255)
	at org.codehaus.classworlds.Launcher.mainWithExitCode(Launcher.java:430)
	at org.codehaus.classworlds.Launcher.main(Launcher.java:375)
Caused by: org.apache.maven.wagon.ResourceDoesNotExistException: Unable to locate resource
in repository
	at org.apache.maven.wagon.providers.http.LightweightHttpWagon.fillInputData(LightweightHttpWagon.java:100)
	at org.apache.maven.wagon.StreamWagon.get(StreamWagon.java:68)
	at org.apache.maven.artifact.manager.DefaultWagonManager.getRemoteFile(DefaultWagonManager.java:470)
	at org.apache.maven.artifact.manager.DefaultWagonManager.getArtifact(DefaultWagonManager.java:354)
	at org.apache.maven.artifact.resolver.DefaultArtifactResolver.resolve(DefaultArtifactResolver.java:196)
	... 22 more
Caused by: java.io.FileNotFoundException: http://localhost:8081/nexus/content/groups/public/org/apache/maven/artifact/maven-artifact/3.0-SNAPSHOT/maven-artifact-3.0-SNAPSHOT.jar
	at sun.net.www.protocol.http.HttpURLConnection.getInputStream(HttpURLConnection.java:1168)
	at org.apache.maven.wagon.providers.http.LightweightHttpWagon.fillInputData(LightweightHttpWagon.java:83)
	... 26 more
[INFO] ------------------------------------------------------------------------
[ERROR] BUILD ERROR
[INFO] ------------------------------------------------------------------------
[INFO] Failed to resolve artifact.

Missing:
----------
1) org.apache.maven.artifact:maven-artifact:jar:3.0-SNAPSHOT

  Try downloading the file manually from the project website.

  Then, install it using the command: 
      mvn install:install-file -DgroupId=org.apache.maven.artifact -DartifactId=maven-artifact
-Dversion=3.0-SNAPSHOT -Dpackaging=jar -Dfile=/path/to/file

  Alternatively, if you host your own repository you can deploy the file there: 
      mvn deploy:deploy-file -DgroupId=org.apache.maven.artifact -DartifactId=maven-artifact
-Dversion=3.0-SNAPSHOT -Dpackaging=jar -Dfile=/path/to/file -Durl=[url] -DrepositoryId=[id]

  Path to dependency: 
  	1) org.apache.maven:maven-plugin-api:jar:2.1-SNAPSHOT
  	2) org.apache.maven.artifact:maven-artifact:jar:3.0-SNAPSHOT

----------
1 required artifact is missing.

for artifact: 
  org.apache.maven:maven-plugin-api:jar:2.1-SNAPSHOT

from the specified remote repositories:
  Nexus (http://localhost:8081/nexus/content/groups/public)


[INFO] ------------------------------------------------------------------------
[DEBUG] Trace
org.apache.maven.lifecycle.LifecycleExecutionException: Missing:
----------
1) org.apache.maven.artifact:maven-artifact:jar:3.0-SNAPSHOT

  Try downloading the file manually from the project website.

  Then, install it using the command: 
      mvn install:install-file -DgroupId=org.apache.maven.artifact -DartifactId=maven-artifact
-Dversion=3.0-SNAPSHOT -Dpackaging=jar -Dfile=/path/to/file

  Alternatively, if you host your own repository you can deploy the file there: 
      mvn deploy:deploy-file -DgroupId=org.apache.maven.artifact -DartifactId=maven-artifact
-Dversion=3.0-SNAPSHOT -Dpackaging=jar -Dfile=/path/to/file -Durl=[url] -DrepositoryId=[id]

  Path to dependency: 
  	1) org.apache.maven:maven-plugin-api:jar:2.1-SNAPSHOT
  	2) org.apache.maven.artifact:maven-artifact:jar:3.0-SNAPSHOT

----------
1 required artifact is missing.

for artifact: 
  org.apache.maven:maven-plugin-api:jar:2.1-SNAPSHOT

from the specified remote repositories:
  Nexus (http://localhost:8081/nexus/content/groups/public)

	at org.apache.maven.lifecycle.DefaultLifecycleExecutor.executeGoals(DefaultLifecycleExecutor.java:575)
	at org.apache.maven.lifecycle.DefaultLifecycleExecutor.executeGoalWithLifecycle(DefaultLifecycleExecutor.java:499)
	at org.apache.maven.lifecycle.DefaultLifecycleExecutor.executeGoal(DefaultLifecycleExecutor.java:478)
	at org.apache.maven.lifecycle.DefaultLifecycleExecutor.executeGoalAndHandleFailures(DefaultLifecycleExecutor.java:330)
	at org.apache.maven.lifecycle.DefaultLifecycleExecutor.executeTaskSegments(DefaultLifecycleExecutor.java:291)
	at org.apache.maven.lifecycle.DefaultLifecycleExecutor.execute(DefaultLifecycleExecutor.java:142)
	at org.apache.maven.DefaultMaven.doExecute(DefaultMaven.java:336)
	at org.apache.maven.DefaultMaven.execute(DefaultMaven.java:129)
	at org.apache.maven.cli.MavenCli.main(MavenCli.java:287)
	at sun.reflect.NativeMethodAccessorImpl.invoke0(Native Method)
	at sun.reflect.NativeMethodAccessorImpl.invoke(NativeMethodAccessorImpl.java:39)
	at sun.reflect.DelegatingMethodAccessorImpl.invoke(DelegatingMethodAccessorImpl.java:25)
	at java.lang.reflect.Method.invoke(Method.java:585)
	at org.codehaus.classworlds.Launcher.launchEnhanced(Launcher.java:315)
	at org.codehaus.classworlds.Launcher.launch(Launcher.java:255)
	at org.codehaus.classworlds.Launcher.mainWithExitCode(Launcher.java:430)
	at org.codehaus.classworlds.Launcher.main(Launcher.java:375)
Caused by: org.apache.maven.artifact.resolver.MultipleArtifactsNotFoundException: Missing:
----------
1) org.apache.maven.artifact:maven-artifact:jar:3.0-SNAPSHOT

  Try downloading the file manually from the project website.

  Then, install it using the command: 
      mvn install:install-file -DgroupId=org.apache.maven.artifact -DartifactId=maven-artifact
-Dversion=3.0-SNAPSHOT -Dpackaging=jar -Dfile=/path/to/file

  Alternatively, if you host your own repository you can deploy the file there: 
      mvn deploy:deploy-file -DgroupId=org.apache.maven.artifact -DartifactId=maven-artifact
-Dversion=3.0-SNAPSHOT -Dpackaging=jar -Dfile=/path/to/file -Durl=[url] -DrepositoryId=[id]

  Path to dependency: 
  	1) org.apache.maven:maven-plugin-api:jar:2.1-SNAPSHOT
  	2) org.apache.maven.artifact:maven-artifact:jar:3.0-SNAPSHOT

----------
1 required artifact is missing.

for artifact: 
  org.apache.maven:maven-plugin-api:jar:2.1-SNAPSHOT

from the specified remote repositories:
  Nexus (http://localhost:8081/nexus/content/groups/public)

	at org.apache.maven.artifact.resolver.DefaultArtifactResolver.resolveTransitively(DefaultArtifactResolver.java:324)
	at org.apache.maven.artifact.resolver.DefaultArtifactResolver.resolveTransitively(DefaultArtifactResolver.java:288)
	at org.apache.maven.plugin.DefaultPluginManager.resolveTransitiveDependencies(DefaultPluginManager.java:1415)
	at org.apache.maven.plugin.DefaultPluginManager.executeMojo(DefaultPluginManager.java:405)
	at org.apache.maven.lifecycle.DefaultLifecycleExecutor.executeGoals(DefaultLifecycleExecutor.java:558)
	... 16 more
[INFO] ------------------------------------------------------------------------
[INFO] Total time: 32 seconds
[INFO] Finished at: Thu Jul 03 07:17:07 CDT 2008
[INFO] Final Memory: 48M/417M
[INFO] ------------------------------------------------------------------------


Mime
View raw message