maven-notifications mailing list archives

Site index · List index
Message view « Date » · « Thread »
Top « Date » · « Thread »
From Hudson <Hud...@sonatype.org>
Subject Build failed in Hudson: mercury #23
Date Sat, 26 Jul 2008 16:47:04 GMT
See http://ci.sonatype.org/job/mercury/23/changes

Changes:

[ogusakov] minor rename

[ogusakov] MetadataTreeTest passes in the new framework. LocalRepositoryReader rules.

------------------------------------------
[...truncated 274 lines...]
1K downloaded
[INFO] snapshot org.mortbay.jetty:jetty-project:7.0-SNAPSHOT: checking for updates from central
Downloading: http://localhost:8081/content/groups/public/org/mortbay/jetty/jetty-project/7.0-SNAPSHOT/jetty-project-7.0-20080716.011922-4.pom
7K downloaded
Downloading: http://snapshots.repository.codehaus.org/org/mortbay/jetty/jetty-parent/3/jetty-parent-3.pom
Downloading: http://localhost:8081/content/groups/public/org/mortbay/jetty/jetty-parent/3/jetty-parent-3.pom
11K downloaded
[INFO] snapshot org.mortbay.jetty:jetty-ssl:7.0-SNAPSHOT: checking for updates from central
Downloading: http://localhost:8081/content/groups/public/org/mortbay/jetty/jetty-ssl/7.0-SNAPSHOT/jetty-ssl-7.0-20080716.011922-6.pom
3K downloaded
[INFO] snapshot org.mortbay.jetty:modules-server:7.0-SNAPSHOT: checking for updates from central
Downloading: http://localhost:8081/content/groups/public/org/mortbay/jetty/modules-server/7.0-SNAPSHOT/modules-server-7.0-20080716.011922-6.pom
776b downloaded
[INFO] snapshot org.mortbay.jetty:jetty:7.0-SNAPSHOT: checking for updates from central
Downloading: http://localhost:8081/content/groups/public/org/mortbay/jetty/jetty/7.0-SNAPSHOT/jetty-7.0-20080716.011922-8.pom
7K downloaded
Downloading: http://localhost:8081/content/groups/public/org/mortbay/jetty/servlet-api/3.0.pre1/servlet-api-3.0.pre1.pom
2K downloaded
[INFO] snapshot org.mortbay.jetty:jetty-util:7.0-SNAPSHOT: checking for updates from central
Downloading: http://localhost:8081/content/groups/public/org/mortbay/jetty/jetty-util/7.0-SNAPSHOT/jetty-util-7.0-20080716.011922-6.pom
3K downloaded
Downloading: http://localhost:8081/content/groups/public/org/mortbay/jetty/jetty-servlet/7.0.0pre2/jetty-servlet-7.0.0pre2.pom
2K downloaded
Downloading: http://localhost:8081/content/groups/public/org/mortbay/jetty/modules-extra/7.0.0pre2/modules-extra-7.0.0pre2.pom
1K downloaded
Downloading: http://localhost:8081/content/groups/public/org/mortbay/jetty/jetty-project/7.0.0pre2/jetty-project-7.0.0pre2.pom
7K downloaded
Downloading: http://localhost:8081/content/groups/public/org/mortbay/jetty/jetty-util/7.0.0pre2/jetty-util-7.0.0pre2.pom
3K downloaded
Downloading: http://localhost:8081/content/groups/public/org/mortbay/jetty/modules-server/7.0.0pre2/modules-server-7.0.0pre2.pom
810b downloaded
Downloading: http://localhost:8081/content/groups/public/org/codehaus/plexus/plexus-utils/1.5.1/plexus-utils-1.5.1.pom
2K downloaded
Downloading: http://localhost:8081/content/groups/public/org/sat4j/org.sat4j.core/2.0.0/org.sat4j.core-2.0.0.pom
Downloading: http://localhost:8081/content/groups/public/org/sat4j/org.sat4j.pb/2.0.0/org.sat4j.pb-2.0.0.pom
Downloading: http://localhost:8081/content/groups/public/org/mortbay/jetty/jetty-servlet-tester/7.0.0pre0/jetty-servlet-tester-7.0.0pre0.pom
2K downloaded
Downloading: http://localhost:8081/content/groups/public/org/mortbay/jetty/modules-extra/7.0.0pre0/modules-extra-7.0.0pre0.pom
1K downloaded
Downloading: http://localhost:8081/content/groups/public/org/mortbay/jetty/jetty-project/7.0.0pre0/jetty-project-7.0.0pre0.pom
7K downloaded
Downloading: http://snapshots.repository.codehaus.org/org/mortbay/jetty/jetty-parent/2/jetty-parent-2.pom
Downloading: http://localhost:8081/content/groups/public/org/mortbay/jetty/jetty-parent/2/jetty-parent-2.pom
11K downloaded
Downloading: http://localhost:8081/content/groups/public/org/mortbay/jetty/jetty/7.0.0pre0/jetty-7.0.0pre0.pom
4K downloaded
Downloading: http://localhost:8081/content/groups/public/org/mortbay/jetty/modules-server/7.0.0pre0/modules-server-7.0.0pre0.pom
810b downloaded
Downloading: http://localhost:8081/content/groups/public/commons-digester/commons-digester/1.8/commons-digester-1.8.pom
6K downloaded
Downloading: http://localhost:8081/content/groups/public/commons-beanutils/commons-beanutils/1.7.0/commons-beanutils-1.7.0.pom
357b downloaded
Downloading: http://localhost:8081/content/groups/public/commons-logging/commons-logging/1.0.3/commons-logging-1.0.3.pom
866b downloaded
Downloading: http://localhost:8081/content/groups/public/commons-logging/commons-logging/1.1/commons-logging-1.1.pom
6K downloaded
Downloading: http://localhost:8081/content/groups/public/log4j/log4j/1.2.12/log4j-1.2.12.pom
145b downloaded
Downloading: http://localhost:8081/content/groups/public/logkit/logkit/1.0.1/logkit-1.0.1.pom
147b downloaded
Downloading: http://localhost:8081/content/groups/public/avalon-framework/avalon-framework/4.1.3/avalon-framework-4.1.3.pom
167b downloaded
Downloading: http://localhost:8081/content/groups/public/javax/servlet/servlet-api/2.3/servlet-api-2.3.pom
156b downloaded
Downloading: http://localhost:8081/content/groups/public/org/slf4j/slf4j-simple/1.5.2/slf4j-simple-1.5.2.pom
1K downloaded
Downloading: http://localhost:8081/content/groups/public/org/slf4j/slf4j-parent/1.5.2/slf4j-parent-1.5.2.pom
7K downloaded
Downloading: http://localhost:8081/content/groups/public/org/slf4j/slf4j-api/1.5.2/slf4j-api-1.5.2.pom
2K downloaded
Downloading: http://localhost:8081/content/groups/public/org/codehaus/plexus/plexus-container-default/1.0-alpha-43/plexus-container-default-1.0-alpha-43.jar
255K downloaded
Downloading: http://localhost:8081/content/groups/public/aspectj/aspectjrt/1.5.3/aspectjrt-1.5.3.jar
112K downloaded
Downloading: http://localhost:8081/content/groups/public/org/codehaus/plexus/plexus-utils/1.5.1/plexus-utils-1.5.1.jar
205K downloaded
Downloading: http://localhost:8081/content/groups/public/org/codehaus/plexus/plexus-classworlds/1.2-alpha-10/plexus-classworlds-1.2-alpha-10.jar
41K downloaded
Downloading: http://localhost:8081/content/groups/public/org/mortbay/jetty/jetty-client/7.0-SNAPSHOT/jetty-client-7.0-20080716.011922-9.jar
60K downloaded
Downloading: http://localhost:8081/content/groups/public/org/mortbay/jetty/jetty-ssl/7.0-SNAPSHOT/jetty-ssl-7.0-20080716.011922-6.jar
30K downloaded
Downloading: http://localhost:8081/content/groups/public/org/mortbay/jetty/jetty/7.0-SNAPSHOT/jetty-7.0-20080716.011922-8.jar
521K downloaded
Downloading: http://localhost:8081/content/groups/public/org/mortbay/jetty/servlet-api/3.0.pre1/servlet-api-3.0.pre1.jar
147K downloaded
Downloading: http://localhost:8081/content/groups/public/org/mortbay/jetty/jetty-util/7.0-SNAPSHOT/jetty-util-7.0-20080716.011922-6.jar
128K downloaded
Downloading: http://localhost:8081/content/groups/public/org/mortbay/jetty/jetty-servlet/7.0.0pre2/jetty-servlet-7.0.0pre2.jar
43K downloaded
Downloading: http://localhost:8081/content/groups/public/org/sat4j/org.sat4j.core/2.0.0/org.sat4j.core-2.0.0.jar
Downloading: http://localhost:8081/content/groups/public/org/sat4j/org.sat4j.pb/2.0.0/org.sat4j.pb-2.0.0.jar
Downloading: http://localhost:8081/content/groups/public/org/slf4j/slf4j-simple/1.5.2/slf4j-simple-1.5.2.jar
7K downloaded
Downloading: http://localhost:8081/content/groups/public/org/slf4j/slf4j-api/1.5.2/slf4j-api-1.5.2.jar
16K downloaded
[INFO] ------------------------------------------------------------------------
[ERROR] BUILD ERROR
[INFO] ------------------------------------------------------------------------
[INFO] Failed to resolve artifact.

Missing:
----------
1) org.sat4j:org.sat4j.core:jar:2.0.0

  Try downloading the file manually from the project website.

  Then, install it using the command: 
      mvn install:install-file -DgroupId=org.sat4j -DartifactId=org.sat4j.core -Dversion=2.0.0
-Dpackaging=jar -Dfile=/path/to/file

  Alternatively, if you host your own repository you can deploy the file there: 
      mvn deploy:deploy-file -DgroupId=org.sat4j -DartifactId=org.sat4j.core -Dversion=2.0.0
-Dpackaging=jar -Dfile=/path/to/file -Durl=[url] -DrepositoryId=[id]

  Path to dependency: 
  	1) org.apache.maven.mercury:mercury:jar:1.0-SNAPSHOT
  	2) org.sat4j:org.sat4j.core:jar:2.0.0

2) org.sat4j:org.sat4j.pb:jar:2.0.0

  Try downloading the file manually from the project website.

  Then, install it using the command: 
      mvn install:install-file -DgroupId=org.sat4j -DartifactId=org.sat4j.pb -Dversion=2.0.0
-Dpackaging=jar -Dfile=/path/to/file

  Alternatively, if you host your own repository you can deploy the file there: 
      mvn deploy:deploy-file -DgroupId=org.sat4j -DartifactId=org.sat4j.pb -Dversion=2.0.0
-Dpackaging=jar -Dfile=/path/to/file -Durl=[url] -DrepositoryId=[id]

  Path to dependency: 
  	1) org.apache.maven.mercury:mercury:jar:1.0-SNAPSHOT
  	2) org.sat4j:org.sat4j.pb:jar:2.0.0

----------
2 required artifacts are missing.

for artifact: 
  org.apache.maven.mercury:mercury:jar:1.0-SNAPSHOT

from the specified remote repositories:
  Nexus (http://localhost:8081/content/groups/public)


[INFO] ------------------------------------------------------------------------
[INFO] Trace
org.apache.maven.lifecycle.LifecycleExecutionException: Missing:
----------
1) org.sat4j:org.sat4j.core:jar:2.0.0

  Try downloading the file manually from the project website.

  Then, install it using the command: 
      mvn install:install-file -DgroupId=org.sat4j -DartifactId=org.sat4j.core -Dversion=2.0.0
-Dpackaging=jar -Dfile=/path/to/file

  Alternatively, if you host your own repository you can deploy the file there: 
      mvn deploy:deploy-file -DgroupId=org.sat4j -DartifactId=org.sat4j.core -Dversion=2.0.0
-Dpackaging=jar -Dfile=/path/to/file -Durl=[url] -DrepositoryId=[id]

  Path to dependency: 
  	1) org.apache.maven.mercury:mercury:jar:1.0-SNAPSHOT
  	2) org.sat4j:org.sat4j.core:jar:2.0.0

2) org.sat4j:org.sat4j.pb:jar:2.0.0

  Try downloading the file manually from the project website.

  Then, install it using the command: 
      mvn install:install-file -DgroupId=org.sat4j -DartifactId=org.sat4j.pb -Dversion=2.0.0
-Dpackaging=jar -Dfile=/path/to/file

  Alternatively, if you host your own repository you can deploy the file there: 
      mvn deploy:deploy-file -DgroupId=org.sat4j -DartifactId=org.sat4j.pb -Dversion=2.0.0
-Dpackaging=jar -Dfile=/path/to/file -Durl=[url] -DrepositoryId=[id]

  Path to dependency: 
  	1) org.apache.maven.mercury:mercury:jar:1.0-SNAPSHOT
  	2) org.sat4j:org.sat4j.pb:jar:2.0.0

----------
2 required artifacts are missing.

for artifact: 
  org.apache.maven.mercury:mercury:jar:1.0-SNAPSHOT

from the specified remote repositories:
  Nexus (http://localhost:8081/content/groups/public)

	at org.apache.maven.lifecycle.DefaultLifecycleExecutor.executeGoals(DefaultLifecycleExecutor.java:575)
	at org.apache.maven.lifecycle.DefaultLifecycleExecutor.executeGoalWithLifecycle(DefaultLifecycleExecutor.java:499)
	at org.apache.maven.lifecycle.DefaultLifecycleExecutor.executeGoal(DefaultLifecycleExecutor.java:478)
	at org.apache.maven.lifecycle.DefaultLifecycleExecutor.executeGoalAndHandleFailures(DefaultLifecycleExecutor.java:330)
	at org.apache.maven.lifecycle.DefaultLifecycleExecutor.executeTaskSegments(DefaultLifecycleExecutor.java:291)
	at org.apache.maven.lifecycle.DefaultLifecycleExecutor.execute(DefaultLifecycleExecutor.java:142)
	at org.apache.maven.DefaultMaven.doExecute(DefaultMaven.java:336)
	at org.apache.maven.DefaultMaven.execute(DefaultMaven.java:129)
	at org.apache.maven.cli.MavenCli.main(MavenCli.java:287)
	at sun.reflect.NativeMethodAccessorImpl.invoke0(Native Method)
	at sun.reflect.NativeMethodAccessorImpl.invoke(NativeMethodAccessorImpl.java:39)
	at sun.reflect.DelegatingMethodAccessorImpl.invoke(DelegatingMethodAccessorImpl.java:25)
	at java.lang.reflect.Method.invoke(Method.java:597)
	at org.codehaus.classworlds.Launcher.launchEnhanced(Launcher.java:315)
	at org.codehaus.classworlds.Launcher.launch(Launcher.java:255)
	at org.codehaus.classworlds.Launcher.mainWithExitCode(Launcher.java:430)
	at org.codehaus.classworlds.Launcher.main(Launcher.java:375)
Caused by: org.apache.maven.artifact.resolver.MultipleArtifactsNotFoundException: Missing:
----------
1) org.sat4j:org.sat4j.core:jar:2.0.0

  Try downloading the file manually from the project website.

  Then, install it using the command: 
      mvn install:install-file -DgroupId=org.sat4j -DartifactId=org.sat4j.core -Dversion=2.0.0
-Dpackaging=jar -Dfile=/path/to/file

  Alternatively, if you host your own repository you can deploy the file there: 
      mvn deploy:deploy-file -DgroupId=org.sat4j -DartifactId=org.sat4j.core -Dversion=2.0.0
-Dpackaging=jar -Dfile=/path/to/file -Durl=[url] -DrepositoryId=[id]

  Path to dependency: 
  	1) org.apache.maven.mercury:mercury:jar:1.0-SNAPSHOT
  	2) org.sat4j:org.sat4j.core:jar:2.0.0

2) org.sat4j:org.sat4j.pb:jar:2.0.0

  Try downloading the file manually from the project website.

  Then, install it using the command: 
      mvn install:install-file -DgroupId=org.sat4j -DartifactId=org.sat4j.pb -Dversion=2.0.0
-Dpackaging=jar -Dfile=/path/to/file

  Alternatively, if you host your own repository you can deploy the file there: 
      mvn deploy:deploy-file -DgroupId=org.sat4j -DartifactId=org.sat4j.pb -Dversion=2.0.0
-Dpackaging=jar -Dfile=/path/to/file -Durl=[url] -DrepositoryId=[id]

  Path to dependency: 
  	1) org.apache.maven.mercury:mercury:jar:1.0-SNAPSHOT
  	2) org.sat4j:org.sat4j.pb:jar:2.0.0

----------
2 required artifacts are missing.

for artifact: 
  org.apache.maven.mercury:mercury:jar:1.0-SNAPSHOT

from the specified remote repositories:
  Nexus (http://localhost:8081/content/groups/public)

	at org.apache.maven.artifact.resolver.DefaultArtifactResolver.resolveTransitively(DefaultArtifactResolver.java:324)
	at org.apache.maven.artifact.resolver.DefaultArtifactResolver.resolveTransitively(DefaultArtifactResolver.java:288)
	at org.apache.maven.plugin.DefaultPluginManager.resolveTransitiveDependencies(DefaultPluginManager.java:1415)
	at org.apache.maven.plugin.DefaultPluginManager.executeMojo(DefaultPluginManager.java:405)
	at org.apache.maven.lifecycle.DefaultLifecycleExecutor.executeGoals(DefaultLifecycleExecutor.java:558)
	... 16 more
[INFO] ------------------------------------------------------------------------
[INFO] Total time: 15 seconds
[INFO] Finished at: Sat Jul 26 11:47:04 CDT 2008
[INFO] Final Memory: 25M/425M
[INFO] ------------------------------------------------------------------------


Mime
View raw message