maven-notifications mailing list archives

Site index · List index
Message view « Date » · « Thread »
Top « Date » · « Thread »
From Hudson <Hud...@sonatype.org>
Subject Build failed in Hudson: Maven-2.1.x-ITs #155
Date Thu, 03 Jul 2008 21:51:42 GMT
See http://ci.sonatype.org/job/Maven-2.1.x-ITs/155/changes

------------------------------------------
[...truncated 506 lines...]
url = http://localhost:8081/nexus/content/groups/public
Downloading: http://localhost:8081/nexus/content/groups/public/org/apache/maven/maven-artifact-manager/2.0.2/maven-artifact-manager-2.0.2.pom
1K downloaded
[INFO] Using mirror: Nexus for repository: central
(mirror url: http://localhost:8081/nexus/content/groups/public)
url = http://localhost:8081/nexus/content/groups/public
Downloading: http://localhost:8081/nexus/content/groups/public/org/apache/maven/wagon/wagon-provider-api/1.0-alpha-6/wagon-provider-api-1.0-alpha-6.pom
588b downloaded
[INFO] Using mirror: Nexus for repository: central
(mirror url: http://localhost:8081/nexus/content/groups/public)
url = http://localhost:8081/nexus/content/groups/public
Downloading: http://localhost:8081/nexus/content/groups/public/org/apache/maven/wagon/wagon/1.0-alpha-6/wagon-1.0-alpha-6.pom
6K downloaded
[INFO] Using mirror: Nexus for repository: central
(mirror url: http://localhost:8081/nexus/content/groups/public)
url = http://localhost:8081/nexus/content/groups/public
Downloading: http://localhost:8081/nexus/content/groups/public/org/codehaus/plexus/plexus-utils/1.4.6/plexus-utils-1.4.6.pom
2K downloaded
[INFO] Using mirror: Nexus for repository: central
(mirror url: http://localhost:8081/nexus/content/groups/public)
url = http://localhost:8081/nexus/content/groups/public
Downloading: http://localhost:8081/nexus/content/groups/public/org/codehaus/plexus/plexus/1.0.11/plexus-1.0.11.pom
8K downloaded
[INFO] Using mirror: Nexus for repository: central
(mirror url: http://localhost:8081/nexus/content/groups/public)
url = http://localhost:8081/nexus/content/groups/public
Downloading: http://localhost:8081/nexus/content/groups/public/org/apache/maven/maven-project/2.0/maven-project-2.0.jar
102K downloaded
[INFO] Using mirror: Nexus for repository: central
(mirror url: http://localhost:8081/nexus/content/groups/public)
url = http://localhost:8081/nexus/content/groups/public
Downloading: http://localhost:8081/nexus/content/groups/public/org/apache/maven/maven-profile/2.0/maven-profile-2.0.jar
29K downloaded
[INFO] Using mirror: Nexus for repository: central
(mirror url: http://localhost:8081/nexus/content/groups/public)
url = http://localhost:8081/nexus/content/groups/public
Downloading: http://localhost:8081/nexus/content/groups/public/org/apache/maven/maven-model/2.0/maven-model-2.0.jar
76K downloaded
[INFO] Using mirror: Nexus for repository: central
(mirror url: http://localhost:8081/nexus/content/groups/public)
url = http://localhost:8081/nexus/content/groups/public
Downloading: http://localhost:8081/nexus/content/groups/public/org/codehaus/plexus/plexus-utils/1.1/plexus-utils-1.1.jar
164K downloaded
[INFO] Using mirror: Nexus for repository: central
(mirror url: http://localhost:8081/nexus/content/groups/public)
url = http://localhost:8081/nexus/content/groups/public
Downloading: http://localhost:8081/nexus/content/groups/public/org/codehaus/plexus/plexus-container-default/1.0-alpha-8/plexus-container-default-1.0-alpha-8.jar
190K downloaded
[INFO] Using mirror: Nexus for repository: central
(mirror url: http://localhost:8081/nexus/content/groups/public)
url = http://localhost:8081/nexus/content/groups/public
Downloading: http://localhost:8081/nexus/content/groups/public/junit/junit/3.8.1/junit-3.8.1.jar
118K downloaded
[INFO] Using mirror: Nexus for repository: central
(mirror url: http://localhost:8081/nexus/content/groups/public)
url = http://localhost:8081/nexus/content/groups/public
Downloading: http://localhost:8081/nexus/content/groups/public/classworlds/classworlds/1.1-alpha-2/classworlds-1.1-alpha-2.jar
36K downloaded
[INFO] Using mirror: Nexus for repository: central
(mirror url: http://localhost:8081/nexus/content/groups/public)
url = http://localhost:8081/nexus/content/groups/public
Downloading: http://localhost:8081/nexus/content/groups/public/org/apache/maven/maven-artifact-manager/2.0/maven-artifact-manager-2.0.jar
49K downloaded
[INFO] Using mirror: Nexus for repository: central
(mirror url: http://localhost:8081/nexus/content/groups/public)
url = http://localhost:8081/nexus/content/groups/public
Downloading: http://localhost:8081/nexus/content/groups/public/org/apache/maven/maven-repository-metadata/2.0/maven-repository-metadata-2.0.jar
20K downloaded
[INFO] Using mirror: Nexus for repository: central
(mirror url: http://localhost:8081/nexus/content/groups/public)
url = http://localhost:8081/nexus/content/groups/public
Downloading: http://localhost:8081/nexus/content/groups/public/org/apache/maven/maven-artifact/2.0/maven-artifact-2.0.jar
76K downloaded
[INFO] Using mirror: Nexus for repository: central
(mirror url: http://localhost:8081/nexus/content/groups/public)
url = http://localhost:8081/nexus/content/groups/public
Downloading: http://localhost:8081/nexus/content/groups/public/org/apache/maven/wagon/wagon-provider-api/1.0-alpha-5/wagon-provider-api-1.0-alpha-5.jar
50K downloaded
[INFO] Using mirror: Nexus for repository: central
(mirror url: http://localhost:8081/nexus/content/groups/public)
url = http://localhost:8081/nexus/content/groups/public
Downloading: http://localhost:8081/nexus/content/groups/public/org/apache/maven/maven-plugin-api/2.0/maven-plugin-api-2.0.jar
9K downloaded
[INFO] Using mirror: Nexus for repository: central
(mirror url: http://localhost:8081/nexus/content/groups/public)
url = http://localhost:8081/nexus/content/groups/public
Downloading: http://localhost:8081/nexus/content/groups/public/org/apache/maven/shared/file-management/1.2/file-management-1.2.jar
36K downloaded
[INFO] Using mirror: Nexus for repository: central
(mirror url: http://localhost:8081/nexus/content/groups/public)
url = http://localhost:8081/nexus/content/groups/public
Downloading: http://localhost:8081/nexus/content/groups/public/org/apache/maven/shared/maven-shared-io/1.1/maven-shared-io-1.1.jar
38K downloaded
[ERROR] 
Maven encountered an error while loading a plugin for use in your build.
Plugin:
Group-Id: org.apache.maven.plugins
Artifact-Id: maven-clean-plugin
Version: 2.2
Referenced mojo: clean
brought in via: null
While building project:
Group-Id: org.apache.maven.its.it0112
Artifact-Id: test-project
Version: 1.0-SNAPSHOT
>From file: http://ci.sonatype.org/job/Maven-2.1.x-ITs/ws/maven-core-its/target/it-working-folder/it0112-extensionsThatDragDependencies/test-project/pom.xml

Error message:Failed to load plugin. Reason: The PluginDescriptor for the plugin org.apache.maven.plugins:maven-clean-plugin
was not found. Should have been in realm: ClassRealm[/plugins/org.apache.maven.plugins:maven-clean-plugin:2.2@48/thread:main,
parent: null]
Root error message:The PluginDescriptor for the plugin org.apache.maven.plugins:maven-clean-plugin
was not found. Should have been in realm: ClassRealm[/plugins/org.apache.maven.plugins:maven-clean-plugin:2.2@48/thread:main,
parent: null]
org.apache.maven.plugin.PluginManagerException: The PluginDescriptor for the plugin org.apache.maven.plugins:maven-clean-plugin
was not found. Should have been in realm: ClassRealm[/plugins/org.apache.maven.plugins:maven-clean-plugin:2.2@48/thread:main,
parent: null]
	at org.apache.maven.plugin.DefaultPluginManager.addPlugin(DefaultPluginManager.java:350)
	at org.apache.maven.plugin.DefaultPluginManager.verifyVersionedPlugin(DefaultPluginManager.java:219)
	at org.apache.maven.plugin.DefaultPluginManager.verifyPlugin(DefaultPluginManager.java:194)
	at org.apache.maven.plugin.loader.DefaultPluginLoader.loadPlugin(DefaultPluginLoader.java:79)
	at org.apache.maven.plugin.loader.DefaultPluginLoader.loadPlugin(DefaultPluginLoader.java:52)
	at org.apache.maven.lifecycle.DefaultLifecycleExecutor.getMojoDescriptorForDirectInvocation(DefaultLifecycleExecutor.java:856)
	at org.apache.maven.lifecycle.DefaultLifecycleExecutor.isTaskValid(DefaultLifecycleExecutor.java:678)
	at org.apache.maven.DefaultMaven.execute_aroundBody0(DefaultMaven.java:194)
	at org.apache.maven.DefaultMaven.execute_aroundBody1$advice(DefaultMaven.java:303)
	at org.apache.maven.DefaultMaven.execute(DefaultMaven.java:1)
	at org.apache.maven.embedder.MavenEmbedder.execute_aroundBody2(MavenEmbedder.java:904)
	at org.apache.maven.embedder.MavenEmbedder.execute_aroundBody3$advice(MavenEmbedder.java:303)
	at org.apache.maven.embedder.MavenEmbedder.execute(MavenEmbedder.java:1)
	at org.apache.maven.cli.MavenCli.doMain(MavenCli.java:176)
	at org.apache.maven.cli.MavenCli.main(MavenCli.java:63)
	at sun.reflect.NativeMethodAccessorImpl.invoke0(Native Method)
	at sun.reflect.NativeMethodAccessorImpl.invoke(NativeMethodAccessorImpl.java:39)
	at sun.reflect.DelegatingMethodAccessorImpl.invoke(DelegatingMethodAccessorImpl.java:25)
	at java.lang.reflect.Method.invoke(Method.java:585)
	at org.codehaus.plexus.classworlds.launcher.Launcher.launchEnhanced(Launcher.java:289)
	at org.codehaus.plexus.classworlds.launcher.Launcher.launch(Launcher.java:229)
	at org.codehaus.plexus.classworlds.launcher.Launcher.mainWithExitCode(Launcher.java:408)
	at org.codehaus.plexus.classworlds.launcher.Launcher.main(Launcher.java:351)
Error stacktrace:
org.apache.maven.InvalidTaskException: Cannot find mojo descriptor for: 'clean:clean' - Treating
as non-aggregator.
	at org.apache.maven.lifecycle.TaskValidationResult.generateInvalidTaskException(TaskValidationResult.java:78)
	at org.apache.maven.DefaultMaven.execute_aroundBody0(DefaultMaven.java:198)
	at org.apache.maven.DefaultMaven.execute_aroundBody1$advice(DefaultMaven.java:303)
	at org.apache.maven.DefaultMaven.execute(DefaultMaven.java:1)
	at org.apache.maven.embedder.MavenEmbedder.execute_aroundBody2(MavenEmbedder.java:904)
	at org.apache.maven.embedder.MavenEmbedder.execute_aroundBody3$advice(MavenEmbedder.java:303)
	at org.apache.maven.embedder.MavenEmbedder.execute(MavenEmbedder.java:1)
	at org.apache.maven.cli.MavenCli.doMain(MavenCli.java:176)
	at org.apache.maven.cli.MavenCli.main(MavenCli.java:63)
	at sun.reflect.NativeMethodAccessorImpl.invoke0(Native Method)
	at sun.reflect.NativeMethodAccessorImpl.invoke(NativeMethodAccessorImpl.java:39)
	at sun.reflect.DelegatingMethodAccessorImpl.invoke(DelegatingMethodAccessorImpl.java:25)
	at java.lang.reflect.Method.invoke(Method.java:585)
	at org.codehaus.plexus.classworlds.launcher.Launcher.launchEnhanced(Launcher.java:289)
	at org.codehaus.plexus.classworlds.launcher.Launcher.launch(Launcher.java:229)
	at org.codehaus.plexus.classworlds.launcher.Launcher.mainWithExitCode(Launcher.java:408)
	at org.codehaus.plexus.classworlds.launcher.Launcher.main(Launcher.java:351)
Caused by: org.apache.maven.plugin.loader.PluginLoaderException: Failed to load plugin. Reason:
The PluginDescriptor for the plugin org.apache.maven.plugins:maven-clean-plugin was not found.
Should have been in realm: ClassRealm[/plugins/org.apache.maven.plugins:maven-clean-plugin:2.2@48/thread:main,
parent: null]
	at org.apache.maven.plugin.loader.DefaultPluginLoader.loadPlugin(DefaultPluginLoader.java:109)
	at org.apache.maven.plugin.loader.DefaultPluginLoader.loadPlugin(DefaultPluginLoader.java:52)
	at org.apache.maven.lifecycle.DefaultLifecycleExecutor.getMojoDescriptorForDirectInvocation(DefaultLifecycleExecutor.java:856)
	at org.apache.maven.lifecycle.DefaultLifecycleExecutor.isTaskValid(DefaultLifecycleExecutor.java:678)
	at org.apache.maven.DefaultMaven.execute_aroundBody0(DefaultMaven.java:194)
	... 15 more
Caused by: org.apache.maven.plugin.PluginManagerException: The PluginDescriptor for the plugin
org.apache.maven.plugins:maven-clean-plugin was not found. Should have been in realm: ClassRealm[/plugins/org.apache.maven.plugins:maven-clean-plugin:2.2@48/thread:main,
parent: null]
	at org.apache.maven.plugin.DefaultPluginManager.addPlugin(DefaultPluginManager.java:350)
	at org.apache.maven.plugin.DefaultPluginManager.verifyVersionedPlugin(DefaultPluginManager.java:219)
	at org.apache.maven.plugin.DefaultPluginManager.verifyPlugin(DefaultPluginManager.java:194)
	at org.apache.maven.plugin.loader.DefaultPluginLoader.loadPlugin(DefaultPluginLoader.java:79)
	... 19 more
[INFO] ------------------------------------------------------------------------
[INFO] BUILD FAILED
[INFO] ------------------------------------------------------------------------
[INFO] Total time: 2 seconds
[INFO] Finished at: Thu Jul 03 16:32:25 CDT 2008
[INFO] Final Memory: 3M/169M
[INFO] ------------------------------------------------------------------------
	at org.apache.maven.it.Verifier.executeGoals(Verifier.java:1039)
	at org.apache.maven.it.Verifier.executeGoal(Verifier.java:894)
	at org.apache.maven.it.Verifier.executeGoal(Verifier.java:888)
	at org.apache.maven.integrationtests.MavenIT0112ExtensionsThatDragDependencies.testit0112(MavenIT0112ExtensionsThatDragDependencies.java:50)
	at org.apache.maven.integrationtests.MavenIT0112ExtensionsThatDragDependencies.testit0112(MavenIT0112ExtensionsThatDragDependencies.java:50)
	at sun.reflect.NativeMethodAccessorImpl.invoke0(Native Method)
	at sun.reflect.NativeMethodAccessorImpl.invoke(NativeMethodAccessorImpl.java:39)
	at sun.reflect.DelegatingMethodAccessorImpl.invoke(DelegatingMethodAccessorImpl.java:25)
	at java.lang.reflect.Method.invoke(Method.java:585)
	at junit.framework.TestCase.runTest(TestCase.java:154)
	at org.apache.maven.integrationtests.AbstractMavenIntegrationTestCase.runTest(AbstractMavenIntegrationTestCase.java:100)
	at junit.framework.TestCase.runBare(TestCase.java:127)
	at junit.framework.TestResult$1.protect(TestResult.java:106)
	at junit.framework.TestResult.runProtected(TestResult.java:124)
	at junit.framework.TestResult.run(TestResult.java:109)
	at junit.framework.TestCase.run(TestCase.java:118)
	at junit.framework.TestSuite.runTest(TestSuite.java:208)
	at junit.framework.TestSuite.run(TestSuite.java:203)
	at junit.framework.TestSuite.runTest(TestSuite.java:208)
	at junit.framework.TestSuite.run(TestSuite.java:203)
	at sun.reflect.NativeMethodAccessorImpl.invoke0(Native Method)
	at sun.reflect.NativeMethodAccessorImpl.invoke(NativeMethodAccessorImpl.java:39)
	at sun.reflect.DelegatingMethodAccessorImpl.invoke(DelegatingMethodAccessorImpl.java:25)
	at java.lang.reflect.Method.invoke(Method.java:585)
	at org.apache.maven.surefire.junit.JUnitTestSet.execute(JUnitTestSet.java:213)
	at org.apache.maven.surefire.suite.AbstractDirectoryTestSuite.executeTestSet(AbstractDirectoryTestSuite.java:138)
	at org.apache.maven.surefire.suite.AbstractDirectoryTestSuite.execute(AbstractDirectoryTestSuite.java:125)
	at org.apache.maven.surefire.Surefire.run(Surefire.java:132)
	at sun.reflect.NativeMethodAccessorImpl.invoke0(Native Method)
	at sun.reflect.NativeMethodAccessorImpl.invoke(NativeMethodAccessorImpl.java:39)
	at sun.reflect.DelegatingMethodAccessorImpl.invoke(DelegatingMethodAccessorImpl.java:25)
	at java.lang.reflect.Method.invoke(Method.java:585)
	at org.apache.maven.surefire.booter.SurefireBooter.runSuitesInProcess(SurefireBooter.java:290)
	at org.apache.maven.surefire.booter.SurefireBooter.main(SurefireBooter.java:818)


Results :

Tests in error: 
  testitMNG3473(org.apache.maven.integrationtests.MavenITmng3473PluginReportCrash)
  testit0112(org.apache.maven.integrationtests.MavenIT0112ExtensionsThatDragDependencies)

Tests run: 165, Failures: 0, Errors: 2, Skipped: 0

[INFO] ------------------------------------------------------------------------
[ERROR] BUILD FAILURE
[INFO] ------------------------------------------------------------------------
[INFO] There are test failures.
[INFO] ------------------------------------------------------------------------
[INFO] Trace
org.apache.maven.BuildFailureException: There are test failures.
	at org.apache.maven.lifecycle.DefaultLifecycleExecutor.executeGoals(DefaultLifecycleExecutor.java:579)
	at org.apache.maven.lifecycle.DefaultLifecycleExecutor.executeGoalWithLifecycle(DefaultLifecycleExecutor.java:499)
	at org.apache.maven.lifecycle.DefaultLifecycleExecutor.executeGoal(DefaultLifecycleExecutor.java:478)
	at org.apache.maven.lifecycle.DefaultLifecycleExecutor.executeGoalAndHandleFailures(DefaultLifecycleExecutor.java:330)
	at org.apache.maven.lifecycle.DefaultLifecycleExecutor.executeTaskSegments(DefaultLifecycleExecutor.java:291)
	at org.apache.maven.lifecycle.DefaultLifecycleExecutor.execute(DefaultLifecycleExecutor.java:142)
	at org.apache.maven.DefaultMaven.doExecute(DefaultMaven.java:336)
	at org.apache.maven.DefaultMaven.execute(DefaultMaven.java:129)
	at org.apache.maven.cli.MavenCli.main(MavenCli.java:287)
	at sun.reflect.NativeMethodAccessorImpl.invoke0(Native Method)
	at sun.reflect.NativeMethodAccessorImpl.invoke(NativeMethodAccessorImpl.java:39)
	at sun.reflect.DelegatingMethodAccessorImpl.invoke(DelegatingMethodAccessorImpl.java:25)
	at java.lang.reflect.Method.invoke(Method.java:585)
	at org.codehaus.classworlds.Launcher.launchEnhanced(Launcher.java:315)
	at org.codehaus.classworlds.Launcher.launch(Launcher.java:255)
	at org.codehaus.classworlds.Launcher.mainWithExitCode(Launcher.java:430)
	at org.codehaus.classworlds.Launcher.main(Launcher.java:375)
Caused by: org.apache.maven.plugin.MojoFailureException: There are test failures.
	at org.apache.maven.plugin.surefire.SurefirePlugin.execute(SurefirePlugin.java:425)
	at org.apache.maven.plugin.DefaultPluginManager.executeMojo(DefaultPluginManager.java:451)
	at org.apache.maven.lifecycle.DefaultLifecycleExecutor.executeGoals(DefaultLifecycleExecutor.java:558)
	... 16 more
[INFO] ------------------------------------------------------------------------
[INFO] Total time: 27 minutes 20 seconds
[INFO] Finished at: Thu Jul 03 16:51:41 CDT 2008
[INFO] Final Memory: 37M/422M
[INFO] ------------------------------------------------------------------------


Mime
View raw message