maven-notifications mailing list archives

Site index · List index
Message view « Date » · « Thread »
Top « Date » · « Thread »
From Hudson <Hud...@sonatype.org>
Subject Build failed in Hudson: Maven-2.1.x-ITs #165
Date Sun, 06 Jul 2008 16:37:25 GMT
See http://ci.sonatype.org/job/Maven-2.1.x-ITs/165/changes

------------------------------------------
[...truncated 388 lines...]
	at org.apache.maven.artifact.manager.DefaultWagonManager.getArtifact(DefaultWagonManager.java:341)
	at org.apache.maven.artifact.resolver.DefaultArtifactResolver.resolve(DefaultArtifactResolver.java:167)
	at org.apache.maven.artifact.resolver.DefaultArtifactResolver.resolve(DefaultArtifactResolver.java:82)
	at org.apache.maven.project.DefaultMavenProjectBuilder.findModelFromRepository(DefaultMavenProjectBuilder.java:555)
	at org.apache.maven.project.DefaultMavenProjectBuilder.buildFromRepository(DefaultMavenProjectBuilder.java:236)
	at org.apache.maven.project.artifact.MavenMetadataSource.retrieve(MavenMetadataSource.java:132)
	at org.apache.maven.artifact.resolver.DefaultArtifactCollector.recurse(DefaultArtifactCollector.java:511)
	at org.apache.maven.artifact.resolver.DefaultArtifactCollector.recurse(DefaultArtifactCollector.java:541)
	at org.apache.maven.artifact.resolver.DefaultArtifactCollector.collect(DefaultArtifactCollector.java:132)
	at org.apache.maven.artifact.resolver.DefaultArtifactResolver.resolveTransitively(DefaultArtifactResolver.java:347)
	at org.apache.maven.artifact.resolver.DefaultArtifactResolver.resolveTransitively(DefaultArtifactResolver.java:321)
	at org.apache.maven.artifact.resolver.DefaultArtifactResolver.resolveTransitively(DefaultArtifactResolver.java:289)
	at org.apache.maven.plugin.DefaultPluginManager.getPluginArtifacts(DefaultPluginManager.java:446)
	at org.apache.maven.plugin.DefaultPluginManager.addPlugin(DefaultPluginManager.java:287)
	at org.apache.maven.plugin.DefaultPluginManager.verifyVersionedPlugin(DefaultPluginManager.java:219)
	at org.apache.maven.plugin.DefaultPluginManager.verifyReportPlugin(DefaultPluginManager.java:801)
	at org.apache.maven.plugin.loader.DefaultPluginLoader.loadReportPlugin(DefaultPluginLoader.java:153)
	at org.apache.maven.lifecycle.binding.DefaultLifecycleBindingManager.getReportsForPlugin(DefaultLifecycleBindingManager.java:525)
	at org.apache.maven.lifecycle.binding.DefaultLifecycleBindingManager.getReportBindings(DefaultLifecycleBindingManager.java:443)
	at org.apache.maven.lifecycle.plan.DefaultBuildPlanner.addReportingLifecycleModifiers(DefaultBuildPlanner.java:268)
	at org.apache.maven.lifecycle.plan.DefaultBuildPlanner.constructBuildPlan_aroundBody0(DefaultBuildPlanner.java:118)
	at org.apache.maven.lifecycle.plan.DefaultBuildPlanner.constructBuildPlan_aroundBody1$advice(DefaultBuildPlanner.java:403)
	at org.apache.maven.lifecycle.plan.DefaultBuildPlanner.constructBuildPlan(DefaultBuildPlanner.java:1)
	at org.apache.maven.lifecycle.DefaultLifecycleExecutor.getLifecycleBindings(DefaultLifecycleExecutor.java:400)
	at org.apache.maven.lifecycle.DefaultLifecycleExecutor.executeTaskSegmentForProject(DefaultLifecycleExecutor.java:235)
	at org.apache.maven.lifecycle.DefaultLifecycleExecutor.executeTaskSegments(DefaultLifecycleExecutor.java:191)
	at org.apache.maven.lifecycle.DefaultLifecycleExecutor.execute(DefaultLifecycleExecutor.java:149)
	at org.apache.maven.DefaultMaven.execute_aroundBody0(DefaultMaven.java:223)
	at org.apache.maven.DefaultMaven.execute_aroundBody1$advice(DefaultMaven.java:303)
	at org.apache.maven.DefaultMaven.execute(DefaultMaven.java:1)
	at org.apache.maven.embedder.MavenEmbedder.execute_aroundBody2(MavenEmbedder.java:904)
	at org.apache.maven.embedder.MavenEmbedder.execute_aroundBody3$advice(MavenEmbedder.java:303)
	at org.apache.maven.embedder.MavenEmbedder.execute(MavenEmbedder.java:1)
	at org.apache.maven.cli.MavenCli.doMain(MavenCli.java:176)
	at org.apache.maven.cli.MavenCli.main(MavenCli.java:63)
	at sun.reflect.NativeMethodAccessorImpl.invoke0(Native Method)
	at sun.reflect.NativeMethodAccessorImpl.invoke(NativeMethodAccessorImpl.java:39)
	at sun.reflect.DelegatingMethodAccessorImpl.invoke(DelegatingMethodAccessorImpl.java:25)
	at java.lang.reflect.Method.invoke(Method.java:585)
	at org.codehaus.plexus.classworlds.launcher.Launcher.launchEnhanced(Launcher.java:289)
	at org.codehaus.plexus.classworlds.launcher.Launcher.launch(Launcher.java:229)
	at org.codehaus.plexus.classworlds.launcher.Launcher.mainWithExitCode(Launcher.java:408)
	at org.codehaus.plexus.classworlds.launcher.Launcher.main(Launcher.java:351)
	at org.apache.maven.it.Verifier.executeGoals(Verifier.java:1039)
	at org.apache.maven.it.Verifier.executeGoal(Verifier.java:894)
	at org.apache.maven.it.Verifier.executeGoal(Verifier.java:888)
	at org.apache.maven.integrationtests.MavenITmng3473PluginReportCrash.testitMNG3473(MavenITmng3473PluginReportCrash.java:42)
	at org.apache.maven.integrationtests.MavenITmng3473PluginReportCrash.testitMNG3473(MavenITmng3473PluginReportCrash.java:42)
	at sun.reflect.NativeMethodAccessorImpl.invoke0(Native Method)
	at sun.reflect.NativeMethodAccessorImpl.invoke(NativeMethodAccessorImpl.java:39)
	at sun.reflect.DelegatingMethodAccessorImpl.invoke(DelegatingMethodAccessorImpl.java:25)
	at java.lang.reflect.Method.invoke(Method.java:585)
	at junit.framework.TestCase.runTest(TestCase.java:154)
	at org.apache.maven.integrationtests.AbstractMavenIntegrationTestCase.runTest(AbstractMavenIntegrationTestCase.java:100)
	at junit.framework.TestCase.runBare(TestCase.java:127)
	at junit.framework.TestResult$1.protect(TestResult.java:106)
	at junit.framework.TestResult.runProtected(TestResult.java:124)
	at junit.framework.TestResult.run(TestResult.java:109)
	at junit.framework.TestCase.run(TestCase.java:118)
	at junit.framework.TestSuite.runTest(TestSuite.java:208)
	at junit.framework.TestSuite.run(TestSuite.java:203)
	at junit.framework.TestSuite.runTest(TestSuite.java:208)
	at junit.framework.TestSuite.run(TestSuite.java:203)
	at sun.reflect.NativeMethodAccessorImpl.invoke0(Native Method)
	at sun.reflect.NativeMethodAccessorImpl.invoke(NativeMethodAccessorImpl.java:39)
	at sun.reflect.DelegatingMethodAccessorImpl.invoke(DelegatingMethodAccessorImpl.java:25)
	at java.lang.reflect.Method.invoke(Method.java:585)
	at org.apache.maven.surefire.junit.JUnitTestSet.execute(JUnitTestSet.java:213)
	at org.apache.maven.surefire.suite.AbstractDirectoryTestSuite.executeTestSet(AbstractDirectoryTestSuite.java:138)
	at org.apache.maven.surefire.suite.AbstractDirectoryTestSuite.execute(AbstractDirectoryTestSuite.java:125)
	at org.apache.maven.surefire.Surefire.run(Surefire.java:132)
	at sun.reflect.NativeMethodAccessorImpl.invoke0(Native Method)
	at sun.reflect.NativeMethodAccessorImpl.invoke(NativeMethodAccessorImpl.java:39)
	at sun.reflect.DelegatingMethodAccessorImpl.invoke(DelegatingMethodAccessorImpl.java:25)
	at java.lang.reflect.Method.invoke(Method.java:585)
	at org.apache.maven.surefire.booter.SurefireBooter.runSuitesInProcess(SurefireBooter.java:290)
	at org.apache.maven.surefire.booter.SurefireBooter.main(SurefireBooter.java:818)

testit0112(org.apache.maven.integrationtests.MavenIT0112ExtensionsThatDragDependencies)  Time
elapsed: 8.062 sec  <<< ERROR!
org.apache.maven.it.VerificationException: Exit code was non-zero: 100; log = 
+ Error stacktraces are turned on.
[INFO] Searching repository for plugin with prefix: 'clean'.
[INFO] Attempting to resolve a version for plugin: org.apache.maven.plugins:maven-project-info-reports-plugin
using meta-version: LATEST
[INFO] Using version: 2.1-20080705.042846-34 of plugin: org.apache.maven.plugins:maven-project-info-reports-plugin
[WARNING] Attempting to build MavenProject instance for Artifact (org.apache.maven.plugins:maven-project-info-reports-plugin:2.1-20080705.042846-34)
of type: maven-plugin; constructing POM artifact instead.
[INFO] Using mirror: Nexus for repository: central
(mirror url: http://localhost:8081/nexus/content/groups/public)
url = http://localhost:8081/nexus/content/groups/public
Downloading: http://localhost:8081/nexus/content/groups/public/commons-io/commons-io/1.4/commons-io-1.4.pom
12K downloaded
---------------------------------------------------
constituent[0]: http://ci.sonatype.org/job/Maven-2.1.x-ITs/ws/maven-core-its/target/maven-installation/apache-maven-2.1-SNAPSHOT/lib/plexus-interpolation-1.0.jar

constituent[1]: http://ci.sonatype.org/job/Maven-2.1.x-ITs/ws/maven-core-its/target/maven-installation/apache-maven-2.1-SNAPSHOT/lib/commons-cli-1.0.jar

constituent[2]: http://ci.sonatype.org/job/Maven-2.1.x-ITs/ws/maven-core-its/target/maven-installation/apache-maven-2.1-SNAPSHOT/lib/plexus-container-default-1.0-alpha-48.jar

constituent[3]: http://ci.sonatype.org/job/Maven-2.1.x-ITs/ws/maven-core-its/target/maven-installation/apache-maven-2.1-SNAPSHOT/lib/maven-distribution-2.1-SNAPSHOT.jar

constituent[4]: http://ci.sonatype.org/job/Maven-2.1.x-ITs/ws/maven-core-its/target/maven-installation/apache-maven-2.1-SNAPSHOT/lib/maven-embedder-2.1-SNAPSHOT.jar

constituent[5]: http://ci.sonatype.org/job/Maven-2.1.x-ITs/ws/maven-core-its/target/maven-installation/apache-maven-2.1-SNAPSHOT/lib/nekohtml-1.9.6.2.jar

constituent[6]: http://ci.sonatype.org/job/Maven-2.1.x-ITs/ws/maven-core-its/target/maven-installation/apache-maven-2.1-SNAPSHOT/lib/commons-logging-api-1.1.jar

constituent[7]: http://ci.sonatype.org/job/Maven-2.1.x-ITs/ws/maven-core-its/target/maven-installation/apache-maven-2.1-SNAPSHOT/lib/maven-profile-2.1-SNAPSHOT.jar

constituent[8]: http://ci.sonatype.org/job/Maven-2.1.x-ITs/ws/maven-core-its/target/maven-installation/apache-maven-2.1-SNAPSHOT/lib/wagon-provider-api-1.0-beta-3.jar

constituent[9]: http://ci.sonatype.org/job/Maven-2.1.x-ITs/ws/maven-core-its/target/maven-installation/apache-maven-2.1-SNAPSHOT/lib/maven-core-2.1-SNAPSHOT.jar

constituent[10]: http://ci.sonatype.org/job/Maven-2.1.x-ITs/ws/maven-core-its/target/maven-installation/apache-maven-2.1-SNAPSHOT/lib/doxia-sink-api-1.0-alpha-9.jar

constituent[11]: http://ci.sonatype.org/job/Maven-2.1.x-ITs/ws/maven-core-its/target/maven-installation/apache-maven-2.1-SNAPSHOT/lib/aspectjrt-1.5.3.jar

constituent[12]: http://ci.sonatype.org/job/Maven-2.1.x-ITs/ws/maven-core-its/target/maven-installation/apache-maven-2.1-SNAPSHOT/lib/wagon-ssh-1.0-beta-3.jar

constituent[13]: http://ci.sonatype.org/job/Maven-2.1.x-ITs/ws/maven-core-its/target/maven-installation/apache-maven-2.1-SNAPSHOT/lib/maven-model-2.1-SNAPSHOT.jar

constituent[14]: http://ci.sonatype.org/job/Maven-2.1.x-ITs/ws/maven-core-its/target/maven-installation/apache-maven-2.1-SNAPSHOT/lib/maven-project-2.1-SNAPSHOT.jar

constituent[15]: http://ci.sonatype.org/job/Maven-2.1.x-ITs/ws/maven-core-its/target/maven-installation/apache-maven-2.1-SNAPSHOT/lib/wagon-http-shared-1.0-beta-3.jar

constituent[16]: http://ci.sonatype.org/job/Maven-2.1.x-ITs/ws/maven-core-its/target/maven-installation/apache-maven-2.1-SNAPSHOT/lib/xbean-reflect-3.4.jar

constituent[17]: http://ci.sonatype.org/job/Maven-2.1.x-ITs/ws/maven-core-its/target/maven-installation/apache-maven-2.1-SNAPSHOT/lib/maven-lifecycle-2.1-SNAPSHOT.jar

constituent[18]: http://ci.sonatype.org/job/Maven-2.1.x-ITs/ws/maven-core-its/target/maven-installation/apache-maven-2.1-SNAPSHOT/lib/plexus-interactivity-api-1.0-alpha-6.jar

constituent[19]: http://ci.sonatype.org/job/Maven-2.1.x-ITs/ws/maven-core-its/target/maven-installation/apache-maven-2.1-SNAPSHOT/lib/xercesMinimal-1.9.6.2.jar

constituent[20]: http://ci.sonatype.org/job/Maven-2.1.x-ITs/ws/maven-core-its/target/maven-installation/apache-maven-2.1-SNAPSHOT/lib/maven-reporting-api-2.1-SNAPSHOT.jar

constituent[21]: http://ci.sonatype.org/job/Maven-2.1.x-ITs/ws/maven-core-its/target/maven-installation/apache-maven-2.1-SNAPSHOT/lib/wagon-ssh-common-1.0-beta-3.jar

constituent[22]: http://ci.sonatype.org/job/Maven-2.1.x-ITs/ws/maven-core-its/target/maven-installation/apache-maven-2.1-SNAPSHOT/lib/jsch-0.1.38.jar

constituent[23]: http://ci.sonatype.org/job/Maven-2.1.x-ITs/ws/maven-core-its/target/maven-installation/apache-maven-2.1-SNAPSHOT/lib/maven-toolchain-2.1-SNAPSHOT.jar

constituent[24]: http://ci.sonatype.org/job/Maven-2.1.x-ITs/ws/maven-core-its/target/maven-installation/apache-maven-2.1-SNAPSHOT/lib/wagon-ssh-external-1.0-beta-3.jar

constituent[25]: http://ci.sonatype.org/job/Maven-2.1.x-ITs/ws/maven-core-its/target/maven-installation/apache-maven-2.1-SNAPSHOT/lib/plexus-utils-1.5.4.jar

constituent[26]: http://ci.sonatype.org/job/Maven-2.1.x-ITs/ws/maven-core-its/target/maven-installation/apache-maven-2.1-SNAPSHOT/lib/wagon-file-1.0-beta-3.jar

constituent[27]: http://ci.sonatype.org/job/Maven-2.1.x-ITs/ws/maven-core-its/target/maven-installation/apache-maven-2.1-SNAPSHOT/lib/maven-plugin-api-2.1-SNAPSHOT.jar

constituent[28]: http://ci.sonatype.org/job/Maven-2.1.x-ITs/ws/maven-core-its/target/maven-installation/apache-maven-2.1-SNAPSHOT/lib/log4j-1.2.12.jar

constituent[29]: http://ci.sonatype.org/job/Maven-2.1.x-ITs/ws/maven-core-its/target/maven-installation/apache-maven-2.1-SNAPSHOT/lib/wagon-http-lightweight-1.0-beta-3.jar

constituent[30]: http://ci.sonatype.org/job/Maven-2.1.x-ITs/ws/maven-core-its/target/maven-installation/apache-maven-2.1-SNAPSHOT/lib/maven-artifact-3.0-20080704.144647-104.jar

constituent[31]: http://ci.sonatype.org/job/Maven-2.1.x-ITs/ws/maven-core-its/target/maven-installation/apache-maven-2.1-SNAPSHOT/lib/maven-workspace-2.1-SNAPSHOT.jar

---------------------------------------------------
java.lang.NullPointerException
	at org.apache.maven.wagon.observers.ChecksumObserver.transferStarted(ChecksumObserver.java:68)
	at org.apache.maven.wagon.events.TransferEventSupport.fireTransferStarted(TransferEventSupport.java:106)
	at org.apache.maven.wagon.AbstractWagon.fireGetStarted(AbstractWagon.java:528)
	at org.apache.maven.wagon.AbstractWagon.getTransfer(AbstractWagon.java:293)
	at org.apache.maven.wagon.AbstractWagon.getTransfer(AbstractWagon.java:274)
	at org.apache.maven.wagon.StreamWagon.getIfNewer(StreamWagon.java:97)
	at org.apache.maven.wagon.StreamWagon.get(StreamWagon.java:61)
	at org.apache.maven.artifact.manager.DefaultWagonManager.verifyChecksum(DefaultWagonManager.java:740)
	at org.apache.maven.artifact.manager.DefaultWagonManager.getRemoteFile(DefaultWagonManager.java:580)
	at org.apache.maven.artifact.manager.DefaultWagonManager.getArtifact(DefaultWagonManager.java:424)
	at org.apache.maven.artifact.manager.DefaultWagonManager.getArtifact(DefaultWagonManager.java:341)
	at org.apache.maven.artifact.resolver.DefaultArtifactResolver.resolve(DefaultArtifactResolver.java:167)
	at org.apache.maven.artifact.resolver.DefaultArtifactResolver.resolve(DefaultArtifactResolver.java:82)
	at org.apache.maven.project.DefaultMavenProjectBuilder.findModelFromRepository(DefaultMavenProjectBuilder.java:555)
	at org.apache.maven.project.DefaultMavenProjectBuilder.buildFromRepository(DefaultMavenProjectBuilder.java:236)
	at org.apache.maven.project.artifact.MavenMetadataSource.retrieve(MavenMetadataSource.java:132)
	at org.apache.maven.artifact.resolver.DefaultArtifactCollector.recurse(DefaultArtifactCollector.java:511)
	at org.apache.maven.artifact.resolver.DefaultArtifactCollector.recurse(DefaultArtifactCollector.java:541)
	at org.apache.maven.artifact.resolver.DefaultArtifactCollector.collect(DefaultArtifactCollector.java:132)
	at org.apache.maven.artifact.resolver.DefaultArtifactResolver.resolveTransitively(DefaultArtifactResolver.java:347)
	at org.apache.maven.artifact.resolver.DefaultArtifactResolver.resolveTransitively(DefaultArtifactResolver.java:321)
	at org.apache.maven.artifact.resolver.DefaultArtifactResolver.resolveTransitively(DefaultArtifactResolver.java:289)
	at org.apache.maven.plugin.DefaultPluginManager.getPluginArtifacts(DefaultPluginManager.java:446)
	at org.apache.maven.plugin.DefaultPluginManager.addPlugin(DefaultPluginManager.java:287)
	at org.apache.maven.plugin.DefaultPluginManager.verifyVersionedPlugin(DefaultPluginManager.java:219)
	at org.apache.maven.plugin.DefaultPluginManager.verifyPlugin(DefaultPluginManager.java:194)
	at org.apache.maven.plugin.loader.DefaultPluginLoader.loadPlugin(DefaultPluginLoader.java:79)
	at org.apache.maven.plugin.loader.DefaultPluginLoader.loadPlugin(DefaultPluginLoader.java:52)
	at org.apache.maven.lifecycle.DefaultLifecycleExecutor.getMojoDescriptorForDirectInvocation(DefaultLifecycleExecutor.java:856)
	at org.apache.maven.lifecycle.DefaultLifecycleExecutor.isTaskValid(DefaultLifecycleExecutor.java:678)
	at org.apache.maven.DefaultMaven.execute_aroundBody0(DefaultMaven.java:194)
	at org.apache.maven.DefaultMaven.execute_aroundBody1$advice(DefaultMaven.java:303)
	at org.apache.maven.DefaultMaven.execute(DefaultMaven.java:1)
	at org.apache.maven.embedder.MavenEmbedder.execute_aroundBody2(MavenEmbedder.java:904)
	at org.apache.maven.embedder.MavenEmbedder.execute_aroundBody3$advice(MavenEmbedder.java:303)
	at org.apache.maven.embedder.MavenEmbedder.execute(MavenEmbedder.java:1)
	at org.apache.maven.cli.MavenCli.doMain(MavenCli.java:176)
	at org.apache.maven.cli.MavenCli.main(MavenCli.java:63)
	at sun.reflect.NativeMethodAccessorImpl.invoke0(Native Method)
	at sun.reflect.NativeMethodAccessorImpl.invoke(NativeMethodAccessorImpl.java:39)
	at sun.reflect.DelegatingMethodAccessorImpl.invoke(DelegatingMethodAccessorImpl.java:25)
	at java.lang.reflect.Method.invoke(Method.java:585)
	at org.codehaus.plexus.classworlds.launcher.Launcher.launchEnhanced(Launcher.java:289)
	at org.codehaus.plexus.classworlds.launcher.Launcher.launch(Launcher.java:229)
	at org.codehaus.plexus.classworlds.launcher.Launcher.mainWithExitCode(Launcher.java:408)
	at org.codehaus.plexus.classworlds.launcher.Launcher.main(Launcher.java:351)
	at org.apache.maven.it.Verifier.executeGoals(Verifier.java:1039)
	at org.apache.maven.it.Verifier.executeGoal(Verifier.java:894)
	at org.apache.maven.it.Verifier.executeGoal(Verifier.java:888)
	at org.apache.maven.integrationtests.MavenIT0112ExtensionsThatDragDependencies.testit0112(MavenIT0112ExtensionsThatDragDependencies.java:50)
	at org.apache.maven.integrationtests.MavenIT0112ExtensionsThatDragDependencies.testit0112(MavenIT0112ExtensionsThatDragDependencies.java:50)
	at sun.reflect.NativeMethodAccessorImpl.invoke0(Native Method)
	at sun.reflect.NativeMethodAccessorImpl.invoke(NativeMethodAccessorImpl.java:39)
	at sun.reflect.DelegatingMethodAccessorImpl.invoke(DelegatingMethodAccessorImpl.java:25)
	at java.lang.reflect.Method.invoke(Method.java:585)
	at junit.framework.TestCase.runTest(TestCase.java:154)
	at org.apache.maven.integrationtests.AbstractMavenIntegrationTestCase.runTest(AbstractMavenIntegrationTestCase.java:100)
	at junit.framework.TestCase.runBare(TestCase.java:127)
	at junit.framework.TestResult$1.protect(TestResult.java:106)
	at junit.framework.TestResult.runProtected(TestResult.java:124)
	at junit.framework.TestResult.run(TestResult.java:109)
	at junit.framework.TestCase.run(TestCase.java:118)
	at junit.framework.TestSuite.runTest(TestSuite.java:208)
	at junit.framework.TestSuite.run(TestSuite.java:203)
	at junit.framework.TestSuite.runTest(TestSuite.java:208)
	at junit.framework.TestSuite.run(TestSuite.java:203)
	at sun.reflect.NativeMethodAccessorImpl.invoke0(Native Method)
	at sun.reflect.NativeMethodAccessorImpl.invoke(NativeMethodAccessorImpl.java:39)
	at sun.reflect.DelegatingMethodAccessorImpl.invoke(DelegatingMethodAccessorImpl.java:25)
	at java.lang.reflect.Method.invoke(Method.java:585)
	at org.apache.maven.surefire.junit.JUnitTestSet.execute(JUnitTestSet.java:213)
	at org.apache.maven.surefire.suite.AbstractDirectoryTestSuite.executeTestSet(AbstractDirectoryTestSuite.java:138)
	at org.apache.maven.surefire.suite.AbstractDirectoryTestSuite.execute(AbstractDirectoryTestSuite.java:125)
	at org.apache.maven.surefire.Surefire.run(Surefire.java:132)
	at sun.reflect.NativeMethodAccessorImpl.invoke0(Native Method)
	at sun.reflect.NativeMethodAccessorImpl.invoke(NativeMethodAccessorImpl.java:39)
	at sun.reflect.DelegatingMethodAccessorImpl.invoke(DelegatingMethodAccessorImpl.java:25)
	at java.lang.reflect.Method.invoke(Method.java:585)
	at org.apache.maven.surefire.booter.SurefireBooter.runSuitesInProcess(SurefireBooter.java:290)
	at org.apache.maven.surefire.booter.SurefireBooter.main(SurefireBooter.java:818)


Results :

Tests in error: 
  testitMNG3473(org.apache.maven.integrationtests.MavenITmng3473PluginReportCrash)
  testit0112(org.apache.maven.integrationtests.MavenIT0112ExtensionsThatDragDependencies)

Tests run: 165, Failures: 0, Errors: 2, Skipped: 0

[INFO] ------------------------------------------------------------------------
[ERROR] BUILD FAILURE
[INFO] ------------------------------------------------------------------------
[INFO] There are test failures.
[INFO] ------------------------------------------------------------------------
[INFO] Trace
org.apache.maven.BuildFailureException: There are test failures.
	at org.apache.maven.lifecycle.DefaultLifecycleExecutor.executeGoals(DefaultLifecycleExecutor.java:579)
	at org.apache.maven.lifecycle.DefaultLifecycleExecutor.executeGoalWithLifecycle(DefaultLifecycleExecutor.java:499)
	at org.apache.maven.lifecycle.DefaultLifecycleExecutor.executeGoal(DefaultLifecycleExecutor.java:478)
	at org.apache.maven.lifecycle.DefaultLifecycleExecutor.executeGoalAndHandleFailures(DefaultLifecycleExecutor.java:330)
	at org.apache.maven.lifecycle.DefaultLifecycleExecutor.executeTaskSegments(DefaultLifecycleExecutor.java:291)
	at org.apache.maven.lifecycle.DefaultLifecycleExecutor.execute(DefaultLifecycleExecutor.java:142)
	at org.apache.maven.DefaultMaven.doExecute(DefaultMaven.java:336)
	at org.apache.maven.DefaultMaven.execute(DefaultMaven.java:129)
	at org.apache.maven.cli.MavenCli.main(MavenCli.java:287)
	at sun.reflect.NativeMethodAccessorImpl.invoke0(Native Method)
	at sun.reflect.NativeMethodAccessorImpl.invoke(NativeMethodAccessorImpl.java:39)
	at sun.reflect.DelegatingMethodAccessorImpl.invoke(DelegatingMethodAccessorImpl.java:25)
	at java.lang.reflect.Method.invoke(Method.java:585)
	at org.codehaus.classworlds.Launcher.launchEnhanced(Launcher.java:315)
	at org.codehaus.classworlds.Launcher.launch(Launcher.java:255)
	at org.codehaus.classworlds.Launcher.mainWithExitCode(Launcher.java:430)
	at org.codehaus.classworlds.Launcher.main(Launcher.java:375)
Caused by: org.apache.maven.plugin.MojoFailureException: There are test failures.
	at org.apache.maven.plugin.surefire.SurefirePlugin.execute(SurefirePlugin.java:425)
	at org.apache.maven.plugin.DefaultPluginManager.executeMojo(DefaultPluginManager.java:451)
	at org.apache.maven.lifecycle.DefaultLifecycleExecutor.executeGoals(DefaultLifecycleExecutor.java:558)
	... 16 more
[INFO] ------------------------------------------------------------------------
[INFO] Total time: 13 minutes 24 seconds
[INFO] Finished at: Sun Jul 06 11:37:25 CDT 2008
[INFO] Final Memory: 36M/424M
[INFO] ------------------------------------------------------------------------


Mime
View raw message