maven-notifications mailing list archives

Site index · List index
Message view « Date » · « Thread »
Top « Date » · « Thread »
From Hudson <Hud...@sonatype.org>
Subject Build failed in Hudson: Maven-Plugins » Maven Eclipse Plugin #81
Date Sat, 05 Jul 2008 04:24:12 GMT
See http://ci.sonatype.org/job/Maven-Plugins/org.apache.maven.plugins$maven-eclipse-plugin/81/changes

------------------------------------------
[...truncated 135 lines...]

Using target/it-build-target and target/it-build-target/classes to build IT version of plugin
*** Running test builds; output will be directed to: target/surefire-reports/build-output

Using target/it-build-target and target/it-build-target/classes to build IT version of plugin
*** Running test builds; output will be directed to: target/surefire-reports/build-output

Using target/it-build-target and target/it-build-target/classes to build IT version of plugin
*** Running test builds; output will be directed to: target/surefire-reports/build-output

Using target/it-build-target and target/it-build-target/classes to build IT version of plugin
*** Running test builds; output will be directed to: target/surefire-reports/build-output

Using target/it-build-target and target/it-build-target/classes to build IT version of plugin
*** Running test builds; output will be directed to: target/surefire-reports/build-output

Using target/it-build-target and target/it-build-target/classes to build IT version of plugin
*** Running test builds; output will be directed to: target/surefire-reports/build-output

Using target/it-build-target and target/it-build-target/classes to build IT version of plugin
*** Running test builds; output will be directed to: target/surefire-reports/build-output

Using target/it-build-target and target/it-build-target/classes to build IT version of plugin
*** Running test builds; output will be directed to: target/surefire-reports/build-output

Using target/it-build-target and target/it-build-target/classes to build IT version of plugin
*** Running test builds; output will be directed to: target/surefire-reports/build-output

Using target/it-build-target and target/it-build-target/classes to build IT version of plugin
*** Running test builds; output will be directed to: target/surefire-reports/build-output

Using target/it-build-target and target/it-build-target/classes to build IT version of plugin
*** Running test builds; output will be directed to: target/surefire-reports/build-output

Using target/it-build-target and target/it-build-target/classes to build IT version of plugin
*** Running test builds; output will be directed to: target/surefire-reports/build-output

Using target/it-build-target and target/it-build-target/classes to build IT version of plugin
*** Running test builds; output will be directed to: target/surefire-reports/build-output

Using target/it-build-target and target/it-build-target/classes to build IT version of plugin
*** Running test builds; output will be directed to: target/surefire-reports/build-output

Using target/it-build-target and target/it-build-target/classes to build IT version of plugin
*** Running test builds; output will be directed to: target/surefire-reports/build-output

Using target/it-build-target and target/it-build-target/classes to build IT version of plugin
*** Running test builds; output will be directed to: target/surefire-reports/build-output

Using target/it-build-target and target/it-build-target/classes to build IT version of plugin
*** Running test builds; output will be directed to: target/surefire-reports/build-output

Using target/it-build-target and target/it-build-target/classes to build IT version of plugin
*** Running test builds; output will be directed to: target/surefire-reports/build-output

Using target/it-build-target and target/it-build-target/classes to build IT version of plugin
*** Running test builds; output will be directed to: target/surefire-reports/build-output

Using target/it-build-target and target/it-build-target/classes to build IT version of plugin
*** Running test builds; output will be directed to: target/surefire-reports/build-output

Using target/it-build-target and target/it-build-target/classes to build IT version of plugin
*** Running test builds; output will be directed to: target/surefire-reports/build-output

Using target/it-build-target and target/it-build-target/classes to build IT version of plugin
*** Running test builds; output will be directed to: target/surefire-reports/build-output

Using target/it-build-target and target/it-build-target/classes to build IT version of plugin
*** Running test builds; output will be directed to: target/surefire-reports/build-output

Using target/it-build-target and target/it-build-target/classes to build IT version of plugin
*** Running test builds; output will be directed to: target/surefire-reports/build-output

Using target/it-build-target and target/it-build-target/classes to build IT version of plugin
Tests run: 47, Failures: 0, Errors: 47, Skipped: 0, Time elapsed: 184.168 sec <<<
FAILURE!
Running org.apache.maven.plugin.eclipse.MakeArtifactsTest
Tests run: 5, Failures: 0, Errors: 0, Skipped: 0, Time elapsed: 0.026 sec
Running org.apache.maven.plugin.eclipse.AddMavenRepoMojoTest
Tests run: 1, Failures: 0, Errors: 0, Skipped: 0, Time elapsed: 0.735 sec
Running org.apache.maven.plugin.eclipse.EclipseToMavenTest
Tests run: 5, Failures: 0, Errors: 0, Skipped: 0, Time elapsed: 0.007 sec
Running org.apache.maven.plugin.eclipse.MyEclipsePluginTest
*** Running test builds; output will be directed to: target/surefire-reports/build-output

Using target/it-build-target and target/it-build-target/classes to build IT version of plugin
*** Running test builds; output will be directed to: target/surefire-reports/build-output

Using target/it-build-target and target/it-build-target/classes to build IT version of plugin
*** Running test builds; output will be directed to: target/surefire-reports/build-output

Using target/it-build-target and target/it-build-target/classes to build IT version of plugin
*** Running test builds; output will be directed to: target/surefire-reports/build-output

Using target/it-build-target and target/it-build-target/classes to build IT version of plugin
*** Running test builds; output will be directed to: target/surefire-reports/build-output

Using target/it-build-target and target/it-build-target/classes to build IT version of plugin
Tests run: 5, Failures: 0, Errors: 5, Skipped: 0, Time elapsed: 34.03 sec <<< FAILURE!
Running org.apache.maven.plugin.eclipse.writers.EclipseOSGiManifestWriterTest
Tests run: 3, Failures: 0, Errors: 0, Skipped: 0, Time elapsed: 0.006 sec
Running org.apache.maven.plugin.eclipse.writers.EclipseClasspathWriterUnitTest
[debug] Processing resource src/main/resources: output=target/classes; default output=target/classes
[debug] Processing resource src/test/resources: output=target/classes/test-resources; default
output=target/classes
[debug] Marking as special to prevent output folder nesting: src/test/resources (output=target/classes/test-resources)
[info] Creating maven-eclipse.xml Ant file to handle resources
[info] Creating external launcher file
Tests run: 2, Failures: 0, Errors: 0, Skipped: 0, Time elapsed: 1.079 sec
Running org.apache.maven.plugin.eclipse.RadPluginTest
*** Running test builds; output will be directed to: target/surefire-reports/build-output

Using target/it-build-target and target/it-build-target/classes to build IT version of plugin
*** Running test builds; output will be directed to: target/surefire-reports/build-output

Using target/it-build-target and target/it-build-target/classes to build IT version of plugin
*** Running test builds; output will be directed to: target/surefire-reports/build-output

Using target/it-build-target and target/it-build-target/classes to build IT version of plugin
*** Running test builds; output will be directed to: target/surefire-reports/build-output

Using target/it-build-target and target/it-build-target/classes to build IT version of plugin
*** Running test builds; output will be directed to: target/surefire-reports/build-output

Using target/it-build-target and target/it-build-target/classes to build IT version of plugin
*** Running test builds; output will be directed to: target/surefire-reports/build-output

*** Running test builds; output will be directed to: target/surefire-reports/build-output

Tests run: 7, Failures: 0, Errors: 7, Skipped: 0, Time elapsed: 190.483 sec <<< FAILURE!
Running org.apache.maven.plugin.eclipse.writers.testutils.TestEclipseWriterConfig
Tests run: 0, Failures: 0, Errors: 0, Skipped: 0, Time elapsed: 0.004 sec
Running org.apache.maven.plugin.eclipse.EclipsePluginUnitTest
[debug] testOutput toRelativeAndFixSeparator /tmp/EclipsePlugin.unitTest.1215211497176 , target/main-output
[debug] testOutput after toRelative : target/main-output
[debug] Processing resource dir: src/main/resources
[debug] Making relative and fixing separator: { /tmp/EclipsePlugin.unitTest.1215211497176,
/tmp/EclipsePlugin.unitTest.1215211497176/target/main-output, false }.
[debug] Adding eclipse source dir: { src/main/resources, target/main-output, true, true, null,
null }.
[debug] Processing resource dir: src/main/resources
[debug] Making relative and fixing separator: { /tmp/EclipsePlugin.unitTest.1215211497214,
/tmp/EclipsePlugin.unitTest.1215211497214/target/classes/main-output, false }.
[debug] Adding eclipse source dir: { src/main/resources, target/classes/main-output, true,
false, null, null }.
[debug] Processing resource dir: src/main/resources
[debug] Making relative and fixing separator: { /tmp/EclipsePlugin.unitTest.1215211497237,
/tmp/EclipsePlugin.unitTest.1215211497237/target/main-output, false }.
[debug] Adding eclipse source dir: { src/main/resources, target/main-output, true, false,
null, null }.
[debug] Processing resource dir: src/main/resources
[debug] Making relative and fixing separator: { /tmp/EclipsePlugin.unitTest.1215211497260,
/tmp/EclipsePlugin.unitTest.1215211497260/target/classes, false }.
[debug] Adding eclipse source dir: { src/main/resources, target/classes, true, false, null,
null }.
[debug] Processing resource dir: src/test/resources
[debug] Making relative and fixing separator: { /tmp/EclipsePlugin.unitTest.1215211497260,
/tmp/EclipsePlugin.unitTest.1215211497260/target/test-classes, false }.
[debug] Adding eclipse source dir: { src/test/resources, target/test-classes, true, false,
null, null }.
[debug] Processing resource dir: src/main/resources
[debug] Making relative and fixing separator: { /tmp/EclipsePlugin.unitTest.1215211498078,
/tmp/EclipsePlugin.unitTest.1215211498078/target/classes, false }.
[debug] Adding eclipse source dir: { src-main-resources, target/classes, true, false, null,
null }.
[debug] Processing resource dir: src/test/resources
[debug] Making relative and fixing separator: { /tmp/EclipsePlugin.unitTest.1215211498078,
/tmp/EclipsePlugin.unitTest.1215211498078/target/test-classes, false }.
[debug] Adding eclipse source dir: { src-test-resources, target/test-classes, true, false,
null, null }.
Tests run: 5, Failures: 0, Errors: 0, Skipped: 0, Time elapsed: 0.93 sec

Results :

Tests in error: 
  testModule1Project(org.apache.maven.plugin.eclipse.EclipsePluginMasterProjectTest)
  testModule1Classpath(org.apache.maven.plugin.eclipse.EclipsePluginMasterProjectTest)
  testModule1Wtpmodules(org.apache.maven.plugin.eclipse.EclipsePluginMasterProjectTest)
  testModule2Project(org.apache.maven.plugin.eclipse.EclipsePluginMasterProjectTest)
  testModule2Classpath(org.apache.maven.plugin.eclipse.EclipsePluginMasterProjectTest)
  testModule2Wtpmodules(org.apache.maven.plugin.eclipse.EclipsePluginMasterProjectTest)
  testWorkspace01(org.apache.maven.plugin.eclipse.EclipseWorkspaceTest)
  testWorkspace02(org.apache.maven.plugin.eclipse.EclipseWorkspaceTest)
  testProject01(org.apache.maven.plugin.eclipse.EclipsePluginTest)
  testProject02(org.apache.maven.plugin.eclipse.EclipsePluginTest)
  testProject03(org.apache.maven.plugin.eclipse.EclipsePluginTest)
  testProject04(org.apache.maven.plugin.eclipse.EclipsePluginTest)
  testProject05(org.apache.maven.plugin.eclipse.EclipsePluginTest)
  testProject06(org.apache.maven.plugin.eclipse.EclipsePluginTest)
  testProject07(org.apache.maven.plugin.eclipse.EclipsePluginTest)
  testProject08(org.apache.maven.plugin.eclipse.EclipsePluginTest)
  testProject09(org.apache.maven.plugin.eclipse.EclipsePluginTest)
  testProject10(org.apache.maven.plugin.eclipse.EclipsePluginTest)
  testProject11(org.apache.maven.plugin.eclipse.EclipsePluginTest)
  testProject12(org.apache.maven.plugin.eclipse.EclipsePluginTest)
  testProject13(org.apache.maven.plugin.eclipse.EclipsePluginTest)
  testProject14(org.apache.maven.plugin.eclipse.EclipsePluginTest)
  testProject15(org.apache.maven.plugin.eclipse.EclipsePluginTest)
  testProject16(org.apache.maven.plugin.eclipse.EclipsePluginTest)
  testProject17(org.apache.maven.plugin.eclipse.EclipsePluginTest)
  testProject18(org.apache.maven.plugin.eclipse.EclipsePluginTest)
  testProject19(org.apache.maven.plugin.eclipse.EclipsePluginTest)
  testProject20(org.apache.maven.plugin.eclipse.EclipsePluginTest)
  testProject21(org.apache.maven.plugin.eclipse.EclipsePluginTest)
  testProject22(org.apache.maven.plugin.eclipse.EclipsePluginTest)
  testProject23(org.apache.maven.plugin.eclipse.EclipsePluginTest)
  testProject24(org.apache.maven.plugin.eclipse.EclipsePluginTest)
  testProject25(org.apache.maven.plugin.eclipse.EclipsePluginTest)
  testProject26(org.apache.maven.plugin.eclipse.EclipsePluginTest)
  testProject27(org.apache.maven.plugin.eclipse.EclipsePluginTest)
  testProject28(org.apache.maven.plugin.eclipse.EclipsePluginTest)
  testProject29(org.apache.maven.plugin.eclipse.EclipsePluginTest)
  testProject30(org.apache.maven.plugin.eclipse.EclipsePluginTest)
  testProject31(org.apache.maven.plugin.eclipse.EclipsePluginTest)
  testProject32(org.apache.maven.plugin.eclipse.EclipsePluginTest)
  testProject33(org.apache.maven.plugin.eclipse.EclipsePluginTest)
  testProject34(org.apache.maven.plugin.eclipse.EclipsePluginTest)
  testProject35(org.apache.maven.plugin.eclipse.EclipsePluginTest)
  testProject36(org.apache.maven.plugin.eclipse.EclipsePluginTest)
  testProject37(org.apache.maven.plugin.eclipse.EclipsePluginTest)
  testMECLIPSE_56_encoding(org.apache.maven.plugin.eclipse.EclipsePluginTest)
  testProject38(org.apache.maven.plugin.eclipse.EclipsePluginTest)
  testProject39(org.apache.maven.plugin.eclipse.EclipsePluginTest)
  testProject40(org.apache.maven.plugin.eclipse.EclipsePluginTest)
  testProject41(org.apache.maven.plugin.eclipse.EclipsePluginTest)
  testProject42(org.apache.maven.plugin.eclipse.EclipsePluginTest)
  testProject43(org.apache.maven.plugin.eclipse.EclipsePluginTest)
  testProject44(org.apache.maven.plugin.eclipse.EclipsePluginTest)
  testProject45(org.apache.maven.plugin.eclipse.EclipsePluginTest)
  testJeeSimple(org.apache.maven.plugin.eclipse.EclipsePluginTest)
  testMyEclipseProject01(org.apache.maven.plugin.eclipse.MyEclipsePluginTest)
  testMyEclipseProject02(org.apache.maven.plugin.eclipse.MyEclipsePluginTest)
  testMyEclipseProject03(org.apache.maven.plugin.eclipse.MyEclipsePluginTest)
  testMyEclipseProject04(org.apache.maven.plugin.eclipse.MyEclipsePluginTest)
  testMyEclipseProject05(org.apache.maven.plugin.eclipse.MyEclipsePluginTest)
  testProject1(org.apache.maven.plugin.eclipse.RadPluginTest)
  testProject3(org.apache.maven.plugin.eclipse.RadPluginTest)
  testProject4(org.apache.maven.plugin.eclipse.RadPluginTest)
  testProject5(org.apache.maven.plugin.eclipse.RadPluginTest)
  testProject5_2(org.apache.maven.plugin.eclipse.RadPluginTest)
  testProject6(org.apache.maven.plugin.eclipse.RadPluginTest)
  testProject7(org.apache.maven.plugin.eclipse.RadPluginTest)

Tests run: 91, Failures: 0, Errors: 67, Skipped: 0

[ERROR] There are test failures.

Please refer to http://ci.sonatype.org/job/Maven-Plugins/org.apache.maven.plugins$maven-eclipse-plugin/ws/target/surefire-reports
 for the individual test results.
[HUDSON] Recording test results
[INFO] [jar:jar]
[INFO] Building jar: http://ci.sonatype.org/job/Maven-Plugins/org.apache.maven.plugins$maven-eclipse-plugin/ws/target/maven-eclipse-plugin-2.5.2-SNAPSHOT.jar

[INFO] [plugin:addPluginArtifactMetadata]
[INFO] [install:install]
[INFO] Installing http://ci.sonatype.org/job/Maven-Plugins/org.apache.maven.plugins$maven-eclipse-plugin/ws/target/maven-eclipse-plugin-2.5.2-SNAPSHOT.jar
 to /home/j2ee-hudson/repos/maven-plugins/org/apache/maven/plugins/maven-eclipse-plugin/2.5.2-SNAPSHOT/maven-eclipse-plugin-2.5.2-SNAPSHOT.jar
[INFO] [plugin:updateRegistry]
[INFO] [deploy:deploy]
altDeploymentRepository = null
[INFO] Retrieving previous build number from apache.snapshots
[WARNING] *** CHECKSUM FAILED - Invalid checksum file - RETRYING
[WARNING] *** CHECKSUM FAILED - Invalid checksum file - IGNORING
[INFO] repository metadata for: 'snapshot org.apache.maven.plugins:maven-eclipse-plugin:2.5.2-SNAPSHOT'
could not be found on repository: apache.snapshots, so will be created
Uploading: http://localhost:8081/nexus/content/repositories/maven.snapshots/org/apache/maven/plugins/maven-eclipse-plugin/2.5.2-SNAPSHOT/maven-eclipse-plugin-2.5.2-20080704.223132-1.jar
188K uploaded
[HUDSON] Archiving http://ci.sonatype.org/job/Maven-Plugins/org.apache.maven.plugins$maven-eclipse-plugin/ws/pom.xml
 to /home/j2ee-hudson/.hudson/jobs/Maven-Plugins/modules/org.apache.maven.plugins$maven-eclipse-plugin/builds/2008-07-04_17-31-22/archive/org.apache.maven.plugins/maven-eclipse-plugin/2.5.2-SNAPSHOT/pom.xml
[HUDSON] Archiving http://ci.sonatype.org/job/Maven-Plugins/org.apache.maven.plugins$maven-eclipse-plugin/ws/target/maven-eclipse-plugin-2.5.2-SNAPSHOT.jar
 to /home/j2ee-hudson/.hudson/jobs/Maven-Plugins/modules/org.apache.maven.plugins$maven-eclipse-plugin/builds/2008-07-04_17-31-22/archive/org.apache.maven.plugins/maven-eclipse-plugin/2.5.2-20080704.223132-1/maven-eclipse-plugin-2.5.2-SNAPSHOT.jar


Mime
View raw message