maven-notifications mailing list archives

Site index · List index
Message view « Date » · « Thread »
Top « Date » · « Thread »
From Hudson <Hud...@sonatype.org>
Subject Build failed in Hudson: Maven-Plugins » Maven IDEA Plugin #81
Date Sat, 05 Jul 2008 04:24:13 GMT
See http://ci.sonatype.org/job/Maven-Plugins/org.apache.maven.plugins$maven-idea-plugin/81/changes

------------------------------------------
[INFO] ------------------------------------------------------------------------
[INFO] Building Maven IDEA Plugin
[INFO]    task-segment: [clean, deploy]
[INFO] ------------------------------------------------------------------------
[INFO] [clean:clean]
[INFO] Deleting directory http://ci.sonatype.org/job/Maven-Plugins/org.apache.maven.plugins$maven-idea-plugin/ws/target

[INFO] [plugin:helpmojo {execution: generated-helpmojo}]
[INFO] Using 2 extractors.
[INFO] Applying extractor for language: java
[INFO] Extractor for language: java found 5 mojo descriptors.
[INFO] Applying extractor for language: bsh
[INFO] Extractor for language: bsh found 0 mojo descriptors.
[INFO] [plugin:descriptor]
[INFO] Using 2 extractors.
[INFO] Applying extractor for language: java
[INFO] Extractor for language: java found 6 mojo descriptors.
[INFO] Applying extractor for language: bsh
[INFO] Extractor for language: bsh found 0 mojo descriptors.
[INFO] [remote-resources:process {execution: default}]
[INFO] [resources:resources]
[INFO] Using default encoding to copy filtered resources.
[INFO] [compiler:compile]
[INFO] Compiling 9 source files to http://ci.sonatype.org/job/Maven-Plugins/org.apache.maven.plugins$maven-idea-plugin/ws/target/classes

[INFO] [resources:testResources]
[INFO] Using default encoding to copy filtered resources.
[INFO] [compiler:testCompile]
[INFO] Compiling 31 source files to http://ci.sonatype.org/job/Maven-Plugins/org.apache.maven.plugins$maven-idea-plugin/ws/target/test-classes

[INFO] [surefire:test]
[INFO] Surefire report directory: http://ci.sonatype.org/job/Maven-Plugins/org.apache.maven.plugins$maven-idea-plugin/ws/target/surefire-reports


-------------------------------------------------------
 T E S T S
-------------------------------------------------------
Running org.apache.maven.plugin.idea.IdeaCleanTest
Tests run: 1, Failures: 0, Errors: 0, Skipped: 0, Time elapsed: 0.681 sec
Running org.apache.maven.plugin.idea.IdeaProjectTest
[INFO] jdkName is not set, using [java version1.6.0_01] as default.
[INFO] jdkName is not set, using [java version1.6.0_01] as default.
[INFO] jdkName is not set, using [java version1.6.0_01] as default.
Tests run: 5, Failures: 0, Errors: 0, Skipped: 0, Time elapsed: 1.61 sec
Running org.apache.maven.plugin.idea.IdeaWorkspaceTest
Tests run: 9, Failures: 0, Errors: 0, Skipped: 0, Time elapsed: 1.872 sec
Running org.apache.maven.plugin.idea.IdeaTest
[INFO] jdkName is not set, using [java version1.6.0_01] as default.
[INFO] jdkName is not set, using [java version1.6.0_01] as default.
Tests run: 2, Failures: 0, Errors: 0, Skipped: 0, Time elapsed: 0.378 sec
Running org.apache.maven.plugin.idea.stubs.TestCounter
Tests run: 0, Failures: 0, Errors: 0, Skipped: 0, Time elapsed: 0.004 sec
Running org.apache.maven.plugin.idea.IdeaModuleTest
[WARNING] An error occurred during dependency resolution of the following artifact:

    org.apache.maven.plugin.test:plugin-test-1919

Caused by: required artifacts missing:
  javax.sql:jdbc-stdext:jar:2.0

for the artifact:
  org.apache.maven.plugin.test:plugin-test-19:jar:19

from the specified remote repositories:
  test-repo (file://http://ci.sonatype.org/job/Maven-Plugins/org.apache.maven.plugins$maven-idea-plugin/ws/src/test/remote-repo)


[WARNING] An error occurred during dependency resolution of the following artifact:

    org.apache.maven.plugin.test:plugin-test-2222

Caused by: required artifacts missing:
  javax.sql:jdbc-stdext:jar:2.0

for the artifact:
  org.apache.maven.plugin.test:plugin-test-22:jar:22

from the specified remote repositories:
  test-repo (file://http://ci.sonatype.org/job/Maven-Plugins/org.apache.maven.plugins$maven-idea-plugin/ws/src/test/remote-repo)


[WARNING] Unable to get resource from repository test-repo (file://http://ci.sonatype.org/job/Maven-Plugins/org.apache.maven.plugins$maven-idea-plugin/ws/src/test/remote-repo)

[INFO] artifact junit:junit: checking for updates from test-repo
Tests run: 15, Failures: 1, Errors: 0, Skipped: 0, Time elapsed: 2.556 sec <<< FAILURE!
Running org.apache.maven.plugin.idea.LibraryTest
Tests run: 4, Failures: 0, Errors: 0, Skipped: 0, Time elapsed: 0.005 sec
Running org.apache.maven.plugin.idea.IdeaMojoTestCase
Tests run: 1, Failures: 1, Errors: 0, Skipped: 0, Time elapsed: 0.006 sec <<< FAILURE!

Results :

Failed tests: 
  testEjbProjectWithModulesConfigurations(org.apache.maven.plugin.idea.IdeaModuleTest)
  testToRelative(org.apache.maven.plugin.idea.IdeaMojoTestCase)

Tests run: 37, Failures: 2, Errors: 0, Skipped: 0

[ERROR] There are test failures.

Please refer to http://ci.sonatype.org/job/Maven-Plugins/org.apache.maven.plugins$maven-idea-plugin/ws/target/surefire-reports
 for the individual test results.
[HUDSON] Recording test results
[INFO] [jar:jar]
[INFO] Building jar: http://ci.sonatype.org/job/Maven-Plugins/org.apache.maven.plugins$maven-idea-plugin/ws/target/maven-idea-plugin-2.2-SNAPSHOT.jar

[INFO] [plugin:addPluginArtifactMetadata]
[INFO] [install:install]
[INFO] Installing http://ci.sonatype.org/job/Maven-Plugins/org.apache.maven.plugins$maven-idea-plugin/ws/target/maven-idea-plugin-2.2-SNAPSHOT.jar
 to /home/j2ee-hudson/repos/maven-plugins/org/apache/maven/plugins/maven-idea-plugin/2.2-SNAPSHOT/maven-idea-plugin-2.2-SNAPSHOT.jar
[INFO] [plugin:updateRegistry]
[INFO] [deploy:deploy]
altDeploymentRepository = null
[INFO] Retrieving previous build number from apache.snapshots
[WARNING] *** CHECKSUM FAILED - Invalid checksum file - RETRYING
[WARNING] *** CHECKSUM FAILED - Invalid checksum file - IGNORING
[INFO] repository metadata for: 'snapshot org.apache.maven.plugins:maven-idea-plugin:2.2-SNAPSHOT'
could not be found on repository: apache.snapshots, so will be created
Uploading: http://localhost:8081/nexus/content/repositories/maven.snapshots/org/apache/maven/plugins/maven-idea-plugin/2.2-SNAPSHOT/maven-idea-plugin-2.2-20080704.223132-1.jar
47K uploaded
[HUDSON] Archiving http://ci.sonatype.org/job/Maven-Plugins/org.apache.maven.plugins$maven-idea-plugin/ws/pom.xml
 to /home/j2ee-hudson/.hudson/jobs/Maven-Plugins/modules/org.apache.maven.plugins$maven-idea-plugin/builds/2008-07-04_17-31-22/archive/org.apache.maven.plugins/maven-idea-plugin/2.2-SNAPSHOT/pom.xml
[HUDSON] Archiving http://ci.sonatype.org/job/Maven-Plugins/org.apache.maven.plugins$maven-idea-plugin/ws/target/maven-idea-plugin-2.2-SNAPSHOT.jar
 to /home/j2ee-hudson/.hudson/jobs/Maven-Plugins/modules/org.apache.maven.plugins$maven-idea-plugin/builds/2008-07-04_17-31-22/archive/org.apache.maven.plugins/maven-idea-plugin/2.2-20080704.223132-1/maven-idea-plugin-2.2-SNAPSHOT.jar


Mime
View raw message