maven-notifications mailing list archives

Site index · List index
Message view « Date » · « Thread »
Top « Date » · « Thread »
From Hudson <Hud...@sonatype.org>
Subject Build failed in Hudson: Maven-2.0.x-ITs #145
Date Fri, 04 Jul 2008 19:04:09 GMT
See http://ci.sonatype.org/job/Maven-2.0.x-ITs/145/changes

------------------------------------------
[...truncated 17833 lines...]
----------
1) org.mule:mule-foo:jar:1.0-SNAPSHOT
  Try downloading the file manually from the project website.
  Then, install it using the command: 
      mvn install:install-file -DgroupId=org.mule -DartifactId=mule-foo -Dversion=1.0-SNAPSHOT
-Dpackaging=jar -Dfile=/path/to/file
  Alternatively, if you host your own repository you can deploy the file there: 
      mvn deploy:deploy-file -DgroupId=org.mule -DartifactId=mule-foo -Dversion=1.0-SNAPSHOT
-Dpackaging=jar -Dfile=/path/to/file -Durl=[url] -DrepositoryId=[id]
  Path to dependency: 
  	1) org.mule:mule-wombat:jar:1.0-SNAPSHOT
  	2) org.mule:mule-bar:jar:1.0-SNAPSHOT
  	3) org.mule:mule-foo:jar:1.0-SNAPSHOT
----------
1 required artifact is missing.
for artifact: 
  org.mule:mule-wombat:jar:1.0-SNAPSHOT
from the specified remote repositories:
  example2-repo (file://http://ci.sonatype.org/job/Maven-2.0.x-ITs/ws/maven-core-its/target/it-working-folder/mng-3052depRepoAggregation/target/repo2),

  Nexus (http://localhost:8081/nexus/content/groups/public)
[INFO] ------------------------------------------------------------------------
[DEBUG] Trace
org.apache.maven.lifecycle.LifecycleExecutionException: Missing:
----------
1) org.mule:mule-foo:jar:1.0-SNAPSHOT
  Try downloading the file manually from the project website.
  Then, install it using the command: 
      mvn install:install-file -DgroupId=org.mule -DartifactId=mule-foo -Dversion=1.0-SNAPSHOT
-Dpackaging=jar -Dfile=/path/to/file
  Alternatively, if you host your own repository you can deploy the file there: 
      mvn deploy:deploy-file -DgroupId=org.mule -DartifactId=mule-foo -Dversion=1.0-SNAPSHOT
-Dpackaging=jar -Dfile=/path/to/file -Durl=[url] -DrepositoryId=[id]
  Path to dependency: 
  	1) org.mule:mule-wombat:jar:1.0-SNAPSHOT
  	2) org.mule:mule-bar:jar:1.0-SNAPSHOT
  	3) org.mule:mule-foo:jar:1.0-SNAPSHOT
----------
1 required artifact is missing.
for artifact: 
  org.mule:mule-wombat:jar:1.0-SNAPSHOT
from the specified remote repositories:
  example2-repo (file://http://ci.sonatype.org/job/Maven-2.0.x-ITs/ws/maven-core-its/target/it-working-folder/mng-3052depRepoAggregation/target/repo2),

  Nexus (http://localhost:8081/nexus/content/groups/public)
	at org.apache.maven.lifecycle.DefaultLifecycleExecutor.executeGoals(DefaultLifecycleExecutor.java:575)
	at org.apache.maven.lifecycle.DefaultLifecycleExecutor.executeGoalWithLifecycle(DefaultLifecycleExecutor.java:499)
	at org.apache.maven.lifecycle.DefaultLifecycleExecutor.executeGoal(DefaultLifecycleExecutor.java:478)
	at org.apache.maven.lifecycle.DefaultLifecycleExecutor.executeGoalAndHandleFailures(DefaultLifecycleExecutor.java:330)
	at org.apache.maven.lifecycle.DefaultLifecycleExecutor.executeTaskSegments(DefaultLifecycleExecutor.java:291)
	at org.apache.maven.lifecycle.DefaultLifecycleExecutor.execute(DefaultLifecycleExecutor.java:142)
	at org.apache.maven.DefaultMaven.doExecute(DefaultMaven.java:336)
	at org.apache.maven.DefaultMaven.execute(DefaultMaven.java:129)
	at org.apache.maven.cli.MavenCli.main(MavenCli.java:302)
	at sun.reflect.NativeMethodAccessorImpl.invoke0(Native Method)
	at sun.reflect.NativeMethodAccessorImpl.invoke(NativeMethodAccessorImpl.java:39)
	at sun.reflect.DelegatingMethodAccessorImpl.invoke(DelegatingMethodAccessorImpl.java:25)
	at java.lang.reflect.Method.invoke(Method.java:324)
	at org.codehaus.classworlds.Launcher.launchEnhanced(Launcher.java:315)
	at org.codehaus.classworlds.Launcher.launch(Launcher.java:255)
	at org.codehaus.classworlds.Launcher.mainWithExitCode(Launcher.java:430)
	at org.codehaus.classworlds.Launcher.main(Launcher.java:375)
Caused by: org.apache.maven.artifact.resolver.MultipleArtifactsNotFoundException: Missing:
----------
1) org.mule:mule-foo:jar:1.0-SNAPSHOT
  Try downloading the file manually from the project website.
  Then, install it using the command: 
      mvn install:install-file -DgroupId=org.mule -DartifactId=mule-foo -Dversion=1.0-SNAPSHOT
-Dpackaging=jar -Dfile=/path/to/file
  Alternatively, if you host your own repository you can deploy the file there: 
      mvn deploy:deploy-file -DgroupId=org.mule -DartifactId=mule-foo -Dversion=1.0-SNAPSHOT
-Dpackaging=jar -Dfile=/path/to/file -Durl=[url] -DrepositoryId=[id]
  Path to dependency: 
  	1) org.mule:mule-wombat:jar:1.0-SNAPSHOT
  	2) org.mule:mule-bar:jar:1.0-SNAPSHOT
  	3) org.mule:mule-foo:jar:1.0-SNAPSHOT
----------
1 required artifact is missing.
for artifact: 
  org.mule:mule-wombat:jar:1.0-SNAPSHOT
from the specified remote repositories:
  example2-repo (file://http://ci.sonatype.org/job/Maven-2.0.x-ITs/ws/maven-core-its/target/it-working-folder/mng-3052depRepoAggregation/target/repo2),

  Nexus (http://localhost:8081/nexus/content/groups/public)
	at org.apache.maven.artifact.resolver.DefaultArtifactResolver.resolveTransitively(DefaultArtifactResolver.java:324)
	at org.apache.maven.artifact.resolver.DefaultArtifactResolver.resolveTransitively(DefaultArtifactResolver.java:288)
	at org.apache.maven.plugin.DefaultPluginManager.resolveTransitiveDependencies(DefaultPluginManager.java:1415)
	at org.apache.maven.plugin.DefaultPluginManager.executeMojo(DefaultPluginManager.java:405)
	at org.apache.maven.lifecycle.DefaultLifecycleExecutor.executeGoals(DefaultLifecycleExecutor.java:558)
	... 16 more
[INFO] ------------------------------------------------------------------------
[INFO] Total time: 2 seconds
[INFO] Finished at: Fri Jul 04 13:49:55 CDT 2008
[INFO] Final Memory: 4M/8M
[INFO] ------------------------------------------------------------------------
	at org.apache.maven.it.Verifier.executeGoals(Verifier.java:1039)
	at org.apache.maven.it.Verifier.executeGoal(Verifier.java:894)
	at org.apache.maven.it.Verifier.executeGoal(Verifier.java:888)
	at org.apache.maven.integrationtests.MavenITmng3052DepRepoAggregationTest.testitMNG3052(MavenITmng3052DepRepoAggregationTest.java:124)
	at org.apache.maven.integrationtests.MavenITmng3052DepRepoAggregationTest.testitMNG3052(MavenITmng3052DepRepoAggregationTest.java:124)
	at sun.reflect.NativeMethodAccessorImpl.invoke0(Native Method)
	at sun.reflect.NativeMethodAccessorImpl.invoke(NativeMethodAccessorImpl.java:39)
	at sun.reflect.DelegatingMethodAccessorImpl.invoke(DelegatingMethodAccessorImpl.java:25)
	at java.lang.reflect.Method.invoke(Method.java:324)
	at junit.framework.TestCase.runTest(TestCase.java:154)
	at org.apache.maven.integrationtests.AbstractMavenIntegrationTestCase.runTest(AbstractMavenIntegrationTestCase.java:100)
	at junit.framework.TestCase.runBare(TestCase.java:127)
	at junit.framework.TestResult$1.protect(TestResult.java:106)
	at junit.framework.TestResult.runProtected(TestResult.java:124)
	at junit.framework.TestResult.run(TestResult.java:109)
	at junit.framework.TestCase.run(TestCase.java:118)
	at junit.framework.TestSuite.runTest(TestSuite.java:208)
	at junit.framework.TestSuite.run(TestSuite.java:203)
	at junit.framework.TestSuite.runTest(TestSuite.java:208)
	at junit.framework.TestSuite.run(TestSuite.java:203)
	at sun.reflect.NativeMethodAccessorImpl.invoke0(Native Method)
	at sun.reflect.NativeMethodAccessorImpl.invoke(NativeMethodAccessorImpl.java:39)
	at sun.reflect.DelegatingMethodAccessorImpl.invoke(DelegatingMethodAccessorImpl.java:25)
	at java.lang.reflect.Method.invoke(Method.java:324)
	at org.apache.maven.surefire.junit.JUnitTestSet.execute(JUnitTestSet.java:213)
	at org.apache.maven.surefire.suite.AbstractDirectoryTestSuite.executeTestSet(AbstractDirectoryTestSuite.java:138)
	at org.apache.maven.surefire.suite.AbstractDirectoryTestSuite.execute(AbstractDirectoryTestSuite.java:125)
	at org.apache.maven.surefire.Surefire.run(Surefire.java:132)
	at sun.reflect.NativeMethodAccessorImpl.invoke0(Native Method)
	at sun.reflect.NativeMethodAccessorImpl.invoke(NativeMethodAccessorImpl.java:39)
	at sun.reflect.DelegatingMethodAccessorImpl.invoke(DelegatingMethodAccessorImpl.java:25)
	at java.lang.reflect.Method.invoke(Method.java:324)
	at org.apache.maven.surefire.booter.SurefireBooter.runSuitesInProcess(SurefireBooter.java:290)
	at org.apache.maven.surefire.booter.SurefireBooter.main(SurefireBooter.java:818)

testitMNG2562(org.apache.maven.integrationtests.MavenITmng2562Timestamp)  Time elapsed: 3.155
sec  <<< ERROR!
org.apache.maven.it.VerificationException: Exit code was non-zero: 1; log = 
+ Error stacktraces are turned on.
[INFO] Scanning for projects...
[INFO] Searching repository for plugin with prefix: 'clean'.
[INFO] ------------------------------------------------------------------------
[INFO] Building Apache Maven: mng-2562-timestamp
[INFO]    task-segment: [clean:clean, verify]
[INFO] ------------------------------------------------------------------------
[INFO] [clean:clean]
[WARNING] Attempting to build MavenProject instance for Artifact (org.apache.maven.its.plugins:maven-it-plugin-project-interpolation:2.1-20080704.160153-36)
of type: maven-plugin; constructing POM artifact instead.
[INFO] [itproject-interpolation:verify-property {execution: default}]
[INFO] ------------------------------------------------------------------------
[ERROR] BUILD ERROR
[INFO] ------------------------------------------------------------------------
[INFO] Unresolved value: Name = timestamp, Value = ${build.timestamp}
[INFO] ------------------------------------------------------------------------
[INFO] Trace
org.apache.maven.lifecycle.LifecycleExecutionException: Unresolved value: Name = timestamp,
Value = ${build.timestamp}
	at org.apache.maven.lifecycle.DefaultLifecycleExecutor.executeGoals(DefaultLifecycleExecutor.java:583)
	at org.apache.maven.lifecycle.DefaultLifecycleExecutor.executeGoalWithLifecycle(DefaultLifecycleExecutor.java:499)
	at org.apache.maven.lifecycle.DefaultLifecycleExecutor.executeGoal(DefaultLifecycleExecutor.java:478)
	at org.apache.maven.lifecycle.DefaultLifecycleExecutor.executeGoalAndHandleFailures(DefaultLifecycleExecutor.java:330)
	at org.apache.maven.lifecycle.DefaultLifecycleExecutor.executeTaskSegments(DefaultLifecycleExecutor.java:291)
	at org.apache.maven.lifecycle.DefaultLifecycleExecutor.execute(DefaultLifecycleExecutor.java:142)
	at org.apache.maven.DefaultMaven.doExecute(DefaultMaven.java:336)
	at org.apache.maven.DefaultMaven.execute(DefaultMaven.java:129)
	at org.apache.maven.cli.MavenCli.main(MavenCli.java:302)
	at sun.reflect.NativeMethodAccessorImpl.invoke0(Native Method)
	at sun.reflect.NativeMethodAccessorImpl.invoke(NativeMethodAccessorImpl.java:39)
	at sun.reflect.DelegatingMethodAccessorImpl.invoke(DelegatingMethodAccessorImpl.java:25)
	at java.lang.reflect.Method.invoke(Method.java:324)
	at org.codehaus.classworlds.Launcher.launchEnhanced(Launcher.java:315)
	at org.codehaus.classworlds.Launcher.launch(Launcher.java:255)
	at org.codehaus.classworlds.Launcher.mainWithExitCode(Launcher.java:430)
	at org.codehaus.classworlds.Launcher.main(Launcher.java:375)
Caused by: org.apache.maven.plugin.MojoExecutionException: Unresolved value: Name = timestamp,
Value = ${build.timestamp}
	at org.apache.maven.plugin.coreit.PropertyInterpolationVerifierMojo.execute(PropertyInterpolationVerifierMojo.java:52)
	at org.apache.maven.plugin.DefaultPluginManager.executeMojo(DefaultPluginManager.java:451)
	at org.apache.maven.lifecycle.DefaultLifecycleExecutor.executeGoals(DefaultLifecycleExecutor.java:558)
	... 16 more
[INFO] ------------------------------------------------------------------------
[INFO] Total time: 2 seconds
[INFO] Finished at: Fri Jul 04 13:51:01 CDT 2008
[INFO] Final Memory: 4M/8M
[INFO] ------------------------------------------------------------------------
	at org.apache.maven.it.Verifier.executeGoals(Verifier.java:1039)
	at org.apache.maven.it.Verifier.executeGoal(Verifier.java:894)
	at org.apache.maven.it.Verifier.executeGoal(Verifier.java:888)
	at org.apache.maven.integrationtests.MavenITmng2562Timestamp.testitMNG2562(MavenITmng2562Timestamp.java:21)
	at org.apache.maven.integrationtests.MavenITmng2562Timestamp.testitMNG2562(MavenITmng2562Timestamp.java:21)
	at sun.reflect.NativeMethodAccessorImpl.invoke0(Native Method)
	at sun.reflect.NativeMethodAccessorImpl.invoke(NativeMethodAccessorImpl.java:39)
	at sun.reflect.DelegatingMethodAccessorImpl.invoke(DelegatingMethodAccessorImpl.java:25)
	at java.lang.reflect.Method.invoke(Method.java:324)
	at junit.framework.TestCase.runTest(TestCase.java:154)
	at org.apache.maven.integrationtests.AbstractMavenIntegrationTestCase.runTest(AbstractMavenIntegrationTestCase.java:100)
	at junit.framework.TestCase.runBare(TestCase.java:127)
	at junit.framework.TestResult$1.protect(TestResult.java:106)
	at junit.framework.TestResult.runProtected(TestResult.java:124)
	at junit.framework.TestResult.run(TestResult.java:109)
	at junit.framework.TestCase.run(TestCase.java:118)
	at junit.framework.TestSuite.runTest(TestSuite.java:208)
	at junit.framework.TestSuite.run(TestSuite.java:203)
	at junit.framework.TestSuite.runTest(TestSuite.java:208)
	at junit.framework.TestSuite.run(TestSuite.java:203)
	at sun.reflect.NativeMethodAccessorImpl.invoke0(Native Method)
	at sun.reflect.NativeMethodAccessorImpl.invoke(NativeMethodAccessorImpl.java:39)
	at sun.reflect.DelegatingMethodAccessorImpl.invoke(DelegatingMethodAccessorImpl.java:25)
	at java.lang.reflect.Method.invoke(Method.java:324)
	at org.apache.maven.surefire.junit.JUnitTestSet.execute(JUnitTestSet.java:213)
	at org.apache.maven.surefire.suite.AbstractDirectoryTestSuite.executeTestSet(AbstractDirectoryTestSuite.java:138)
	at org.apache.maven.surefire.suite.AbstractDirectoryTestSuite.execute(AbstractDirectoryTestSuite.java:125)
	at org.apache.maven.surefire.Surefire.run(Surefire.java:132)
	at sun.reflect.NativeMethodAccessorImpl.invoke0(Native Method)
	at sun.reflect.NativeMethodAccessorImpl.invoke(NativeMethodAccessorImpl.java:39)
	at sun.reflect.DelegatingMethodAccessorImpl.invoke(DelegatingMethodAccessorImpl.java:25)
	at java.lang.reflect.Method.invoke(Method.java:324)
	at org.apache.maven.surefire.booter.SurefireBooter.runSuitesInProcess(SurefireBooter.java:290)
	at org.apache.maven.surefire.booter.SurefireBooter.main(SurefireBooter.java:818)


Results :

Tests in error: 
  testmng3581(org.apache.maven.integrationtests.MavenITmng3581PluginUsesWagonDependency)
  testitMNG3536(org.apache.maven.integrationtests.MavenITmng3536AppendedAbsolutePaths)
  testitMNG3535(org.apache.maven.integrationtests.MavenITmng3535SelfReferentialProperties)
  testitMNG3475(org.apache.maven.integrationtests.MavenITmng3475BaseAlignedDir)
  testitMNG3052(org.apache.maven.integrationtests.MavenITmng3052DepRepoAggregationTest)
  testitMNG2562(org.apache.maven.integrationtests.MavenITmng2562Timestamp)

Tests run: 165, Failures: 0, Errors: 6, Skipped: 0

[INFO] ------------------------------------------------------------------------
[ERROR] BUILD FAILURE
[INFO] ------------------------------------------------------------------------
[INFO] There are test failures.
[INFO] ------------------------------------------------------------------------
[DEBUG] Trace
org.apache.maven.BuildFailureException: There are test failures.
	at org.apache.maven.lifecycle.DefaultLifecycleExecutor.executeGoals(DefaultLifecycleExecutor.java:579)
	at org.apache.maven.lifecycle.DefaultLifecycleExecutor.executeGoalWithLifecycle(DefaultLifecycleExecutor.java:499)
	at org.apache.maven.lifecycle.DefaultLifecycleExecutor.executeGoal(DefaultLifecycleExecutor.java:478)
	at org.apache.maven.lifecycle.DefaultLifecycleExecutor.executeGoalAndHandleFailures(DefaultLifecycleExecutor.java:330)
	at org.apache.maven.lifecycle.DefaultLifecycleExecutor.executeTaskSegments(DefaultLifecycleExecutor.java:291)
	at org.apache.maven.lifecycle.DefaultLifecycleExecutor.execute(DefaultLifecycleExecutor.java:142)
	at org.apache.maven.DefaultMaven.doExecute(DefaultMaven.java:336)
	at org.apache.maven.DefaultMaven.execute(DefaultMaven.java:129)
	at org.apache.maven.cli.MavenCli.main(MavenCli.java:287)
	at sun.reflect.NativeMethodAccessorImpl.invoke0(Native Method)
	at sun.reflect.NativeMethodAccessorImpl.invoke(NativeMethodAccessorImpl.java:39)
	at sun.reflect.DelegatingMethodAccessorImpl.invoke(DelegatingMethodAccessorImpl.java:25)
	at java.lang.reflect.Method.invoke(Method.java:324)
	at org.codehaus.classworlds.Launcher.launchEnhanced(Launcher.java:315)
	at org.codehaus.classworlds.Launcher.launch(Launcher.java:255)
	at org.codehaus.classworlds.Launcher.mainWithExitCode(Launcher.java:430)
	at org.codehaus.classworlds.Launcher.main(Launcher.java:375)
Caused by: org.apache.maven.plugin.MojoFailureException: There are test failures.
	at org.apache.maven.plugin.surefire.SurefirePlugin.execute(SurefirePlugin.java:425)
	at org.apache.maven.plugin.DefaultPluginManager.executeMojo(DefaultPluginManager.java:451)
	at org.apache.maven.lifecycle.DefaultLifecycleExecutor.executeGoals(DefaultLifecycleExecutor.java:558)
	... 16 more
[INFO] ------------------------------------------------------------------------
[INFO] Total time: 20 minutes 29 seconds
[INFO] Finished at: Fri Jul 04 14:04:09 CDT 2008
[INFO] Final Memory: 18M/36M
[INFO] ------------------------------------------------------------------------


Mime
View raw message