maven-notifications mailing list archives

Site index · List index
Message view « Date » · « Thread »
Top « Date » · « Thread »
From Hudson <Hud...@sonatype.org>
Subject Build failed in Hudson: maven-artifact #43
Date Mon, 07 Jul 2008 03:46:46 GMT
See http://ci.sonatype.org/job/maven-artifact/43/changes

Changes:

[brett] rename the test wagon to something more appropriate now

[brett] [MARTIFACT-28] if an artifact has an md5 but no sha1, a null pointer exception results

------------------------------------------
[...truncated 7 lines...]
At revision 674391
[maven-artifact] $ /opt/maven/2.0/bin/mvn clean deploy -B -U -e -Dmaven.repo.local=/home/j2ee-hudson/repos/maven-artifact
-Pstrict -Dsurefire.useFile=false
+ Error stacktraces are turned on.
[INFO] Scanning for projects...
[INFO] ------------------------------------------------------------------------
[INFO] Building Maven Artifact
[INFO]    task-segment: [clean, deploy]
[INFO] ------------------------------------------------------------------------
[INFO] [clean:clean]
[INFO] Deleting directory http://ci.sonatype.org/job/maven-artifact/ws/maven-artifact/target

[INFO] [modello:java {execution: standard}]
[INFO] outputDirectory: http://ci.sonatype.org/job/maven-artifact/ws/maven-artifact/target/generated-sources/modello

[INFO] Generating current version: 1.0.0
[INFO] [modello:xpp3-reader {execution: standard}]
[INFO] outputDirectory: http://ci.sonatype.org/job/maven-artifact/ws/maven-artifact/target/generated-sources/modello

[INFO] Generating current version: 1.0.0
[INFO] [modello:xpp3-writer {execution: standard}]
[INFO] outputDirectory: http://ci.sonatype.org/job/maven-artifact/ws/maven-artifact/target/generated-sources/modello

[INFO] Generating current version: 1.0.0
[INFO] Setting property: classpath.resource.loader.class => 'org.codehaus.plexus.velocity.ContextClassLoaderResourceLoader'.
[INFO] Setting property: velocimacro.messages.on => 'false'.
[INFO] Setting property: resource.loader => 'classpath'.
[INFO] Setting property: resource.manager.logwhenfound => 'false'.
[INFO] [remote-resources:process {execution: default}]
[INFO] [resources:resources]
[INFO] Using default encoding to copy filtered resources.
[INFO] [compiler:compile]
[INFO] Compiling 134 source files to http://ci.sonatype.org/job/maven-artifact/ws/maven-artifact/target/classes

[INFO] [plexus:descriptor {execution: default}]
[INFO] Discovered 28 component descriptors(s)
[INFO] [resources:testResources]
[INFO] Using default encoding to copy filtered resources.
[INFO] [compiler:testCompile]
[INFO] Compiling 39 source files to http://ci.sonatype.org/job/maven-artifact/ws/maven-artifact/target/test-classes

[INFO] [surefire:test]
[INFO] Surefire report directory: http://ci.sonatype.org/job/maven-artifact/ws/maven-artifact/target/surefire-reports


-------------------------------------------------------
 T E S T S
-------------------------------------------------------
Running org.apache.maven.artifact.repository.DefaultArtifactRepositoryFactoryTest
Tests run: 4, Failures: 0, Errors: 0, Skipped: 0, Time elapsed: 0.499 sec
Running org.apache.maven.artifact.DefaultArtifactTest
Tests run: 10, Failures: 0, Errors: 0, Skipped: 0, Time elapsed: 0.035 sec
Running org.apache.maven.artifact.resolver.TestTransferListener
Tests run: 0, Failures: 0, Errors: 0, Skipped: 0, Time elapsed: 0.009 sec
Running org.apache.maven.artifact.versioning.ComparableVersionTest
Tests run: 6, Failures: 0, Errors: 0, Skipped: 0, Time elapsed: 0.035 sec
Running org.apache.maven.artifact.resolver.ArtifactUpdatePolicyTest
[INFO] snapshot org.apache.maven:o:0.0.1-SNAPSHOT: checking for updates from test
[INFO] snapshot org.apache.maven:o:0.0.1-SNAPSHOT: checking for updates from test
[INFO] snapshot org.apache.maven:o:0.0.1-SNAPSHOT: checking for updates from test
[INFO] snapshot org.apache.maven:o:0.0.1-SNAPSHOT: checking for updates from test
[INFO] snapshot org.apache.maven:o:0.0.1-SNAPSHOT: checking for updates from test
[INFO] snapshot org.apache.maven:o:0.0.1-SNAPSHOT: checking for updates from test
[INFO] snapshot org.apache.maven:o:0.0.1-SNAPSHOT: checking for updates from test
[INFO] snapshot org.apache.maven:o:0.0.1-SNAPSHOT: checking for updates from test
[INFO] snapshot org.apache.maven:o:0.0.1-SNAPSHOT: checking for updates from test
[INFO] snapshot org.apache.maven:o:0.0.1-SNAPSHOT: checking for updates from test
[INFO] snapshot org.apache.maven:j:0.0.1-SNAPSHOT: checking for updates from test
[INFO] snapshot org.apache.maven:a:0.0.0-SNAPSHOT: checking for updates from remote-repository1
[INFO] snapshot org.apache.maven:a:0.0.0-SNAPSHOT: checking for updates from remote-repository2
[WARNING] *** CHECKSUM FAILED - Error retrieving checksum file for org.apache.maven/jars/a-0.0.0-SNAPSHOT.jar
- IGNORING
Tests run: 13, Failures: 0, Errors: 0, Skipped: 0, Time elapsed: 0.616 sec
Running org.apache.maven.artifact.resolver.DefaultArtifactCollectorTest
Tests run: 29, Failures: 0, Errors: 0, Skipped: 0, Time elapsed: 0.495 sec
Running org.apache.maven.artifact.transform.DefaultClasspathTransformationTest
Tests run: 3, Failures: 0, Errors: 0, Skipped: 0, Time elapsed: 0.049 sec
Running org.apache.maven.artifact.repository.metadata.AbstractRepositoryMetadataTest
Tests run: 2, Failures: 0, Errors: 0, Skipped: 0, Time elapsed: 0.088 sec
Running org.apache.maven.artifact.versioning.VersionRangeTest
Tests run: 5, Failures: 0, Errors: 0, Skipped: 0, Time elapsed: 0.021 sec
Running org.apache.maven.artifact.resolver.conflict.NearestConflictResolverTest
Tests run: 4, Failures: 0, Errors: 0, Skipped: 0, Time elapsed: 0.049 sec
Running org.apache.maven.artifact.resolver.ArtifactResolverTest
[INFO] snapshot org.apache.maven:b:1.0-SNAPSHOT: checking for updates from test
[WARNING] *** CHECKSUM FAILED - Error retrieving checksum file for org/apache/maven/b/1.0-SNAPSHOT/b-1.0-SNAPSHOT.jar
- IGNORING
[INFO] snapshot org.apache.maven:i:1.0-SNAPSHOT: checking for updates from test
[WARNING] *** CHECKSUM FAILED - Error retrieving checksum file for org/apache/maven/i/1.0-SNAPSHOT/i-1.0-SNAPSHOT.jar
- IGNORING
[INFO] snapshot org.apache.maven:j:1.0-SNAPSHOT: checking for updates from test
[WARNING] *** CHECKSUM FAILED - Error retrieving checksum file for org/apache/maven/j/1.0-SNAPSHOT/j-1.0-SNAPSHOT.jar
- IGNORING
[INFO] snapshot org.apache.maven:l:1.0-SNAPSHOT: checking for updates from test
[INFO] snapshot org.apache.maven:l:1.0-SNAPSHOT: checking for updates from test
[WARNING] repository metadata for: 'snapshot org.apache.maven:l:1.0-SNAPSHOT' could not be
retrieved from repository: test due to an error: Unsupported Protocol: 'http': Cannot find
wagon which supports the requested protocol: http
[INFO] Repository 'test' will be blacklisted
[WARNING] *** CHECKSUM FAILED - Error retrieving checksum file for org/apache/maven/l/1.0-SNAPSHOT/l-1.0-SNAPSHOT.jar
- IGNORING
Tests run: 7, Failures: 0, Errors: 0, Skipped: 0, Time elapsed: 0.173 sec
Running org.apache.maven.artifact.resolver.conflict.NewestConflictResolverTest
Tests run: 4, Failures: 0, Errors: 0, Skipped: 0, Time elapsed: 0.054 sec
Running org.apache.maven.artifact.resolver.conflict.FarthestConflictResolverTest
Tests run: 4, Failures: 0, Errors: 0, Skipped: 0, Time elapsed: 0.052 sec
Running org.apache.maven.artifact.manager.DefaultWagonManagerTest
[INFO] Using mirror: a for repository: a
(mirror url: http://a)
[INFO] Using mirror: b for repository: b
(mirror url: http://b)
[INFO] Using mirror: a for repository: a
(mirror url: http://a)
[INFO] Using mirror: b for repository: b
(mirror url: http://b)
[INFO] Using mirror: c for repository: c
(mirror url: http://wildcard)
Uploading: path to noop://url

#
Transfer finished. 11 bytes copied in 0.0 seconds
[WARNING] *** CHECKSUM FAILED - Checksum failed on download: local = '8475b5cae2c9e7a2490a664535a5c22949d4702d';
remote = 'b7bb97d7d0b9244398d9b47296907f73313663e6' - RETRYING
Tests run: 18, Failures: 0, Errors: 0, Skipped: 0, Time elapsed: 0.287 sec
Running org.apache.maven.artifact.versioning.DefaultArtifactVersionTest
Tests run: 5, Failures: 0, Errors: 0, Skipped: 0, Time elapsed: 0.031 sec
Running org.apache.maven.artifact.resolver.conflict.DefaultGraphConflictResolverTest
Tests run: 3, Failures: 0, Errors: 0, Skipped: 0, Time elapsed: 0.036 sec
Running org.apache.maven.artifact.repository.metadata.DefaultRepositoryMetadataManagerTest
[INFO] EasyMock for interface org.apache.maven.artifact.repository.metadata.RepositoryMetadata
could not be found on repository: local, so will be created
[DEBUG] Reading resolution-state from: /tmp/DefaultRepositoryMetadataManager.test.1215402397334/path/to/resolver-status.properties
[DEBUG] Writing resolution-state to: /tmp/DefaultRepositoryMetadataManager.test.1215402397334/path/to/resolver-status.properties
[DEBUG] Searching for: local.metadata.xml.lastUpdated in touchfile.
[DEBUG] Reading resolution-state from: /tmp/DefaultRepositoryMetadataManager.test.1215402397334/path/to/resolver-status.properties
[DEBUG] Reading resolution-state from: /tmp/DefaultRepositoryMetadataManager.test.1215402399366/path/to/resolver-status.properties
[DEBUG] Writing resolution-state to: /tmp/DefaultRepositoryMetadataManager.test.1215402399366/path/to/resolver-status.properties
[DEBUG] Searching for: local.metadata.xml.lastUpdated in touchfile.
[DEBUG] Reading resolution-state from: /tmp/DefaultRepositoryMetadataManager.test.1215402399366/path/to/resolver-status.properties
[DEBUG] Reading resolution-state from: /tmp/DefaultRepositoryMetadataManager.test.1215402401394/path/to/resolver-status.properties
[DEBUG] Writing resolution-state to: /tmp/DefaultRepositoryMetadataManager.test.1215402401394/path/to/resolver-status.properties
[DEBUG] Searching for: local.metadata.xml.lastUpdated in touchfile.
[DEBUG] Reading resolution-state from: /tmp/DefaultRepositoryMetadataManager.test.1215402401394/path/to/resolver-status.properties
Testing re-check proofing...
[INFO] Test metadata for: group:artifact:1-SNAPSHOT: checking for updates from remote
[DEBUG] EasyMock for interface org.apache.maven.artifact.repository.metadata.RepositoryMetadata
could not be found on repository: remote
[DEBUG] Reading resolution-state from: /tmp/DefaultRepositoryMetadataManager.test.1215402403422/path/to/resolver-status.properties
[DEBUG] Writing resolution-state to: /tmp/DefaultRepositoryMetadataManager.test.1215402403422/path/to/resolver-status.properties
[DEBUG] Searching for: remote.metadata.xml.lastUpdated in touchfile.
[DEBUG] Reading resolution-state from: /tmp/DefaultRepositoryMetadataManager.test.1215402403422/path/to/resolver-status.properties
[DEBUG] Searching for: remote.metadata.xml.lastUpdated in touchfile.
[DEBUG] Reading resolution-state from: /tmp/DefaultRepositoryMetadataManager.test.1215402403422/path/to/resolver-status.properties
[DEBUG] Searching for: remote.metadata.xml.lastUpdated in touchfile.
[DEBUG] Reading resolution-state from: /tmp/DefaultRepositoryMetadataManager.test.1215402403422/path/to/resolver-status.properties
Tests run: 4, Failures: 0, Errors: 0, Skipped: 0, Time elapsed: 8.134 sec
Running org.apache.maven.artifact.installer.ArtifactInstallerTest
[INFO] Installing http://ci.sonatype.org/job/maven-artifact/ws/maven-artifact/src/test/resources/artifact-install/artifact-1.0.jar
 to http://ci.sonatype.org/job/maven-artifact/ws/maven-artifact/target/test-classes/repositories/installer/local-repository/org/apache/maven/artifact/1.0/artifact-1.0.jar

Tests run: 1, Failures: 0, Errors: 0, Skipped: 0, Time elapsed: 0.02 sec
Running org.apache.maven.artifact.resolver.ArtifactResolutionExceptionTest
Tests run: 1, Failures: 0, Errors: 0, Skipped: 0, Time elapsed: 0.002 sec
Running org.apache.maven.artifact.resolver.DefaultArtifactResolverTest
Tests run: 1, Failures: 0, Errors: 0, Skipped: 0, Time elapsed: 0.013 sec
Running org.apache.maven.artifact.resolver.conflict.OldestConflictResolverTest
Tests run: 4, Failures: 0, Errors: 0, Skipped: 0, Time elapsed: 0.037 sec
Running org.apache.maven.artifact.manager.DefaultUpdateCheckManagerTest
[DEBUG] Reading resolution-state from: http://ci.sonatype.org/job/maven-artifact/ws/maven-artifact/target/test-classes/repositories/updateCheckManager/local-repository/org/apache/maven/a/0.0.1-SNAPSHOT/a-0.0.1-SNAPSHOT.jar.lastUpdated

[DEBUG] Writing resolution-state to: http://ci.sonatype.org/job/maven-artifact/ws/maven-artifact/target/test-classes/repositories/updateCheckManager/local-repository/org/apache/maven/a/0.0.1-SNAPSHOT/a-0.0.1-SNAPSHOT.jar.lastUpdated

[DEBUG] Searching for: test in touchfile.
[DEBUG] Reading resolution-state from: http://ci.sonatype.org/job/maven-artifact/ws/maven-artifact/target/test-classes/repositories/updateCheckManager/local-repository/org/apache/maven/a/0.0.1-SNAPSHOT/a-0.0.1-SNAPSHOT.jar.lastUpdated

[DEBUG] Searching for: test in touchfile.
[DEBUG] Reading resolution-state from: http://ci.sonatype.org/job/maven-artifact/ws/maven-artifact/target/test-classes/repositories/updateCheckManager/local-repository/org/apache/maven/a/0.0.1-SNAPSHOT/a-0.0.1-SNAPSHOT.jar.lastUpdated

[DEBUG] Reading resolution-state from: http://ci.sonatype.org/job/maven-artifact/ws/maven-artifact/target/test-classes/repositories/updateCheckManager/local-repository/org/apache/maven/a/0.0.1/a-0.0.1.pom.lastUpdated

[DEBUG] Writing resolution-state to: http://ci.sonatype.org/job/maven-artifact/ws/maven-artifact/target/test-classes/repositories/updateCheckManager/local-repository/org/apache/maven/a/0.0.1/a-0.0.1.pom.lastUpdated

[DEBUG] Searching for: test in touchfile.
[DEBUG] Reading resolution-state from: http://ci.sonatype.org/job/maven-artifact/ws/maven-artifact/target/test-classes/repositories/updateCheckManager/local-repository/org/apache/maven/a/0.0.1/a-0.0.1.pom.lastUpdated

[DEBUG] Searching for: test in touchfile.
[DEBUG] Reading resolution-state from: http://ci.sonatype.org/job/maven-artifact/ws/maven-artifact/target/test-classes/repositories/updateCheckManager/local-repository/org/apache/maven/a/0.0.1/a-0.0.1.pom.lastUpdated

[DEBUG] Reading resolution-state from: http://ci.sonatype.org/job/maven-artifact/ws/maven-artifact/target/test-classes/repositories/updateCheckManager/local-repository/org/apache/maven/a/resolver-status.properties

[DEBUG] Writing resolution-state to: http://ci.sonatype.org/job/maven-artifact/ws/maven-artifact/target/test-classes/repositories/updateCheckManager/local-repository/org/apache/maven/a/resolver-status.properties

[DEBUG] Searching for: test.maven-metadata-local.xml.lastUpdated in touchfile.
[DEBUG] Reading resolution-state from: http://ci.sonatype.org/job/maven-artifact/ws/maven-artifact/target/test-classes/repositories/updateCheckManager/local-repository/org/apache/maven/a/resolver-status.properties

[DEBUG] Searching for: test.maven-metadata-local.xml.lastUpdated in touchfile.
[DEBUG] Reading resolution-state from: http://ci.sonatype.org/job/maven-artifact/ws/maven-artifact/target/test-classes/repositories/updateCheckManager/local-repository/org/apache/maven/a/resolver-status.properties

[DEBUG] Reading resolution-state from: http://ci.sonatype.org/job/maven-artifact/ws/maven-artifact/target/test-classes/repositories/updateCheckManager/local-repository/org/apache/maven/a/resolver-status.properties

[DEBUG] Writing resolution-state to: http://ci.sonatype.org/job/maven-artifact/ws/maven-artifact/target/test-classes/repositories/updateCheckManager/local-repository/org/apache/maven/a/resolver-status.properties

[DEBUG] Searching for: test.maven-metadata-local.xml.lastUpdated in touchfile.
[DEBUG] Reading resolution-state from: http://ci.sonatype.org/job/maven-artifact/ws/maven-artifact/target/test-classes/repositories/updateCheckManager/local-repository/org/apache/maven/a/resolver-status.properties

[DEBUG] Searching for: test.maven-metadata-local.xml.lastUpdated in touchfile.
[DEBUG] Reading resolution-state from: http://ci.sonatype.org/job/maven-artifact/ws/maven-artifact/target/test-classes/repositories/updateCheckManager/local-repository/org/apache/maven/a/resolver-status.properties

Tests run: 7, Failures: 0, Errors: 0, Skipped: 0, Time elapsed: 0.074 sec
Running org.apache.maven.artifact.resolver.TestFileWagon
Tests run: 0, Failures: 0, Errors: 0, Skipped: 0, Time elapsed: 0.002 sec
Running org.apache.maven.artifact.transform.TransformationManagerTest
Tests run: 1, Failures: 0, Errors: 0, Skipped: 0, Time elapsed: 0.012 sec
Running org.apache.maven.artifact.deployer.ArtifactDeployerTest
[INFO] Retrieving previous metadata from test
[INFO] repository metadata for: 'artifact org.apache.maven:artifact' could not be found on
repository: test, so will be created
[INFO] Uploading repository metadata for: 'artifact org.apache.maven:artifact'
[WARNING] The artifact org.apache.maven:artifact:10.1.3 has already been deployed. Not deploying
again.
Tests run: 2, Failures: 0, Errors: 0, Skipped: 0, Time elapsed: 0.038 sec
Running org.apache.maven.artifact.resolver.conflict.DefaultGraphConflictResolutionPolicyTest
Tests run: 1, Failures: 0, Errors: 0, Skipped: 0, Time elapsed: 0.011 sec
Running org.apache.maven.artifact.factory.DefaultArtifactFactoryTest
Tests run: 1, Failures: 0, Errors: 0, Skipped: 0, Time elapsed: 0.011 sec

Results :

Tests run: 140, Failures: 0, Errors: 0, Skipped: 0

[INFO] [jar:jar]
[INFO] Building jar: http://ci.sonatype.org/job/maven-artifact/ws/maven-artifact/target/maven-artifact-3.0-SNAPSHOT.jar

[INFO] [install:install]
[INFO] Installing http://ci.sonatype.org/job/maven-artifact/ws/maven-artifact/target/maven-artifact-3.0-SNAPSHOT.jar
 to /home/j2ee-hudson/repos/maven-artifact/org/apache/maven/artifact/maven-artifact/3.0-SNAPSHOT/maven-artifact-3.0-SNAPSHOT.jar
[INFO] [deploy:deploy]
altDeploymentRepository = null
[INFO] Retrieving previous build number from apache.snapshots
[WARNING] *** CHECKSUM FAILED - Invalid checksum file - RETRYING
[WARNING] *** CHECKSUM FAILED - Invalid checksum file - IGNORING
[INFO] repository metadata for: 'snapshot org.apache.maven.artifact:maven-artifact:3.0-SNAPSHOT'
could not be found on repository: apache.snapshots, so will be created
Uploading: http://localhost:8081/nexus/content/repositories/maven.snapshots/org/apache/maven/artifact/maven-artifact/3.0-SNAPSHOT/maven-artifact-3.0-20080707.034645-1.jar
211K uploaded
[INFO] ------------------------------------------------------------------------
[ERROR] BUILD ERROR
[INFO] ------------------------------------------------------------------------
[INFO] Error deploying artifact: Failed to transfer file: http://localhost:8081/nexus/content/repositories/maven.snapshots/org/apache/maven/artifact/maven-artifact/3.0-SNAPSHOT/maven-artifact-3.0-20080707.034645-1.jar.
Return code is: 500

[INFO] ------------------------------------------------------------------------
[INFO] Trace
org.apache.maven.lifecycle.LifecycleExecutionException: Error deploying artifact: Failed to
transfer file: http://localhost:8081/nexus/content/repositories/maven.snapshots/org/apache/maven/artifact/maven-artifact/3.0-SNAPSHOT/maven-artifact-3.0-20080707.034645-1.jar.
Return code is: 500
	at org.apache.maven.lifecycle.DefaultLifecycleExecutor.executeGoals(DefaultLifecycleExecutor.java:583)
	at org.apache.maven.lifecycle.DefaultLifecycleExecutor.executeGoalWithLifecycle(DefaultLifecycleExecutor.java:499)
	at org.apache.maven.lifecycle.DefaultLifecycleExecutor.executeGoal(DefaultLifecycleExecutor.java:478)
	at org.apache.maven.lifecycle.DefaultLifecycleExecutor.executeGoalAndHandleFailures(DefaultLifecycleExecutor.java:330)
	at org.apache.maven.lifecycle.DefaultLifecycleExecutor.executeTaskSegments(DefaultLifecycleExecutor.java:291)
	at org.apache.maven.lifecycle.DefaultLifecycleExecutor.execute(DefaultLifecycleExecutor.java:142)
	at org.apache.maven.DefaultMaven.doExecute(DefaultMaven.java:336)
	at org.apache.maven.DefaultMaven.execute(DefaultMaven.java:129)
	at org.apache.maven.cli.MavenCli.main(MavenCli.java:287)
	at sun.reflect.NativeMethodAccessorImpl.invoke0(Native Method)
	at sun.reflect.NativeMethodAccessorImpl.invoke(NativeMethodAccessorImpl.java:39)
	at sun.reflect.DelegatingMethodAccessorImpl.invoke(DelegatingMethodAccessorImpl.java:25)
	at java.lang.reflect.Method.invoke(Method.java:597)
	at org.codehaus.classworlds.Launcher.launchEnhanced(Launcher.java:315)
	at org.codehaus.classworlds.Launcher.launch(Launcher.java:255)
	at org.codehaus.classworlds.Launcher.mainWithExitCode(Launcher.java:430)
	at org.codehaus.classworlds.Launcher.main(Launcher.java:375)
Caused by: org.apache.maven.plugin.MojoExecutionException: Error deploying artifact: Failed
to transfer file: http://localhost:8081/nexus/content/repositories/maven.snapshots/org/apache/maven/artifact/maven-artifact/3.0-SNAPSHOT/maven-artifact-3.0-20080707.034645-1.jar.
Return code is: 500
	at org.apache.maven.plugin.deploy.DeployMojo.execute(DeployMojo.java:174)
	at org.apache.maven.plugin.DefaultPluginManager.executeMojo(DefaultPluginManager.java:451)
	at org.apache.maven.lifecycle.DefaultLifecycleExecutor.executeGoals(DefaultLifecycleExecutor.java:558)
	... 16 more
Caused by: org.apache.maven.artifact.deployer.ArtifactDeploymentException: Error deploying
artifact: Failed to transfer file: http://localhost:8081/nexus/content/repositories/maven.snapshots/org/apache/maven/artifact/maven-artifact/3.0-SNAPSHOT/maven-artifact-3.0-20080707.034645-1.jar.
Return code is: 500
	at org.apache.maven.artifact.deployer.DefaultArtifactDeployer.deploy(DefaultArtifactDeployer.java:94)
	at org.apache.maven.plugin.deploy.DeployMojo.execute(DeployMojo.java:162)
	... 18 more
Caused by: org.apache.maven.wagon.TransferFailedException: Failed to transfer file: http://localhost:8081/nexus/content/repositories/maven.snapshots/org/apache/maven/artifact/maven-artifact/3.0-SNAPSHOT/maven-artifact-3.0-20080707.034645-1.jar.
Return code is: 500
	at org.apache.maven.wagon.providers.http.LightweightHttpWagon.put(LightweightHttpWagon.java:172)
	at org.apache.maven.artifact.manager.DefaultWagonManager.putRemoteFile(DefaultWagonManager.java:244)
	at org.apache.maven.artifact.manager.DefaultWagonManager.putArtifact(DefaultWagonManager.java:160)
	at org.apache.maven.artifact.deployer.DefaultArtifactDeployer.deploy(DefaultArtifactDeployer.java:80)
	... 19 more
[INFO] ------------------------------------------------------------------------
[INFO] Total time: 22 seconds
[INFO] Finished at: Sun Jul 06 22:46:45 CDT 2008
[INFO] Final Memory: 43M/395M
[INFO] ------------------------------------------------------------------------


Mime
View raw message