maven-notifications mailing list archives: June 2008

Site index · List index
Message list1 · 2 · 3 · Next »Thread · Author · Date
[continuum] BUILD FAILURE: Maven Wagon - Maven Wagon SSH External Provider - Build Def: default maven2 buildDefinition
Contin...@vmbuild.apache.org   [continuum] BUILD FAILURE: Maven Wagon - Maven Wagon SSH External Provider - Build Def: default maven2 buildDefinition Mon, 02 Jun, 08:09
Contin...@vmbuild.apache.org   [continuum] BUILD FAILURE: Maven Wagon - Maven Wagon SSH External Provider - Build Def: default maven2 buildDefinition Mon, 02 Jun, 09:33
Contin...@vmbuild.apache.org   [continuum] BUILD FAILURE: Maven Wagon - Maven Wagon SSH External Provider - Build Def: default maven2 buildDefinition Mon, 02 Jun, 13:13
Contin...@vmbuild.apache.org   [continuum] BUILD FAILURE: Maven Wagon - Maven Wagon SSH External Provider - Build Def: default maven2 buildDefinition Wed, 04 Jun, 07:04
[continuum] BUILD SUCCESSFUL: Maven Wagon - Maven Wagon SSH External Provider - Build Def: default maven2 buildDefinition
Contin...@vmbuild.apache.org   [continuum] BUILD SUCCESSFUL: Maven Wagon - Maven Wagon SSH External Provider - Build Def: default maven2 buildDefinition Mon, 02 Jun, 15:58
Contin...@vmbuild.apache.org   [continuum] BUILD SUCCESSFUL: Maven Wagon - Maven Wagon SSH External Provider - Build Def: default maven2 buildDefinition Mon, 09 Jun, 22:35
[continuum] BUILD FAILURE: Maven Wagon - Maven Wagon Lightweight HTTP Provider - Build Def: default maven2 buildDefinition
Contin...@vmbuild.apache.org   [continuum] BUILD FAILURE: Maven Wagon - Maven Wagon Lightweight HTTP Provider - Build Def: default maven2 buildDefinition Mon, 02 Jun, 16:48
Contin...@vmbuild.apache.org   [continuum] BUILD FAILURE: Maven Wagon - Maven Wagon Lightweight HTTP Provider - Build Def: default maven2 buildDefinition Wed, 04 Jun, 07:04
[continuum] BUILD FAILURE: Maven Wagon - Maven Wagon WebDav Provider - Build Def: default maven2 buildDefinition
Contin...@vmbuild.apache.org   [continuum] BUILD FAILURE: Maven Wagon - Maven Wagon WebDav Provider - Build Def: default maven2 buildDefinition Mon, 02 Jun, 16:50
Contin...@vmbuild.apache.org   [continuum] BUILD FAILURE: Maven Wagon - Maven Wagon WebDav Provider - Build Def: default maven2 buildDefinition Wed, 04 Jun, 07:05
[continuum] BUILD SUCCESSFUL: Maven Wagon - Maven Wagon Lightweight HTTP Provider - Build Def: default maven2 buildDefinition
Contin...@vmbuild.apache.org   [continuum] BUILD SUCCESSFUL: Maven Wagon - Maven Wagon Lightweight HTTP Provider - Build Def: default maven2 buildDefinition Mon, 02 Jun, 17:34
Contin...@vmbuild.apache.org   [continuum] BUILD SUCCESSFUL: Maven Wagon - Maven Wagon Lightweight HTTP Provider - Build Def: default maven2 buildDefinition Mon, 09 Jun, 22:33
[continuum] BUILD SUCCESSFUL: Maven Wagon - Maven Wagon WebDav Provider - Build Def: default maven2 buildDefinition
Contin...@vmbuild.apache.org   [continuum] BUILD SUCCESSFUL: Maven Wagon - Maven Wagon WebDav Provider - Build Def: default maven2 buildDefinition Mon, 02 Jun, 17:37
Contin...@vmbuild.apache.org   [continuum] BUILD SUCCESSFUL: Maven Wagon - Maven Wagon WebDav Provider - Build Def: default maven2 buildDefinition Mon, 09 Jun, 22:56
Contin...@vmbuild.apache.org [continuum] BUILD FAILURE: Maven Wagon - Maven Wagon File Provider - Build Def: default maven2 buildDefinition Wed, 04 Jun, 06:22
Contin...@vmbuild.apache.org [continuum] BUILD FAILURE: Maven Wagon - Maven Wagon HTTP Shared Library - Build Def: default maven2 buildDefinition Wed, 04 Jun, 06:29
Contin...@vmbuild.apache.org [continuum] BUILD FAILURE: Maven Wagon - Maven Wagon HTTP Provider - Build Def: default maven2 buildDefinition Wed, 04 Jun, 06:30
Contin...@vmbuild.apache.org [continuum] BUILD FAILURE: Maven Wagon - Maven Wagon FTP Provider - Build Def: default maven2 buildDefinition Wed, 04 Jun, 07:03
Contin...@vmbuild.apache.org [continuum] BUILD FAILURE: Maven Wagon - Maven Wagon SCM Provider - Build Def: default maven2 buildDefinition Wed, 04 Jun, 07:04
Contin...@vmbuild.apache.org [continuum] BUILD FAILURE: Maven Wagon - Maven Wagon SSH Common Library - Build Def: default maven2 buildDefinition Wed, 04 Jun, 07:04
Contin...@vmbuild.apache.org [continuum] BUILD FAILURE: Maven Wagon - Maven Wagon SSH Common Tests - Build Def: default maven2 buildDefinition Wed, 04 Jun, 07:04
Contin...@vmbuild.apache.org [continuum] BUILD FAILURE: Maven Wagon - Maven Wagon SSH Provider - Build Def: default maven2 buildDefinition Wed, 04 Jun, 07:05
Contin...@vmbuild.apache.org [continuum] BUILD SUCCESSFUL: Maven Wagon - Maven Wagon File Provider - Build Def: default maven2 buildDefinition Wed, 04 Jun, 07:45
Contin...@vmbuild.apache.org [continuum] BUILD SUCCESSFUL: Maven Wagon - Maven Wagon FTP Provider - Build Def: default maven2 buildDefinition Mon, 09 Jun, 22:30
Contin...@vmbuild.apache.org [continuum] BUILD SUCCESSFUL: Maven Wagon - Maven Wagon HTTP Shared Library - Build Def: default maven2 buildDefinition Mon, 09 Jun, 22:32
Contin...@vmbuild.apache.org [continuum] BUILD SUCCESSFUL: Maven Wagon - Maven Wagon HTTP Provider - Build Def: default maven2 buildDefinition Mon, 09 Jun, 22:32
Contin...@vmbuild.apache.org [continuum] BUILD SUCCESSFUL: Maven Wagon - Maven Wagon SCM Provider - Build Def: default maven2 buildDefinition Mon, 09 Jun, 22:34
Contin...@vmbuild.apache.org [continuum] BUILD SUCCESSFUL: Maven Wagon - Maven Wagon SSH Common Library - Build Def: default maven2 buildDefinition Mon, 09 Jun, 22:35
Contin...@vmbuild.apache.org [continuum] BUILD SUCCESSFUL: Maven Wagon - Maven Wagon SSH Common Tests - Build Def: default maven2 buildDefinition Mon, 09 Jun, 22:35
Contin...@vmbuild.apache.org [continuum] BUILD SUCCESSFUL: Maven Wagon - Maven Wagon SSH Provider - Build Def: default maven2 buildDefinition Mon, 09 Jun, 22:36
Build failed in Hudson: Maven-Plugins » Maven Assembly Plugin #40
Hudson   Build failed in Hudson: Maven-Plugins » Maven Assembly Plugin #40 Mon, 23 Jun, 17:39
Hudson     Build failed in Hudson: Maven-Plugins » Maven Assembly Plugin #41 Mon, 23 Jun, 18:12
Hudson       Build failed in Hudson: Maven-Plugins » Maven Assembly Plugin #42 Tue, 24 Jun, 00:05
Hudson         Build failed in Hudson: Maven-Plugins » Maven Assembly Plugin #43 Tue, 24 Jun, 04:52
Hudson           Build failed in Hudson: Maven-Plugins » Maven Assembly Plugin #44 Wed, 25 Jun, 12:48
Hudson             Build failed in Hudson: Maven-Plugins » Maven Assembly Plugin #45 Wed, 25 Jun, 18:11
Hudson               Build failed in Hudson: Maven-Plugins » Maven Assembly Plugin #46 Wed, 25 Jun, 21:39
Hudson                 Build failed in Hudson: Maven-Plugins » Maven Assembly Plugin #47 Thu, 26 Jun, 03:40
Build failed in Hudson: Archetype #36
Hudson   Build failed in Hudson: Archetype #36 Mon, 23 Jun, 18:48
Hudson     Build failed in Hudson: Archetype #37 Mon, 23 Jun, 20:48
Hudson       Hudson build is back to normal: Archetype #38 Mon, 23 Jun, 22:48
Build failed in Hudson: Maven-Plugins » Maven Dependency Plugin #42
Hudson   Build failed in Hudson: Maven-Plugins » Maven Dependency Plugin #42 Tue, 24 Jun, 00:05
Hudson     Build failed in Hudson: Maven-Plugins » Maven Dependency Plugin #43 Tue, 24 Jun, 04:52
Hudson       Build failed in Hudson: Maven-Plugins » Maven Dependency Plugin #44 Wed, 25 Jun, 12:48
Hudson         Build failed in Hudson: Maven-Plugins » Maven Dependency Plugin #45 Wed, 25 Jun, 18:11
Hudson           Build failed in Hudson: Maven-Plugins » Maven Dependency Plugin #46 Wed, 25 Jun, 21:39
Hudson             Build failed in Hudson: Maven-Plugins » Maven Dependency Plugin #47 Thu, 26 Jun, 03:40
Build failed in Hudson: Maven-Plugins » Maven Patch Plugin #42
Hudson   Build failed in Hudson: Maven-Plugins » Maven Patch Plugin #42 Tue, 24 Jun, 00:05
Hudson     Build failed in Hudson: Maven-Plugins » Maven Patch Plugin #43 Tue, 24 Jun, 04:52
Hudson       Build failed in Hudson: Maven-Plugins » Maven Patch Plugin #44 Wed, 25 Jun, 12:48
Hudson         Build failed in Hudson: Maven-Plugins » Maven Patch Plugin #45 Wed, 25 Jun, 18:11
Hudson           Build failed in Hudson: Maven-Plugins » Maven Patch Plugin #46 Wed, 25 Jun, 21:39
Hudson             Build failed in Hudson: Maven-Plugins » Maven Patch Plugin #47 Thu, 26 Jun, 03:40
Hudson build is still unstable: Maven-Plugins » Maven Ear plugin #42
Hudson   Hudson build is still unstable: Maven-Plugins » Maven Ear plugin #42 Tue, 24 Jun, 00:05
Hudson     Hudson build is still unstable: Maven-Plugins » Maven Ear plugin #43 Tue, 24 Jun, 04:52
Hudson       Hudson build is still unstable: Maven-Plugins » Maven Ear plugin #44 Wed, 25 Jun, 12:48
Hudson         Hudson build is still unstable: Maven-Plugins » Maven Ear plugin #45 Wed, 25 Jun, 18:11
Hudson           Hudson build is still unstable: Maven-Plugins » Maven Ear plugin #46 Wed, 25 Jun, 21:39
Hudson             Hudson build is still unstable: Maven-Plugins » Maven Ear plugin #47 Thu, 26 Jun, 03:40
Hudson build is still unstable: Maven-Plugins » Maven IDEA Plugin #42
Hudson   Hudson build is still unstable: Maven-Plugins » Maven IDEA Plugin #42 Tue, 24 Jun, 00:05
Hudson     Hudson build is still unstable: Maven-Plugins » Maven IDEA Plugin #43 Tue, 24 Jun, 04:52
Hudson       Hudson build is still unstable: Maven-Plugins » Maven IDEA Plugin #44 Wed, 25 Jun, 12:48
Hudson         Hudson build is still unstable: Maven-Plugins » Maven IDEA Plugin #45 Wed, 25 Jun, 18:11
Hudson           Hudson build is still unstable: Maven-Plugins » Maven IDEA Plugin #46 Wed, 25 Jun, 21:39
Hudson             Hudson build is still unstable: Maven-Plugins » Maven IDEA Plugin #47 Thu, 26 Jun, 03:40
Build failed in Hudson: Maven-Plugins » Maven Jar Plugin #42
Hudson   Build failed in Hudson: Maven-Plugins » Maven Jar Plugin #42 Tue, 24 Jun, 00:05
Hudson     Build failed in Hudson: Maven-Plugins » Maven Jar Plugin #43 Tue, 24 Jun, 04:52
Hudson build is still unstable: Maven-Plugins » Maven Eclipse Plugin #42
Hudson   Hudson build is still unstable: Maven-Plugins » Maven Eclipse Plugin #42 Tue, 24 Jun, 00:05
Hudson     Hudson build is still unstable: Maven-Plugins » Maven Eclipse Plugin #43 Tue, 24 Jun, 04:52
Hudson       Hudson build is still unstable: Maven-Plugins » Maven Eclipse Plugin #44 Wed, 25 Jun, 12:48
Hudson         Hudson build is still unstable: Maven-Plugins » Maven Eclipse Plugin #45 Wed, 25 Jun, 18:11
Hudson           Hudson build is still unstable: Maven-Plugins » Maven Eclipse Plugin #46 Wed, 25 Jun, 21:39
Hudson             Hudson build is still unstable: Maven-Plugins » Maven Eclipse Plugin #47 Thu, 26 Jun, 03:40
Hudson Build failed in Hudson: maven-core-integration-testing #90 Tue, 24 Jun, 21:01
Hudson   Hudson build is back to normal: maven-core-integration-testing #91 Fri, 27 Jun, 17:02
Hudson Build failed in Hudson: Maven-2.1.x #165 Thu, 26 Jun, 17:17
Hudson   Build failed in Hudson: Maven-2.1.x #166 Fri, 27 Jun, 15:01
Hudson     Build failed in Hudson: Maven-2.1.x #167 Fri, 27 Jun, 15:10
Hudson       Build failed in Hudson: Maven-2.1.x #168 Fri, 27 Jun, 17:05
Hudson         Build failed in Hudson: Maven-2.1.x #169 Fri, 27 Jun, 17:49
Hudson           Build failed in Hudson: Maven-2.1.x #170 Fri, 27 Jun, 23:18
Hudson             Build failed in Hudson: Maven-2.1.x #171 Sat, 28 Jun, 13:20
Hudson               Build failed in Hudson: Maven-2.1.x #172 Sat, 28 Jun, 15:17
Hudson                 Build failed in Hudson: Maven-2.1.x #173 Sun, 29 Jun, 14:17
Hudson                   Build failed in Hudson: Maven-2.1.x #174 Mon, 30 Jun, 04:17
Hudson                     Build failed in Hudson: Maven-2.1.x #175 Mon, 30 Jun, 09:37
Hudson                       Build failed in Hudson: Maven-2.1.x #176 Mon, 30 Jun, 14:34
Hudson                         Hudson build is back to normal: Maven-2.1.x #177 Mon, 30 Jun, 14:39
Hudson Build failed in Hudson: Maven-2.0.x » Maven Project Builder #133 Sat, 28 Jun, 15:02
Hudson   Build failed in Hudson: Maven-2.0.x » Maven Project Builder #134 Sun, 29 Jun, 14:02
Contin...@vmbuild.apache.org [continuum] BUILD SUCCESSFUL: Maven Integration Testing - Maven Integration Testing - Build Def: default maven2 buildDefinition Mon, 30 Jun, 05:45
Contin...@vmbuild.apache.org [continuum] BUILD SUCCESSFUL: Maven Integration Testing - Integration Test Support Artifacts - Build Def: default maven2 buildDefinition Mon, 30 Jun, 05:46
Contin...@vmbuild.apache.org [continuum] BUILD SUCCESSFUL: Maven Integration Testing - Maven Integration Tests :: Plugins - Build Def: default maven2 buildDefinition Mon, 30 Jun, 05:46
Contin...@vmbuild.apache.org [continuum] BUILD SUCCESSFUL: Maven Integration Testing - Maven Core Integration Test Plugin - Build Def: default maven2 buildDefinition Mon, 30 Jun, 05:47
Contin...@vmbuild.apache.org [continuum] BUILD SUCCESSFUL: Maven Integration Testing - Maven Integration Test Helper Library - Build Def: default maven2 buildDefinition Mon, 30 Jun, 05:47
Contin...@vmbuild.apache.org [continuum] BUILD SUCCESSFUL: Maven Integration Testing - Maven Integration Test Plugin :: Configuration - Build Def: default maven2 buildDefinition Mon, 30 Jun, 05:47
Contin...@vmbuild.apache.org [continuum] BUILD SUCCESSFUL: Maven Integration Testing - Maven Integration Test Plugin :: Context Passing - Build Def: default maven2 buildDefinition Mon, 30 Jun, 05:48
Message list1 · 2 · 3 · Next »Thread · Author · Date
Box list
Oct 2014294
Sep 2014304
Aug 2014246
Jul 2014317
Jun 2014341
May 2014161
Apr 2014146
Mar 2014336
Feb 2014308
Jan 2014189
Dec 2013319
Nov 2013274
Oct 2013167
Sep 2013486
Aug 2013263
Jul 2013726
Jun 2013722
May 2013378
Apr 2013313
Mar 2013467
Feb 2013520
Jan 20131437
Dec 20121778
Nov 2012775
Oct 20121224
Sep 2012791
Aug 2012362
Jul 2012232
Jun 2012149
May 2012189
Apr 2012115
Mar 201257
Feb 2012155
Jan 2012170
Dec 2011244
Nov 2011187
Oct 2011139
Sep 2011190
Aug 2011276
Jul 201194
Jun 20114
Apr 201162
Mar 201176
Feb 201154
Jan 201185
Dec 201079
Nov 201061
Oct 201058
Sep 20101
Aug 201057
Jul 201037
Jun 201020
May 201075
Apr 201053
Mar 201012
Feb 201030
Jan 201071
Dec 2009104
Nov 200919
Oct 200931
Sep 2009193
Aug 2009268
Jul 2009193
Jun 2009147
May 200975
Apr 200979
Mar 2009134
Feb 2009657
Jan 200983
Dec 2008349
Nov 2008288
Oct 2008986
Sep 2008842
Aug 2008707
Jul 2008887
Jun 2008167
May 200821
Apr 2008231
Mar 2008438
Feb 2008317
Jan 2008205
Dec 2007185
Nov 2007532
Oct 2007439
Sep 2007699
Aug 20071294
Jul 2007351
Jun 20072211
May 2007273
Apr 2007262
Mar 2007534
Feb 20071648
Jan 20072359
Dec 2006575
Nov 2006357
Oct 2006642
Sep 2006660
Aug 20061662
Jul 20061320
Jun 2006473
May 20064700
Apr 20061113
Mar 20061048