maven-notifications mailing list archives: June 2008

Site index · List index
Message list1 · 2 · Next »Thread · Author · Date
Contin...@vmbuild.apache.org [continuum] BUILD FAILURE: Maven Wagon - Maven Wagon SSH External Provider - Build Def: default maven2 buildDefinition Mon, 02 Jun, 08:09
Contin...@vmbuild.apache.org [continuum] BUILD FAILURE: Maven Wagon - Maven Wagon SSH External Provider - Build Def: default maven2 buildDefinition Mon, 02 Jun, 09:33
Contin...@vmbuild.apache.org [continuum] BUILD FAILURE: Maven Wagon - Maven Wagon SSH External Provider - Build Def: default maven2 buildDefinition Mon, 02 Jun, 13:13
Contin...@vmbuild.apache.org [continuum] BUILD SUCCESSFUL: Maven Wagon - Maven Wagon SSH External Provider - Build Def: default maven2 buildDefinition Mon, 02 Jun, 15:58
Contin...@vmbuild.apache.org [continuum] BUILD FAILURE: Maven Wagon - Maven Wagon Lightweight HTTP Provider - Build Def: default maven2 buildDefinition Mon, 02 Jun, 16:48
Contin...@vmbuild.apache.org [continuum] BUILD FAILURE: Maven Wagon - Maven Wagon WebDav Provider - Build Def: default maven2 buildDefinition Mon, 02 Jun, 16:50
Contin...@vmbuild.apache.org [continuum] BUILD SUCCESSFUL: Maven Wagon - Maven Wagon Lightweight HTTP Provider - Build Def: default maven2 buildDefinition Mon, 02 Jun, 17:34
Contin...@vmbuild.apache.org [continuum] BUILD SUCCESSFUL: Maven Wagon - Maven Wagon WebDav Provider - Build Def: default maven2 buildDefinition Mon, 02 Jun, 17:37
Contin...@vmbuild.apache.org [continuum] BUILD FAILURE: Maven Wagon - Maven Wagon File Provider - Build Def: default maven2 buildDefinition Wed, 04 Jun, 06:22
Contin...@vmbuild.apache.org [continuum] BUILD FAILURE: Maven Wagon - Maven Wagon HTTP Shared Library - Build Def: default maven2 buildDefinition Wed, 04 Jun, 06:29
Contin...@vmbuild.apache.org [continuum] BUILD FAILURE: Maven Wagon - Maven Wagon HTTP Provider - Build Def: default maven2 buildDefinition Wed, 04 Jun, 06:30
Contin...@vmbuild.apache.org [continuum] BUILD FAILURE: Maven Wagon - Maven Wagon FTP Provider - Build Def: default maven2 buildDefinition Wed, 04 Jun, 07:03
Contin...@vmbuild.apache.org [continuum] BUILD FAILURE: Maven Wagon - Maven Wagon Lightweight HTTP Provider - Build Def: default maven2 buildDefinition Wed, 04 Jun, 07:04
Contin...@vmbuild.apache.org [continuum] BUILD FAILURE: Maven Wagon - Maven Wagon SCM Provider - Build Def: default maven2 buildDefinition Wed, 04 Jun, 07:04
Contin...@vmbuild.apache.org [continuum] BUILD FAILURE: Maven Wagon - Maven Wagon SSH Common Library - Build Def: default maven2 buildDefinition Wed, 04 Jun, 07:04
Contin...@vmbuild.apache.org [continuum] BUILD FAILURE: Maven Wagon - Maven Wagon SSH Common Tests - Build Def: default maven2 buildDefinition Wed, 04 Jun, 07:04
Contin...@vmbuild.apache.org [continuum] BUILD FAILURE: Maven Wagon - Maven Wagon SSH External Provider - Build Def: default maven2 buildDefinition Wed, 04 Jun, 07:04
Contin...@vmbuild.apache.org [continuum] BUILD FAILURE: Maven Wagon - Maven Wagon SSH Provider - Build Def: default maven2 buildDefinition Wed, 04 Jun, 07:05
Contin...@vmbuild.apache.org [continuum] BUILD FAILURE: Maven Wagon - Maven Wagon WebDav Provider - Build Def: default maven2 buildDefinition Wed, 04 Jun, 07:05
Contin...@vmbuild.apache.org [continuum] BUILD SUCCESSFUL: Maven Wagon - Maven Wagon File Provider - Build Def: default maven2 buildDefinition Wed, 04 Jun, 07:45
Contin...@vmbuild.apache.org [continuum] BUILD SUCCESSFUL: Maven Wagon - Maven Wagon FTP Provider - Build Def: default maven2 buildDefinition Mon, 09 Jun, 22:30
Contin...@vmbuild.apache.org [continuum] BUILD SUCCESSFUL: Maven Wagon - Maven Wagon HTTP Shared Library - Build Def: default maven2 buildDefinition Mon, 09 Jun, 22:32
Contin...@vmbuild.apache.org [continuum] BUILD SUCCESSFUL: Maven Wagon - Maven Wagon HTTP Provider - Build Def: default maven2 buildDefinition Mon, 09 Jun, 22:32
Contin...@vmbuild.apache.org [continuum] BUILD SUCCESSFUL: Maven Wagon - Maven Wagon Lightweight HTTP Provider - Build Def: default maven2 buildDefinition Mon, 09 Jun, 22:33
Contin...@vmbuild.apache.org [continuum] BUILD SUCCESSFUL: Maven Wagon - Maven Wagon SCM Provider - Build Def: default maven2 buildDefinition Mon, 09 Jun, 22:34
Contin...@vmbuild.apache.org [continuum] BUILD SUCCESSFUL: Maven Wagon - Maven Wagon SSH Common Library - Build Def: default maven2 buildDefinition Mon, 09 Jun, 22:35
Contin...@vmbuild.apache.org [continuum] BUILD SUCCESSFUL: Maven Wagon - Maven Wagon SSH Common Tests - Build Def: default maven2 buildDefinition Mon, 09 Jun, 22:35
Contin...@vmbuild.apache.org [continuum] BUILD SUCCESSFUL: Maven Wagon - Maven Wagon SSH External Provider - Build Def: default maven2 buildDefinition Mon, 09 Jun, 22:35
Contin...@vmbuild.apache.org [continuum] BUILD SUCCESSFUL: Maven Wagon - Maven Wagon SSH Provider - Build Def: default maven2 buildDefinition Mon, 09 Jun, 22:36
Contin...@vmbuild.apache.org [continuum] BUILD SUCCESSFUL: Maven Wagon - Maven Wagon WebDav Provider - Build Def: default maven2 buildDefinition Mon, 09 Jun, 22:56
Contin...@vmbuild.apache.org [continuum] BUILD SUCCESSFUL: Maven Integration Testing - Maven Integration Testing - Build Def: default maven2 buildDefinition Mon, 30 Jun, 05:45
Contin...@vmbuild.apache.org [continuum] BUILD SUCCESSFUL: Maven Integration Testing - Integration Test Support Artifacts - Build Def: default maven2 buildDefinition Mon, 30 Jun, 05:46
Contin...@vmbuild.apache.org [continuum] BUILD SUCCESSFUL: Maven Integration Testing - Maven Integration Tests :: Plugins - Build Def: default maven2 buildDefinition Mon, 30 Jun, 05:46
Contin...@vmbuild.apache.org [continuum] BUILD SUCCESSFUL: Maven Integration Testing - Maven Core Integration Test Plugin - Build Def: default maven2 buildDefinition Mon, 30 Jun, 05:47
Contin...@vmbuild.apache.org [continuum] BUILD SUCCESSFUL: Maven Integration Testing - Maven Integration Test Helper Library - Build Def: default maven2 buildDefinition Mon, 30 Jun, 05:47
Contin...@vmbuild.apache.org [continuum] BUILD SUCCESSFUL: Maven Integration Testing - Maven Integration Test Plugin :: Configuration - Build Def: default maven2 buildDefinition Mon, 30 Jun, 05:47
Contin...@vmbuild.apache.org [continuum] BUILD SUCCESSFUL: Maven Integration Testing - Maven Integration Test Plugin :: Context Passing - Build Def: default maven2 buildDefinition Mon, 30 Jun, 05:48
Contin...@vmbuild.apache.org [continuum] BUILD SUCCESSFUL: Maven Integration Testing - Maven Integration Test Plugin :: Envar - Build Def: default maven2 buildDefinition Mon, 30 Jun, 05:48
Contin...@vmbuild.apache.org [continuum] BUILD SUCCESSFUL: Maven Integration Testing - Maven Integration Test Plugin :: Fork - Build Def: default maven2 buildDefinition Mon, 30 Jun, 05:48
Contin...@vmbuild.apache.org [continuum] BUILD SUCCESSFUL: Maven Integration Testing - Maven Integration Test Plugin :: Interpolated POM Configuration - Build Def: default maven2 buildDefinition Mon, 30 Jun, 05:49
Contin...@vmbuild.apache.org [continuum] BUILD SUCCESSFUL: Maven Integration Testing - Maven Integration Test Plugin :: Loadable - Build Def: default maven2 buildDefinition Mon, 30 Jun, 05:49
Contin...@vmbuild.apache.org [continuum] BUILD SUCCESSFUL: Maven Integration Testing - Maven Integration Test Plugin :: Packaging - Build Def: default maven2 buildDefinition Mon, 30 Jun, 05:49
Contin...@vmbuild.apache.org [continuum] BUILD SUCCESSFUL: Maven Integration Testing - Maven Integration Test Plugin :: Parameter Implementation - Build Def: default maven2 buildDefinition Mon, 30 Jun, 05:50
Contin...@vmbuild.apache.org [continuum] BUILD SUCCESSFUL: Maven Integration Testing - Maven Integration Test Plugin :: Project Interpolation - Build Def: default maven2 buildDefinition Mon, 30 Jun, 05:50
Contin...@vmbuild.apache.org [continuum] BUILD SUCCESSFUL: Maven Integration Testing - Maven Integration Test Plugin :: Setter - Build Def: default maven2 buildDefinition Mon, 30 Jun, 05:50
Contin...@vmbuild.apache.org [continuum] BUILD SUCCESSFUL: Maven Integration Testing - Maven Integration Test Plugin :: This plugin should contain the mojos needed by all tests. - Build Def: default maven2 buildDefinition Mon, 30 Jun, 05:51
Contin...@vmbuild.apache.org [continuum] BUILD SUCCESSFUL: Maven Integration Testing - Maven Integration Test Plugin :: Touch - Build Def: default maven2 buildDefinition Mon, 30 Jun, 05:51
Contin...@vmbuild.apache.org [continuum] BUILD SUCCESSFUL: Maven Integration Testing - Maven Integration Test Plugin :: Uses Properties Plugin - Build Def: default maven2 buildDefinition Mon, 30 Jun, 05:51
Contin...@vmbuild.apache.org [continuum] BUILD SUCCESSFUL: Maven Integration Testing - Maven Integration Test Plugin :: Uses Wagon Plugin - Build Def: default maven2 buildDefinition Mon, 30 Jun, 05:52
Contin...@vmbuild.apache.org [continuum] BUILD SUCCESSFUL: Maven Integration Testing - Maven Integration Tests - Build Def: default maven2 buildDefinition Mon, 30 Jun, 05:53
Contin...@vmbuild.apache.org [continuum] BUILD SUCCESSFUL: Maven Integration Testing - core-integration-testing-wagon - Build Def: default maven2 buildDefinition Mon, 30 Jun, 05:53
Contin...@vmbuild.apache.org [continuum] BUILD SUCCESSFUL: Maven - Maven - Build Def: default maven2 buildDefinition Mon, 30 Jun, 05:53
Contin...@vmbuild.apache.org [continuum] BUILD SUCCESSFUL: Maven - Maven Model - Build Def: default maven2 buildDefinition Mon, 30 Jun, 05:54
Contin...@vmbuild.apache.org [continuum] BUILD SUCCESSFUL: Maven - Maven Local Settings Model - Build Def: default maven2 buildDefinition Mon, 30 Jun, 05:54
Contin...@vmbuild.apache.org [continuum] BUILD SUCCESSFUL: Maven - Maven Plugin Parameter Documenter API - Build Def: default maven2 buildDefinition Mon, 30 Jun, 05:55
Contin...@vmbuild.apache.org [continuum] BUILD SUCCESSFUL: Maven - Maven Reporting - Build Def: default maven2 buildDefinition Mon, 30 Jun, 05:55
Contin...@vmbuild.apache.org [continuum] BUILD SUCCESSFUL: Maven - Maven Reporting API - Build Def: default maven2 buildDefinition Mon, 30 Jun, 05:55
Contin...@vmbuild.apache.org [continuum] BUILD SUCCESSFUL: Maven - Maven Profile Model - Build Def: default maven2 buildDefinition Mon, 30 Jun, 05:56
Contin...@vmbuild.apache.org [continuum] BUILD SUCCESSFUL: Maven - Maven Artifact - Build Def: default maven2 buildDefinition Mon, 30 Jun, 05:56
Contin...@vmbuild.apache.org [continuum] BUILD SUCCESSFUL: Maven - Maven Repository Metadata Model - Build Def: default maven2 buildDefinition Mon, 30 Jun, 05:56
Contin...@vmbuild.apache.org [continuum] BUILD SUCCESSFUL: Maven - Maven Error Diagnostics - Build Def: default maven2 buildDefinition Mon, 30 Jun, 05:57
Contin...@vmbuild.apache.org [continuum] BUILD SUCCESSFUL: Maven - Maven Artifact Manager - Build Def: default maven2 buildDefinition Mon, 30 Jun, 05:57
Contin...@vmbuild.apache.org [continuum] BUILD SUCCESSFUL: Maven - Maven Artifact Test Helper Library - Build Def: default maven2 buildDefinition Mon, 30 Jun, 05:57
Contin...@vmbuild.apache.org [continuum] BUILD SUCCESSFUL: Maven - Maven Plugin Registry Model - Build Def: default maven2 buildDefinition Mon, 30 Jun, 05:58
Contin...@vmbuild.apache.org [continuum] BUILD SUCCESSFUL: Maven - Maven Project Builder - Build Def: default maven2 buildDefinition Mon, 30 Jun, 05:58
Contin...@vmbuild.apache.org [continuum] BUILD SUCCESSFUL: Maven - Maven Plugin API - Build Def: default maven2 buildDefinition Mon, 30 Jun, 05:59
Contin...@vmbuild.apache.org [continuum] BUILD SUCCESSFUL: Maven - Maven Plugin Descriptor Model - Build Def: default maven2 buildDefinition Mon, 30 Jun, 05:59
Contin...@vmbuild.apache.org [continuum] BUILD SUCCESSFUL: Maven - Maven Monitor - Build Def: default maven2 buildDefinition Mon, 30 Jun, 06:00
Contin...@vmbuild.apache.org [continuum] BUILD SUCCESSFUL: Maven - Maven Core - Build Def: default maven2 buildDefinition Mon, 30 Jun, 06:00
Contin...@vmbuild.apache.org [continuum] BUILD SUCCESSFUL: Maven - Maven Toolchains - Build Def: default maven2 buildDefinition Mon, 30 Jun, 06:01
Contin...@vmbuild.apache.org [continuum] BUILD SUCCESSFUL: Maven - Maven Distribution - Build Def: default maven2 buildDefinition Mon, 30 Jun, 06:02
Contin...@vmbuild.apache.org [continuum] BUILD SUCCESSFUL: Maven - Integration Test Executor - Build Def: default maven2 buildDefinition Mon, 30 Jun, 06:28
Contin...@vmbuild.apache.org [continuum] BUILD SUCCESSFUL: Maven - Maven Script Support Root - Build Def: default maven2 buildDefinition Mon, 30 Jun, 06:28
Contin...@vmbuild.apache.org [continuum] BUILD SUCCESSFUL: Maven - Maven Ant Mojo Support - Build Def: default maven2 buildDefinition Mon, 30 Jun, 06:29
Contin...@vmbuild.apache.org [continuum] BUILD SUCCESSFUL: Maven - Maven Beanshell Mojo Support - Build Def: default maven2 buildDefinition Mon, 30 Jun, 06:29
Contin...@vmbuild.apache.org [continuum] BUILD SUCCESSFUL: Maven 2.1.x (trunk) - Apache Maven - Build Def: default maven2 buildDefinition Mon, 30 Jun, 07:40
Contin...@vmbuild.apache.org [continuum] BUILD SUCCESSFUL: Maven 2.1.x (trunk) - Maven Workspace - Build Def: default maven2 buildDefinition Mon, 30 Jun, 08:00
Contin...@vmbuild.apache.org [continuum] BUILD SUCCESSFUL: Maven 2.1.x (trunk) - Maven Lifecycle Model - Build Def: default maven2 buildDefinition Mon, 30 Jun, 08:00
Contin...@vmbuild.apache.org [continuum] BUILD SUCCESSFUL: Maven 2.1.x (trunk) - Maven Reporting API - Build Def: default maven2 buildDefinition Mon, 30 Jun, 08:01
Contin...@vmbuild.apache.org [continuum] BUILD SUCCESSFUL: Maven 2.1.x (trunk) - Maven Model - Build Def: default maven2 buildDefinition Mon, 30 Jun, 08:01
Contin...@vmbuild.apache.org [continuum] BUILD SUCCESSFUL: Maven 2.1.x (trunk) - Maven Profile Model - Build Def: default maven2 buildDefinition Mon, 30 Jun, 08:02
Contin...@vmbuild.apache.org [continuum] BUILD SUCCESSFUL: Maven 2.1.x (trunk) - Maven Plugin API - Build Def: default maven2 buildDefinition Mon, 30 Jun, 08:02
Contin...@vmbuild.apache.org [continuum] BUILD SUCCESSFUL: Maven 2.1.x (trunk) - Maven Project Builder - Build Def: default maven2 buildDefinition Mon, 30 Jun, 08:03
Contin...@vmbuild.apache.org [continuum] BUILD SUCCESSFUL: Maven 2.1.x (trunk) - Maven Core - Build Def: default maven2 buildDefinition Mon, 30 Jun, 08:04
Contin...@vmbuild.apache.org [continuum] BUILD SUCCESSFUL: Maven 2.1.x (trunk) - Maven Toolchains - Build Def: default maven2 buildDefinition Mon, 30 Jun, 08:05
Contin...@vmbuild.apache.org [continuum] BUILD FAILURE: Maven 2.1.x (trunk) - Maven Embedder - Build Def: default maven2 buildDefinition Mon, 30 Jun, 08:07
Contin...@vmbuild.apache.org [continuum] BUILD FAILURE: Maven 2.1.x (trunk) - Maven Distribution - Build Def: default maven2 buildDefinition Mon, 30 Jun, 08:08
Contin...@vmbuild.apache.org [continuum] BUILD FAILURE: Maven 2.1.x (trunk) - Integration Test Executor - Build Def: default maven2 buildDefinition Mon, 30 Jun, 08:08
Contin...@vmbuild.apache.org [continuum] BUILD FAILURE: Maven 2.1.x (trunk) - Integration Tests for Maven Embedder - Build Def: default maven2 buildDefinition Mon, 30 Jun, 08:08
Contin...@vmbuild.apache.org [continuum] BUILD FAILURE: Maven 2.1.x (trunk) - Maven Embedder - Build Def: default maven2 buildDefinition Mon, 30 Jun, 09:31
Contin...@vmbuild.apache.org [continuum] BUILD FAILURE: Maven 2.1.x (trunk) - Maven Distribution - Build Def: default maven2 buildDefinition Mon, 30 Jun, 09:32
Contin...@vmbuild.apache.org [continuum] BUILD FAILURE: Maven 2.1.x (trunk) - Integration Test Executor - Build Def: default maven2 buildDefinition Mon, 30 Jun, 09:38
Contin...@vmbuild.apache.org [continuum] BUILD FAILURE: Maven 2.1.x (trunk) - Integration Tests for Maven Embedder - Build Def: default maven2 buildDefinition Mon, 30 Jun, 09:42
Contin...@vmbuild.apache.org [continuum] BUILD SUCCESSFUL: Maven 2.1.x (trunk) - Maven Embedder - Build Def: default maven2 buildDefinition Mon, 30 Jun, 17:33
Contin...@vmbuild.apache.org [continuum] BUILD SUCCESSFUL: Maven 2.1.x (trunk) - Maven Distribution - Build Def: default maven2 buildDefinition Mon, 30 Jun, 17:34
Contin...@vmbuild.apache.org [continuum] BUILD FAILURE: Maven 2.1.x (trunk) - Integration Test Executor - Build Def: default maven2 buildDefinition Mon, 30 Jun, 17:58
Contin...@vmbuild.apache.org [continuum] BUILD SUCCESSFUL: Maven 2.1.x (trunk) - Integration Tests for Maven Embedder - Build Def: default maven2 buildDefinition Mon, 30 Jun, 18:32
Contin...@vmbuild.apache.org [continuum] BUILD FAILURE: Maven 2.1.x (trunk) - Integration Test Executor - Build Def: default maven2 buildDefinition Mon, 30 Jun, 20:08
Hudson Build failed in Hudson: Maven-Plugins » Maven Assembly Plugin #40 Mon, 23 Jun, 17:39
Hudson Build failed in Hudson: Maven-Plugins » Maven Assembly Plugin #41 Mon, 23 Jun, 18:12
Message list1 · 2 · Next »Thread · Author · Date
Box list
Dec 2014318
Nov 2014618
Oct 2014426
Sep 2014304
Aug 2014246
Jul 2014317
Jun 2014341
May 2014161
Apr 2014146
Mar 2014336
Feb 2014308
Jan 2014189
Dec 2013319
Nov 2013274
Oct 2013167
Sep 2013486
Aug 2013263
Jul 2013726
Jun 2013722
May 2013378
Apr 2013313
Mar 2013467
Feb 2013520
Jan 20131437
Dec 20121778
Nov 2012775
Oct 20121224
Sep 2012791
Aug 2012362
Jul 2012232
Jun 2012149
May 2012189
Apr 2012115
Mar 201257
Feb 2012155
Jan 2012170
Dec 2011244
Nov 2011187
Oct 2011139
Sep 2011190
Aug 2011276
Jul 201194
Jun 20114
Apr 201162
Mar 201176
Feb 201154
Jan 201185
Dec 201079
Nov 201061
Oct 201058
Sep 20101
Aug 201057
Jul 201037
Jun 201020
May 201075
Apr 201053
Mar 201012
Feb 201030
Jan 201071
Dec 2009104
Nov 200919
Oct 200931
Sep 2009193
Aug 2009268
Jul 2009193
Jun 2009147
May 200975
Apr 200979
Mar 2009134
Feb 2009657
Jan 200983
Dec 2008349
Nov 2008288
Oct 2008986
Sep 2008842
Aug 2008707
Jul 2008887
Jun 2008167
May 200821
Apr 2008231
Mar 2008438
Feb 2008317
Jan 2008205
Dec 2007185
Nov 2007532
Oct 2007439
Sep 2007699
Aug 20071294
Jul 2007351
Jun 20072211
May 2007273
Apr 2007262
Mar 2007534
Feb 20071648
Jan 20072359
Dec 2006575
Nov 2006357
Oct 2006642
Sep 2006660
Aug 20061662
Jul 20061320
Jun 2006473
May 20064700
Apr 20061113
Mar 20061048