maven-notifications mailing list archives

Site index · List index
Message view « Date » · « Thread »
Top « Date » · « Thread »
From Hudson <Hud...@sonatype.org>
Subject Build failed in Hudson: maven-core-integration-testing #16
Date Fri, 14 Mar 2008 21:04:21 GMT
See http://ci.sonatype.org/job/maven-core-integration-testing/16/changes

------------------------------------------
started
Updating https://svn.apache.org/repos/asf/maven/core-integration-testing/trunk
At revision 637262
no change for https://svn.apache.org/repos/asf/maven/core-integration-testing/trunk since
the previous build
[maven-its] $ /opt/maven/2.0/bin/mvn fail clean deploy -B -U -e -Dmaven.repo.local=/home/j2ee-hudson/repos/maven-core-integration-testing
+ Error stacktraces are turned on.
[INFO] Scanning for projects...
[INFO] Reactor build order: 
[INFO]   Maven Integration Testing
[INFO]   Maven Integration Tests :: Plugins
[INFO]   Maven Integration Test Plugin :: Configuration
[INFO]   Maven Integration Test Plugin :: Context Passing
[INFO]   Maven Integration Test Plugin :: Fork
[INFO]   Maven Integration Test Plugin :: Envar
[INFO]   Maven Integration Test Plugin :: Interpolated POM Configuration
[INFO]   Maven Integration Test Plugin :: Loadable
[INFO]   Maven Core Integration Test Plugin
[INFO]   Maven Integration Test Plugin :: Packaging
[INFO]   Maven Integration Test Plugin :: Parameter Implementation
[INFO]   Maven Integration Test Helper Library
[INFO]   Maven Integration Test Plugin :: Project Interpolation
[INFO]   Maven Integration Test Plugin :: Setter
[INFO]   Maven Integration Test Plugin :: Touch
[INFO]   Maven Integration Test Plugin :: Uses Properties Plugin
[INFO]   Maven Integration Test Plugin :: This plugin should contain the mojos needed by all
tests.
[INFO]   Maven Integration Tests
[INFO]   Integration Test Support Artifacts
[INFO] ------------------------------------------------------------------------
[ERROR] BUILD FAILURE
[INFO] ------------------------------------------------------------------------
[INFO] Invalid task 'fail': you must specify a valid lifecycle phase, or a goal in the format
plugin:goal or pluginGroupId:pluginArtifactId:pluginVersion:goal
[INFO] ------------------------------------------------------------------------
[INFO] Trace
org.apache.maven.BuildFailureException: Invalid task 'fail': you must specify a valid lifecycle
phase, or a goal in the format plugin:goal or pluginGroupId:pluginArtifactId:pluginVersion:goal
	at org.apache.maven.lifecycle.DefaultLifecycleExecutor.getMojoDescriptor(DefaultLifecycleExecutor.java:1515)
	at org.apache.maven.lifecycle.DefaultLifecycleExecutor.segmentTaskListByAggregationNeeds(DefaultLifecycleExecutor.java:386)
	at org.apache.maven.lifecycle.DefaultLifecycleExecutor.execute(DefaultLifecycleExecutor.java:138)
	at org.apache.maven.DefaultMaven.doExecute(DefaultMaven.java:333)
	at org.apache.maven.DefaultMaven.execute(DefaultMaven.java:126)
	at org.apache.maven.cli.MavenCli.main(MavenCli.java:282)
	at sun.reflect.NativeMethodAccessorImpl.invoke0(Native Method)
	at sun.reflect.NativeMethodAccessorImpl.invoke(NativeMethodAccessorImpl.java:39)
	at sun.reflect.DelegatingMethodAccessorImpl.invoke(DelegatingMethodAccessorImpl.java:25)
	at java.lang.reflect.Method.invoke(Method.java:324)
	at org.codehaus.classworlds.Launcher.launchEnhanced(Launcher.java:315)
	at org.codehaus.classworlds.Launcher.launch(Launcher.java:255)
	at org.codehaus.classworlds.Launcher.mainWithExitCode(Launcher.java:430)
	at org.codehaus.classworlds.Launcher.main(Launcher.java:375)
[INFO] ------------------------------------------------------------------------
[INFO] Total time: 1 second
[INFO] Finished at: Fri Mar 14 16:04:20 CDT 2008
[INFO] Final Memory: 2M/4M
[INFO] ------------------------------------------------------------------------


Mime
View raw message