maven-notifications mailing list archives

Site index · List index
Message view « Date » · « Thread »
Top « Date » · « Thread »
From Hudson <Hud...@sonatype.org>
Subject Build failed in Hudson: Maven-2.1.x-ITs #4
Date Fri, 14 Mar 2008 22:04:31 GMT
See http://ci.sonatype.org/job/Maven-2.1.x-ITs/4/changes

------------------------------------------
started
Updating https://svn.apache.org/repos/asf/maven/components/trunk/maven-core-it-runner
At revision 637289
no change for https://svn.apache.org/repos/asf/maven/components/trunk/maven-core-it-runner
since the previous build
[maven-core-its] $ /opt/maven/2.0/bin/mvn test -e -U -B -Prun-its -Dsurefire.useFile=false
-Dmaven.repo.local=/home/j2ee-hudson/repos/Maven-2.1.x-ITs
+ Error stacktraces are turned on.
[INFO] Scanning for projects...
[INFO] snapshot org.apache.maven:maven:2.1-SNAPSHOT: checking for updates from central
Downloading: http://localhost:8081/nexus/dav/groups/public/org/apache/maven/maven/2.1-SNAPSHOT/maven-2.1-20080314.220127-61.pom
14K downloaded
[INFO] ------------------------------------------------------------------------
[INFO] Building Integration Test Executor
[INFO]    task-segment: [test]
[INFO] ------------------------------------------------------------------------
[INFO] artifact org.apache.maven.plugins:maven-resources-plugin: checking for updates from
central
[INFO] snapshot org.apache.maven.plugins:maven-resources-plugin:2.3-SNAPSHOT: checking for
updates from central
[INFO] artifact org.apache.maven.plugins:maven-dependency-plugin: checking for updates from
central
[INFO] snapshot org.apache.maven.plugins:maven-dependency-plugin:2.1-SNAPSHOT: checking for
updates from central
[INFO] artifact org.apache.maven.plugins:maven-antrun-plugin: checking for updates from central
[INFO] snapshot org.apache.maven.plugins:maven-antrun-plugin:1.2-SNAPSHOT: checking for updates
from central
[INFO] snapshot org.apache.maven.shared:maven-dependency-analyzer:1.1-SNAPSHOT: checking for
updates from central
[INFO] snapshot org.apache.maven.shared:maven-dependency-analyzer:1.1-SNAPSHOT: checking for
updates from apache.snapshots
[INFO] snapshot org.apache.maven.shared:maven-dependency-analyzer:1.1-SNAPSHOT: checking for
updates from central
[INFO] snapshot org.apache.maven.shared:maven-dependency-analyzer:1.1-SNAPSHOT: checking for
updates from apache.snapshots
[INFO] [dependency:unpack {execution: default}]
[INFO] Configured Artifact: org.apache.maven:maven-embedder:bin:2.1-SNAPSHOT:tar.gz
[INFO] snapshot org.apache.maven:maven-embedder:2.1-SNAPSHOT: checking for updates from central
[INFO] snapshot org.apache.maven:maven-embedder:2.1-SNAPSHOT: checking for updates from apache.snapshots
Downloading: http://localhost:8081/nexus/dav/groups/public/org/apache/maven/maven-embedder/2.1-SNAPSHOT/maven-embedder-2.1-20080314.220127-40-bin.tar.gz
2401K downloaded
[INFO] Unpacking /home/j2ee-hudson/repos/Maven-2.1.x-ITs/org/apache/maven/maven-embedder/2.1-SNAPSHOT/maven-embedder-2.1-SNAPSHOT-bin.tar.gzto
 http://ci.sonatype.org/job/Maven-2.1.x-ITs/ws/maven-core-its/target/maven-installation 
with Includes null and excludes:null
[INFO] Expanding /home/j2ee-hudson/repos/Maven-2.1.x-ITs/org/apache/maven/maven-embedder/2.1-SNAPSHOT/maven-embedder-2.1-SNAPSHOT-bin.tar.gz
to /tmp/tmp29696.tar
[INFO] Expanding: /tmp/tmp29696.tar into http://ci.sonatype.org/job/Maven-2.1.x-ITs/ws/maven-core-its/target/maven-installation

Downloading: http://localhost:8081/nexus/dav/groups/public/org/apache/maven/maven-embedder/2.1-SNAPSHOT/maven-embedder-2.1-20080314.220127-40.pom
13K downloaded
[INFO] snapshot org.apache.maven:maven-project:2.1-SNAPSHOT: checking for updates from central
[INFO] snapshot org.apache.maven:maven-project:2.1-SNAPSHOT: checking for updates from apache.snapshots
Downloading: http://localhost:8081/nexus/dav/groups/public/org/apache/maven/maven-project/2.1-SNAPSHOT/maven-project-2.1-20080314.220127-46.pom
3K downloaded
[INFO] snapshot org.apache.maven:maven-workspace:2.1-SNAPSHOT: checking for updates from central
[INFO] snapshot org.apache.maven:maven-workspace:2.1-SNAPSHOT: checking for updates from apache.snapshots
Downloading: http://localhost:8081/nexus/dav/groups/public/org/apache/maven/maven-workspace/2.1-SNAPSHOT/maven-workspace-2.1-20080314.220127-4.pom
477b downloaded
[INFO] snapshot org.apache.maven:maven-profile:2.1-SNAPSHOT: checking for updates from central
[INFO] snapshot org.apache.maven:maven-profile:2.1-SNAPSHOT: checking for updates from apache.snapshots
Downloading: http://localhost:8081/nexus/dav/groups/public/org/apache/maven/maven-profile/2.1-SNAPSHOT/maven-profile-2.1-20080314.220127-45.pom
2K downloaded
[INFO] snapshot org.apache.maven:maven-model:2.1-SNAPSHOT: checking for updates from central
[INFO] snapshot org.apache.maven:maven-model:2.1-SNAPSHOT: checking for updates from apache.snapshots
Downloading: http://localhost:8081/nexus/dav/groups/public/org/apache/maven/maven-model/2.1-SNAPSHOT/maven-model-2.1-20080314.220127-48.pom
3K downloaded
[INFO] snapshot org.apache.maven.artifact:maven-artifact:3.0-SNAPSHOT: checking for updates
from central
[INFO] snapshot org.apache.maven.artifact:maven-artifact:3.0-SNAPSHOT: checking for updates
from apache.snapshots
[INFO] snapshot org.apache.maven:maven-core:2.1-SNAPSHOT: checking for updates from central
[INFO] snapshot org.apache.maven:maven-core:2.1-SNAPSHOT: checking for updates from apache.snapshots
Downloading: http://localhost:8081/nexus/dav/groups/public/org/apache/maven/maven-core/2.1-SNAPSHOT/maven-core-2.1-20080314.220127-43.pom
5K downloaded
[INFO] snapshot org.apache.maven:maven-lifecycle:2.1-SNAPSHOT: checking for updates from central
[INFO] snapshot org.apache.maven:maven-lifecycle:2.1-SNAPSHOT: checking for updates from apache.snapshots
Downloading: http://localhost:8081/nexus/dav/groups/public/org/apache/maven/maven-lifecycle/2.1-SNAPSHOT/maven-lifecycle-2.1-20080314.220127-44.pom
1K downloaded
[INFO] snapshot org.apache.maven:maven-reporting-api:2.1-SNAPSHOT: checking for updates from
central
[INFO] snapshot org.apache.maven:maven-reporting-api:2.1-SNAPSHOT: checking for updates from
apache.snapshots
Downloading: http://localhost:8081/nexus/dav/groups/public/org/apache/maven/maven-reporting-api/2.1-SNAPSHOT/maven-reporting-api-2.1-20080314.220127-27.pom
1K downloaded
[INFO] snapshot org.apache.maven:maven-plugin-api:2.1-SNAPSHOT: checking for updates from
central
[INFO] snapshot org.apache.maven:maven-plugin-api:2.1-SNAPSHOT: checking for updates from
apache.snapshots
Downloading: http://localhost:8081/nexus/dav/groups/public/org/apache/maven/maven-plugin-api/2.1-SNAPSHOT/maven-plugin-api-2.1-20080314.220127-43.pom
2K downloaded
[INFO] snapshot org.apache.maven:maven-toolchain:2.1-SNAPSHOT: checking for updates from central
[INFO] snapshot org.apache.maven:maven-toolchain:2.1-SNAPSHOT: checking for updates from apache.snapshots
Downloading: http://localhost:8081/nexus/dav/groups/public/org/apache/maven/maven-toolchain/2.1-SNAPSHOT/maven-toolchain-2.1-20080314.220127-4.pom
1K downloaded
[INFO] snapshot org.apache.maven.its:core-integration-tests:2.1-SNAPSHOT: checking for updates
from central
[INFO] snapshot org.apache.maven.its:core-integration-tests:2.1-SNAPSHOT: checking for updates
from apache.snapshots
[INFO] snapshot org.apache.maven.its:core-integration-testing:2.1-SNAPSHOT: checking for updates
from central
[INFO] snapshot org.apache.maven.its:core-integration-testing:2.1-SNAPSHOT: checking for updates
from apache.snapshots
[INFO] snapshot org.apache.maven.its:maven-integration-test-helper:2.1-SNAPSHOT: checking
for updates from central
[INFO] snapshot org.apache.maven.its:maven-integration-test-helper:2.1-SNAPSHOT: checking
for updates from apache.snapshots
[INFO] snapshot org.apache.maven.shared:maven-verifier:1.2-SNAPSHOT: checking for updates
from central
[INFO] snapshot org.apache.maven.shared:maven-verifier:1.2-SNAPSHOT: checking for updates
from apache.snapshots
Downloading: http://localhost:8081/nexus/dav/groups/public/org/apache/maven/maven-project/2.1-SNAPSHOT/maven-project-2.1-20080314.220127-46.jar
221K downloaded
Downloading: http://localhost:8081/nexus/dav/groups/public/org/apache/maven/maven-workspace/2.1-SNAPSHOT/maven-workspace-2.1-20080314.220127-4.jar
8K downloaded
Downloading: http://localhost:8081/nexus/dav/groups/public/org/apache/maven/maven-profile/2.1-SNAPSHOT/maven-profile-2.1-20080314.220127-45.jar
35K downloaded
Downloading: http://localhost:8081/nexus/dav/groups/public/org/apache/maven/maven-model/2.1-SNAPSHOT/maven-model-2.1-20080314.220127-48.jar
92K downloaded
Downloading: http://localhost:8081/nexus/dav/groups/public/org/apache/maven/maven-core/2.1-SNAPSHOT/maven-core-2.1-20080314.220127-43.jar
333K downloaded
Downloading: http://localhost:8081/nexus/dav/groups/public/org/apache/maven/maven-lifecycle/2.1-SNAPSHOT/maven-lifecycle-2.1-20080314.220127-44.jar
44K downloaded
Downloading: http://localhost:8081/nexus/dav/groups/public/org/apache/maven/maven-reporting-api/2.1-SNAPSHOT/maven-reporting-api-2.1-20080314.220127-27.jar
10K downloaded
Downloading: http://localhost:8081/nexus/dav/groups/public/org/apache/maven/maven-plugin-api/2.1-SNAPSHOT/maven-plugin-api-2.1-20080314.220127-43.jar
44K downloaded
Downloading: http://localhost:8081/nexus/dav/groups/public/org/apache/maven/maven-toolchain/2.1-SNAPSHOT/maven-toolchain-2.1-20080314.220127-4.jar
35K downloaded
[INFO] [antrun:run {execution: default}]
[INFO] Executing tasks
[INFO] Executed tasks
[INFO] Setting property: classpath.resource.loader.class => 'org.codehaus.plexus.velocity.ContextClassLoaderResourceLoader'.
[INFO] Setting property: velocimacro.messages.on => 'false'.
[INFO] Setting property: resource.loader => 'classpath'.
[INFO] Setting property: resource.manager.logwhenfound => 'false'.
[INFO] [remote-resources:process {execution: default}]
[INFO] [resources:resources]
[INFO] Using default encoding to copy filtered resources.
[INFO] Resource directory does not exist: http://ci.sonatype.org/job/Maven-2.1.x-ITs/ws/maven-core-its/src/main/resources

[INFO] Copying 2 resources
[INFO] [compiler:compile]
[INFO] No sources to compile
[INFO] [resources:testResources]
[INFO] Using default encoding to copy filtered resources.
[INFO] Resource directory does not exist: http://ci.sonatype.org/job/Maven-2.1.x-ITs/ws/maven-core-its/src/test/resources

[INFO] Copying 2 resources
[INFO] [compiler:testCompile]
[INFO] Nothing to compile - all classes are up to date
[INFO] [surefire:test]
Downloading: http://localhost:8081/nexus/dav/groups/public/org/apache/maven/surefire/surefire-junit/2.4.2/surefire-junit-2.4.2.pom
1K downloaded
Downloading: http://localhost:8081/nexus/dav/groups/public/org/apache/maven/surefire/surefire-providers/2.4.2/surefire-providers-2.4.2.pom
1K downloaded
Downloading: http://localhost:8081/nexus/dav/groups/public/org/apache/maven/surefire/surefire-junit/2.4.2/surefire-junit-2.4.2.jar
14K downloaded
[INFO] Surefire report directory: http://ci.sonatype.org/job/Maven-2.1.x-ITs/ws/maven-core-its/target/surefire-reports


-------------------------------------------------------
 T E S T S
-------------------------------------------------------
Running org.apache.maven.its.Suite
org.apache.maven.surefire.booter.SurefireExecutionException: org.apache.maven.its.Suite; nested
exception is org.apache.maven.it.VerificationException: Illegal maven output: String 'Maven
version: ' not found in the following output:
Exception in thread "main" java.lang.NoClassDefFoundError: /home/j2ee-hudson//hudson/jobs/Maven-2/1/x-ITs/workspace/maven-core-its/target/maven-installation/apache-maven-2/1-SNAPSHOT/boot/plexus-classworlds-1/2-alpha-12/jar;
nested exception is org.apache.maven.surefire.testset.TestSetFailedException: org.apache.maven.its.Suite;
nested exception is org.apache.maven.it.VerificationException: Illegal maven output: String
'Maven version: ' not found in the following output:
Exception in thread "main" java.lang.NoClassDefFoundError: /home/j2ee-hudson//hudson/jobs/Maven-2/1/x-ITs/workspace/maven-core-its/target/maven-installation/apache-maven-2/1-SNAPSHOT/boot/plexus-classworlds-1/2-alpha-12/jar
org.apache.maven.surefire.testset.TestSetFailedException: org.apache.maven.its.Suite; nested
exception is org.apache.maven.it.VerificationException: Illegal maven output: String 'Maven
version: ' not found in the following output:
Exception in thread "main" java.lang.NoClassDefFoundError: /home/j2ee-hudson//hudson/jobs/Maven-2/1/x-ITs/workspace/maven-core-its/target/maven-installation/apache-maven-2/1-SNAPSHOT/boot/plexus-classworlds-1/2-alpha-12/jar
org.apache.maven.it.VerificationException: Illegal maven output: String 'Maven version: '
not found in the following output:
Exception in thread "main" java.lang.NoClassDefFoundError: /home/j2ee-hudson//hudson/jobs/Maven-2/1/x-ITs/workspace/maven-core-its/target/maven-installation/apache-maven-2/1-SNAPSHOT/boot/plexus-classworlds-1/2-alpha-12/jar
	at org.apache.maven.it.Verifier.getMavenVersion(Verifier.java:1044)
	at org.apache.maven.integrationtests.IntegrationTestSuite.suite(IntegrationTestSuite.java:41)
	at org.apache.maven.its.Suite.suite(Suite.java:14)
	at sun.reflect.NativeMethodAccessorImpl.invoke0(Native Method)
	at sun.reflect.NativeMethodAccessorImpl.invoke(NativeMethodAccessorImpl.java:39)
	at sun.reflect.DelegatingMethodAccessorImpl.invoke(DelegatingMethodAccessorImpl.java:25)
	at java.lang.reflect.Method.invoke(Method.java:324)
	at org.apache.maven.surefire.junit.JUnitTestSet.createInstanceFromSuiteMethod(JUnitTestSet.java:180)
	at org.apache.maven.surefire.junit.JUnitTestSet.constructTestObject(JUnitTestSet.java:140)
	at org.apache.maven.surefire.junit.JUnitTestSet.execute(JUnitTestSet.java:197)
	at org.apache.maven.surefire.suite.AbstractDirectoryTestSuite.executeTestSet(AbstractDirectoryTestSuite.java:140)
	at org.apache.maven.surefire.suite.AbstractDirectoryTestSuite.execute(AbstractDirectoryTestSuite.java:127)
	at org.apache.maven.surefire.Surefire.run(Surefire.java:177)
	at sun.reflect.NativeMethodAccessorImpl.invoke0(Native Method)
	at sun.reflect.NativeMethodAccessorImpl.invoke(NativeMethodAccessorImpl.java:39)
	at sun.reflect.DelegatingMethodAccessorImpl.invoke(DelegatingMethodAccessorImpl.java:25)
	at java.lang.reflect.Method.invoke(Method.java:324)
	at org.apache.maven.surefire.booter.SurefireBooter.runSuitesInProcess(SurefireBooter.java:338)
	at org.apache.maven.surefire.booter.SurefireBooter.main(SurefireBooter.java:997)
[INFO] ------------------------------------------------------------------------
[ERROR] BUILD FAILURE
[INFO] ------------------------------------------------------------------------
[INFO] There are test failures.

Please refer to http://ci.sonatype.org/job/Maven-2.1.x-ITs/ws/maven-core-its/target/surefire-reports
 for the individual test results.
[INFO] ------------------------------------------------------------------------
[INFO] Trace
org.apache.maven.BuildFailureException: There are test failures.

Please refer to http://ci.sonatype.org/job/Maven-2.1.x-ITs/ws/maven-core-its/target/surefire-reports
 for the individual test results.
	at org.apache.maven.lifecycle.DefaultLifecycleExecutor.executeGoals(DefaultLifecycleExecutor.java:560)
	at org.apache.maven.lifecycle.DefaultLifecycleExecutor.executeGoalWithLifecycle(DefaultLifecycleExecutor.java:480)
	at org.apache.maven.lifecycle.DefaultLifecycleExecutor.executeGoal(DefaultLifecycleExecutor.java:459)
	at org.apache.maven.lifecycle.DefaultLifecycleExecutor.executeGoalAndHandleFailures(DefaultLifecycleExecutor.java:311)
	at org.apache.maven.lifecycle.DefaultLifecycleExecutor.executeTaskSegments(DefaultLifecycleExecutor.java:278)
	at org.apache.maven.lifecycle.DefaultLifecycleExecutor.execute(DefaultLifecycleExecutor.java:143)
	at org.apache.maven.DefaultMaven.doExecute(DefaultMaven.java:333)
	at org.apache.maven.DefaultMaven.execute(DefaultMaven.java:126)
	at org.apache.maven.cli.MavenCli.main(MavenCli.java:282)
	at sun.reflect.NativeMethodAccessorImpl.invoke0(Native Method)
	at sun.reflect.NativeMethodAccessorImpl.invoke(NativeMethodAccessorImpl.java:39)
	at sun.reflect.DelegatingMethodAccessorImpl.invoke(DelegatingMethodAccessorImpl.java:25)
	at java.lang.reflect.Method.invoke(Method.java:324)
	at org.codehaus.classworlds.Launcher.launchEnhanced(Launcher.java:315)
	at org.codehaus.classworlds.Launcher.launch(Launcher.java:255)
	at org.codehaus.classworlds.Launcher.mainWithExitCode(Launcher.java:430)
	at org.codehaus.classworlds.Launcher.main(Launcher.java:375)
Caused by: org.apache.maven.plugin.MojoFailureException: There are test failures.

Please refer to http://ci.sonatype.org/job/Maven-2.1.x-ITs/ws/maven-core-its/target/surefire-reports
 for the individual test results.
	at org.apache.maven.plugin.surefire.SurefirePlugin.execute(SurefirePlugin.java:530)
	at org.apache.maven.plugin.DefaultPluginManager.executeMojo(DefaultPluginManager.java:447)
	at org.apache.maven.lifecycle.DefaultLifecycleExecutor.executeGoals(DefaultLifecycleExecutor.java:539)
	... 16 more
[INFO] ------------------------------------------------------------------------
[INFO] Total time: 11 seconds
[INFO] Finished at: Fri Mar 14 17:04:31 CDT 2008
[INFO] Final Memory: 17M/32M
[INFO] ------------------------------------------------------------------------


Mime
View raw message