maven-notifications mailing list archives

Site index · List index
Message view « Date » · « Thread »
Top « Date » · « Thread »
From Continuum VMBuild Server <contin...@apache.org>
Subject [continuum] BUILD FAILURE: Archiva Database
Date Sun, 16 Mar 2008 05:44:47 GMT
Online report : http://vmbuild.apache.org/continuum/buildResult.action?buildId=66080&projectId=393

Build statistics:
  State: Failed
  Previous State: Failed
  Started at: Sat 15 Mar 2008 22:44:09 -0700
  Finished at: Sat 15 Mar 2008 22:44:28 -0700
  Total time: 18s
  Build Trigger: Schedule
  Build Number: 24
  Exit code: 1
  Building machine hostname: vmbuild.apache.org
  Operating system : Linux(unknown)
  Java Home version : 
          java version "1.6.0_05"
          Java(TM) SE Runtime Environment (build 1.6.0_05-b13)
          Java HotSpot(TM) Client VM (build 10.0-b19, mixed mode, sharing)
        
  Builder version :
          Maven version: 2.0.7
          Java version: 1.6.0_05
          OS name: "linux" version: "2.6.20-16-server" arch: "i386"
    
****************************************************************************
SCM Changes:
****************************************************************************
Changed: joakime @ Sat 15 Mar 2008 21:48:58 -0700
Comment: Removing unused imports.
Files changed:
  /maven/archiva/trunk/archiva-base/archiva-artifact-converter/src/test/java/org/apache/maven/archiva/converter/artifact/LegacyToDefaultConverterTest.java
( 637540 )
  /maven/archiva/trunk/archiva-base/archiva-consumers/archiva-lucene-consumers/src/test/java/org/apache/maven/archiva/consumers/lucene/stubs/LuceneRepositoryContentIndexFactoryStub.java
( 637540 )
  /maven/archiva/trunk/archiva-base/archiva-converter/src/main/java/org/apache/maven/archiva/converter/legacy/DefaultLegacyRepositoryConverter.java
( 637540 )
  /maven/archiva/trunk/archiva-base/archiva-dependency-graph/src/test/java/org/apache/maven/archiva/dependency/graph/MavenProjectInfoReportsPluginDependencyGraphTest.java
( 637540 )
  /maven/archiva/trunk/archiva-base/archiva-dependency-graph/src/test/java/org/apache/maven/archiva/dependency/graph/tasks/DependencyManagementStackTest.java
( 637540 )
  /maven/archiva/trunk/archiva-base/archiva-dependency-graph/src/test/java/org/apache/maven/archiva/dependency/graph/walk/DependencyGraphWalkerTest.java
( 637540 )
  /maven/archiva/trunk/archiva-base/archiva-dependency-graph/src/test/java/org/apache/maven/archiva/dependency/graph/walk/WalkCollector.java
( 637540 )
  /maven/archiva/trunk/archiva-base/archiva-indexer/src/main/java/org/apache/maven/archiva/indexer/filecontent/FileContentRecord.java
( 637540 )
  /maven/archiva/trunk/archiva-base/archiva-indexer/src/main/java/org/apache/maven/archiva/indexer/lucene/analyzers/ClassnameTokenizer.java
( 637540 )
  /maven/archiva/trunk/archiva-base/archiva-indexer/src/main/java/org/apache/maven/archiva/indexer/lucene/analyzers/FilenamesTokenizer.java
( 637540 )
  /maven/archiva/trunk/archiva-base/archiva-indexer/src/main/java/org/apache/maven/archiva/indexer/lucene/analyzers/GroupIdTokenizer.java
( 637540 )
  /maven/archiva/trunk/archiva-base/archiva-indexer/src/main/java/org/apache/maven/archiva/indexer/lucene/analyzers/VersionTokenizer.java
( 637540 )
  /maven/archiva/trunk/archiva-base/archiva-model/src/main/java/org/apache/maven/archiva/model/Keys.java
( 637540 )
  /maven/archiva/trunk/archiva-base/archiva-repository-layer/src/main/java/org/apache/maven/archiva/repository/RemoteRepositoryContent.java
( 637540 )
  /maven/archiva/trunk/archiva-base/archiva-transaction/src/main/java/org/apache/maven/archiva/transaction/AbstractTransactionEvent.java
( 637540 )
  /maven/archiva/trunk/archiva-base/archiva-transaction/src/main/java/org/apache/maven/archiva/transaction/CreateFileEvent.java
( 637540 )
  /maven/archiva/trunk/archiva-base/archiva-transaction/src/test/java/org/apache/maven/archiva/transaction/AbstractFileEventTest.java
( 637540 )
  /maven/archiva/trunk/archiva-cli/src/main/java/org/apache/maven/archiva/cli/ArchivaCli.java
( 637540 )
  /maven/archiva/trunk/archiva-database/src/main/java/org/apache/maven/archiva/database/ArchivaDAO.java
( 637540 )
  /maven/archiva/trunk/archiva-scheduled/src/test/java/org/apache/maven/archiva/scheduled/executors/ArchivaDatabaseUpdateTaskExecutorTest.java
( 637540 )
  /maven/archiva/trunk/archiva-scheduled/src/test/java/org/apache/maven/archiva/scheduled/executors/ArchivaRepositoryScanningTaskExecutorTest.java
( 637540 )
  /maven/archiva/trunk/archiva-web/archiva-webapp/src/main/java/org/apache/maven/archiva/web/action/admin/repositories/AbstractRepositoriesAdminAction.java
( 637540 )
  /maven/archiva/trunk/archiva-web/archiva-webapp/src/main/java/org/apache/maven/archiva/web/util/VersionMerger.java
( 637540 )
  /maven/archiva/trunk/archiva-web/archiva-webapp/src/test/java/org/apache/maven/archiva/web/repository/RepositoryServletProxiedRelocatedTest.java
( 637540 )

****************************************************************************
Dependencies Changes:
****************************************************************************
org.apache.maven.archiva:archiva-consumer-api:1.1-SNAPSHOT


****************************************************************************
Build Defintion:
****************************************************************************
POM filename: pom.xml
Goals: clean install   
Arguments: --batch-mode --non-recursive
Build Fresh: false
Always Build: false
Default Build Definition: true
Schedule: DEFAULT_SCHEDULE
Description: $build.buildDefinition.description


****************************************************************************
Test Summary:
****************************************************************************
Tests: 0
Failures: 0
Total time: 0

****************************************************************************
Output:
****************************************************************************
[INFO] Scanning for projects...
[INFO] ----------------------------------------------------------------------------
[INFO] Building Archiva Database
[INFO]    task-segment: [clean, install]
[INFO] ----------------------------------------------------------------------------
[INFO] [clean:clean]
[INFO] Deleting directory /home/continuum/data/working-directory/393/target
[INFO] Deleting directory /home/continuum/data/working-directory/393/target/classes
[INFO] Deleting directory /home/continuum/data/working-directory/393/target/test-classes
[INFO] Deleting directory /home/continuum/data/working-directory/393/target/site
[INFO] [plexus:descriptor {execution: generate}]
[WARNING] POM for 'jpox:jpox:pom:1.1.9:compile' is invalid. It will be ignored for artifact
resolution. Reason: Not a v4.0.0 POM. for project jpox:jpox at /home/continuum/.m2/repository/jpox/jpox/1.1.9/jpox-1.1.9.pom
[INFO] Setting property: classpath.resource.loader.class => 'org.codehaus.plexus.velocity.ContextClassLoaderResourceLoader'.
[INFO] Setting property: velocimacro.messages.on => 'false'.
[INFO] Setting property: resource.loader => 'classpath'.
[INFO] Setting property: resource.manager.logwhenfound => 'false'.
[INFO] [remote-resources:process {execution: default}]
[WARNING] Attempting to build MavenProject instance for Artifact of type: jar; constructing
POM artifact instead.
[WARNING] Invalid project model for artifact [jpox:jpox:1.1.9]. It will be ignored by the
remote resources Mojo.
[INFO] [resources:resources]
[INFO] Using default encoding to copy filtered resources.
[WARNING] POM for 'jpox:jpox:pom:1.1.9:compile' is invalid. It will be ignored for artifact
resolution. Reason: Not a v4.0.0 POM. for project jpox:jpox at /home/continuum/.m2/repository/jpox/jpox/1.1.9/jpox-1.1.9.pom
[INFO] [compiler:compile]
[INFO] Compiling 50 source files to /home/continuum/data/working-directory/393/target/classes
[INFO] [resources:testResources]
[INFO] Using default encoding to copy filtered resources.
[WARNING] POM for 'jpox:jpox:pom:1.1.9:compile' is invalid. It will be ignored for artifact
resolution. Reason: Not a v4.0.0 POM. for project jpox:jpox at /home/continuum/.m2/repository/jpox/jpox/1.1.9/jpox-1.1.9.pom
[INFO] [compiler:testCompile]
[INFO] Compiling 28 source files to /home/continuum/data/working-directory/393/target/test-classes
[INFO] ------------------------------------------------------------------------
[ERROR] BUILD FAILURE
[INFO] ------------------------------------------------------------------------
[INFO] Compilation failure

/home/continuum/data/working-directory/393/src/test/java/org/apache/maven/archiva/database/AbstractArchivaDatabaseTestCase.java:[31,33]
package org.codehaus.plexus.spring does not exist

/home/continuum/data/working-directory/393/src/test/java/org/apache/maven/archiva/database/AbstractArchivaDatabaseTestCase.java:[52,12]
cannot find symbol
symbol: class PlexusInSpringTestCase
    extends PlexusInSpringTestCase

/home/continuum/data/working-directory/393/src/test/java/org/apache/maven/archiva/database/updater/DatabaseConsumersTest.java:[23,33]
package org.codehaus.plexus.spring does not exist

/home/continuum/data/working-directory/393/src/test/java/org/apache/maven/archiva/database/updater/DatabaseConsumersTest.java:[34,12]
cannot find symbol
symbol: class PlexusInSpringTestCase
    extends PlexusInSpringTestCase

/home/continuum/data/working-directory/393/src/test/java/org/apache/maven/archiva/database/AbstractArchivaDatabaseTestCase.java:[61,8]
cannot find symbol
symbol  : variable super
location: class org.apache.maven.archiva.database.AbstractArchivaDatabaseTestCase

/home/continuum/data/working-directory/393/src/test/java/org/apache/maven/archiva/database/AbstractArchivaDatabaseTestCase.java:[63,83]
cannot find symbol
symbol  : method lookup(java.lang.String,java.lang.String)
location: class org.apache.maven.archiva.database.AbstractArchivaDatabaseTestCase

/home/continuum/data/working-directory/393/src/test/java/org/apache/maven/archiva/database/AbstractArchivaDatabaseTestCase.java:[64,8]
cannot find symbol
symbol  : method assertEquals(java.lang.String,java.lang.String)
location: class org.apache.maven.archiva.database.AbstractArchivaDatabaseTestCase

/home/continuum/data/working-directory/393/src/test/java/org/apache/maven/archiva/database/AbstractArchivaDatabaseTestCase.java:[80,84]
cannot find symbol
symbol  : method getName()
location: class org.apache.maven.archiva.database.AbstractArchivaDatabaseTestCase

/home/continuum/data/working-directory/393/src/test/java/org/apache/maven/archiva/database/AbstractArchivaDatabaseTestCase.java:[113,40]
cannot find symbol
symbol  : method getClass()
location: class org.apache.maven.archiva.database.AbstractArchivaDatabaseTestCase

/home/continuum/data/working-directory/393/src/test/java/org/apache/maven/archiva/database/AbstractArchivaDatabaseTestCase.java:[117,46]
cannot find symbol
symbol  : method getName()
location: class org.apache.maven.archiva.database.AbstractArchivaDatabaseTestCase

/home/continuum/data/working-directory/393/src/test/java/org/apache/maven/archiva/database/AbstractArchivaDatabaseTestCase.java:[117,12]
cannot find symbol
symbol  : method fail(java.lang.String)
location: class org.apache.maven.archiva.database.AbstractArchivaDatabaseTestCase

/home/continuum/data/working-directory/393/src/test/java/org/apache/maven/archiva/database/AbstractArchivaDatabaseTestCase.java:[128,8]
cannot find symbol
symbol  : method assertNotNull(javax.jdo.PersistenceManagerFactory)
location: class org.apache.maven.archiva.database.AbstractArchivaDatabaseTestCase

/home/continuum/data/working-directory/393/src/test/java/org/apache/maven/archiva/database/AbstractArchivaDatabaseTestCase.java:[134,32]
cannot find symbol
symbol  : method lookup(java.lang.String,java.lang.String)
location: class org.apache.maven.archiva.database.AbstractArchivaDatabaseTestCase

/home/continuum/data/working-directory/393/src/test/java/org/apache/maven/archiva/database/AbstractArchivaDatabaseTestCase.java:[140,77]
cannot find symbol
symbol  : method lookup(java.lang.Class<org.apache.maven.archiva.consumers.DatabaseCleanupConsumer>,java.lang.String)
location: class org.apache.maven.archiva.database.AbstractArchivaDatabaseTestCase

/home/continuum/data/working-directory/393/src/test/java/org/apache/maven/archiva/database/AbstractArchivaDatabaseTestCase.java:[142,8]
cannot find symbol
symbol  : method assertNotNull(java.lang.String,org.apache.maven.archiva.database.updater.TestDatabaseCleanupConsumer)
location: class org.apache.maven.archiva.database.AbstractArchivaDatabaseTestCase

/home/continuum/data/working-directory/393/src/test/java/org/apache/maven/archiva/database/AbstractArchivaDatabaseTestCase.java:[149,85]
cannot find symbol
symbol  : method lookup(java.lang.Class<org.apache.maven.archiva.consumers.DatabaseUnprocessedArtifactConsumer>,java.lang.String)
location: class org.apache.maven.archiva.database.AbstractArchivaDatabaseTestCase

/home/continuum/data/working-directory/393/src/test/java/org/apache/maven/archiva/database/AbstractArchivaDatabaseTestCase.java:[152,8]
cannot find symbol
symbol  : method assertNotNull(java.lang.String,org.apache.maven.archiva.database.updater.TestDatabaseUnprocessedConsumer)
location: class org.apache.maven.archiva.database.AbstractArchivaDatabaseTestCase

/home/continuum/data/working-directory/393/src/test/java/org/apache/maven/archiva/database/AbstractArchivaDatabaseTestCase.java:[173,8]
cannot find symbol
symbol  : method assertEquals(java.lang.String,int,int)
location: class org.apache.maven.archiva.database.AbstractArchivaDatabaseTestCase

/home/continuum/data/working-directory/393/src/test/java/org/apache/maven/archiva/database/AbstractArchivaDatabaseTestCase.java:[180,8]
cannot find symbol
symbol  : method assertTrue(java.lang.String,boolean)
location: class org.apache.maven.archiva.database.AbstractArchivaDatabaseTestCase

/home/continuum/data/working-directory/393/src/test/java/org/apache/maven/archiva/database/AbstractArchivaDatabaseTestCase.java:[181,8]
cannot find symbol
symbol  : method assertTrue(java.lang.String,boolean)
location: class org.apache.maven.archiva.database.AbstractArchivaDatabaseTestCase

/home/continuum/data/working-directory/393/src/test/java/org/apache/maven/archiva/database/AbstractArchivaDatabaseTestCase.java:[182,8]
cannot find symbol
symbol  : method assertTrue(java.lang.String,boolean)
location: class org.apache.maven.archiva.database.AbstractArchivaDatabaseTestCase

/home/continuum/data/working-directory/393/src/test/java/org/apache/maven/archiva/database/AbstractArchivaDatabaseTestCase.java:[190,8]
cannot find symbol
symbol  : method assertEquals(java.lang.String,int,int)
location: class org.apache.maven.archiva.database.AbstractArchivaDatabaseTestCase

/home/continuum/data/working-directory/393/src/test/java/org/apache/maven/archiva/database/AbstractArchivaDatabaseTestCase.java:[199,8]
cannot find symbol
symbol  : method assertTrue(java.lang.String,boolean)
location: class org.apache.maven.archiva.database.AbstractArchivaDatabaseTestCase

/home/continuum/data/working-directory/393/src/test/java/org/apache/maven/archiva/database/AbstractArchivaDatabaseTestCase.java:[200,8]
cannot find symbol
symbol  : method assertTrue(java.lang.String,boolean)
location: class org.apache.maven.archiva.database.AbstractArchivaDatabaseTestCase

/home/continuum/data/working-directory/393/src/test/java/org/apache/maven/archiva/database/AbstractArchivaDatabaseTestCase.java:[201,8]
cannot find symbol
symbol  : method assertTrue(java.lang.String,boolean)
location: class org.apache.maven.archiva.database.AbstractArchivaDatabaseTestCase

/home/continuum/data/working-directory/393/src/test/java/org/apache/maven/archiva/database/AbstractArchivaDatabaseTestCase.java:[203,8]
cannot find symbol
symbol  : method assertNotNull(java.lang.String,java.lang.String)
location: class org.apache.maven.archiva.database.AbstractArchivaDatabaseTestCase

/home/continuum/data/working-directory/393/src/test/java/org/apache/maven/archiva/database/AbstractArchivaDatabaseTestCase.java:[204,8]
cannot find symbol
symbol  : method assertTrue(java.lang.String,boolean)
location: class org.apache.maven.archiva.database.AbstractArchivaDatabaseTestCase

/home/continuum/data/working-directory/393/src/test/java/org/apache/maven/archiva/database/constraints/ProjectsByArtifactUsageConstraintTest.java:[112,8]
cannot find symbol
symbol  : method assertNotNull(java.lang.String,java.util.List)
location: class org.apache.maven.archiva.database.constraints.ProjectsByArtifactUsageConstraintTest

/home/continuum/data/working-directory/393/src/test/java/org/apache/maven/archiva/database/constraints/ProjectsByArtifactUsageConstraintTest.java:[113,8]
cannot find symbol
symbol  : method assertEquals(java.lang.String,int,int)
location: class org.apache.maven.archiva.database.constraints.ProjectsByArtifactUsageConstraintTest

/home/continuum/data/working-directory/393/src/test/java/org/apache/maven/archiva/database/constraints/MostRecentRepositoryScanStatisticsTest.java:[65,8]
cannot find symbol
symbol  : method assertNotNull(java.lang.String,java.util.List)
location: class org.apache.maven.archiva.database.constraints.MostRecentRepositoryScanStatisticsTest

/home/continuum/data/working-directory/393/src/test/java/org/apache/maven/archiva/database/constraints/MostRecentRepositoryScanStatisticsTest.java:[66,8]
cannot find symbol
symbol  : method assertTrue(java.lang.String,boolean)
location: class org.apache.maven.archiva.database.constraints.MostRecentRepositoryScanStatisticsTest

/home/continuum/data/working-directory/393/src/test/java/org/apache/maven/archiva/database/constraints/MostRecentRepositoryScanStatisticsTest.java:[73,8]
cannot find symbol
symbol  : method assertNotNull(java.lang.String,java.util.List)
location: class org.apache.maven.archiva.database.constraints.MostRecentRepositoryScanStatisticsTest

/home/continuum/data/working-directory/393/src/test/java/org/apache/maven/archiva/database/constraints/MostRecentRepositoryScanStatisticsTest.java:[74,8]
cannot find symbol
symbol  : method assertEquals(java.lang.String,int,int)
location: class org.apache.maven.archiva.database.constraints.MostRecentRepositoryScanStatisticsTest

/home/continuum/data/working-directory/393/src/test/java/org/apache/maven/archiva/database/constraints/MostRecentRepositoryScanStatisticsTest.java:[77,8]
cannot find symbol
symbol  : method assertTrue(java.lang.String,boolean)
location: class org.apache.maven.archiva.database.constraints.MostRecentRepositoryScanStatisticsTest

/home/continuum/data/working-directory/393/src/test/java/org/apache/maven/archiva/database/constraints/MostRecentRepositoryScanStatisticsTest.java:[79,8]
cannot find symbol
symbol  : method assertEquals(java.lang.String,java.lang.String,java.lang.String)
location: class org.apache.maven.archiva.database.constraints.MostRecentRepositoryScanStatisticsTest

/home/continuum/data/working-directory/393/src/test/java/org/apache/maven/archiva/database/constraints/MostRecentRepositoryScanStatisticsTest.java:[80,8]
cannot find symbol
symbol  : method assertEquals(java.lang.String,java.lang.String,java.lang.String)
location: class org.apache.maven.archiva.database.constraints.MostRecentRepositoryScanStatisticsTest

/home/continuum/data/working-directory/393/src/test/java/org/apache/maven/archiva/database/constraints/MostRecentRepositoryScanStatisticsTest.java:[81,8]
cannot find symbol
symbol  : method assertEquals(java.lang.String,int,long)
location: class org.apache.maven.archiva.database.constraints.MostRecentRepositoryScanStatisticsTest

/home/continuum/data/working-directory/393/src/test/java/org/apache/maven/archiva/database/constraints/MostRecentRepositoryScanStatisticsTest.java:[82,8]
cannot find symbol
symbol  : method assertEquals(java.lang.String,int,long)
location: class org.apache.maven.archiva.database.constraints.MostRecentRepositoryScanStatisticsTest

/home/continuum/data/working-directory/393/src/test/java/org/apache/maven/archiva/database/constraints/MostRecentRepositoryScanStatisticsTest.java:[83,8]
cannot find symbol
symbol  : method assertEquals(java.lang.String,int,long)
location: class org.apache.maven.archiva.database.constraints.MostRecentRepositoryScanStatisticsTest

/home/continuum/data/working-directory/393/src/test/java/org/apache/maven/archiva/database/jdo/JdoProjectModelDAOTest.java:[54,8]
cannot find symbol
symbol  : method assertNotNull(org.apache.maven.archiva.model.ArchivaProjectModel)
location: class org.apache.maven.archiva.database.jdo.JdoProjectModelDAOTest

/home/continuum/data/working-directory/393/src/test/java/org/apache/maven/archiva/database/jdo/JdoProjectModelDAOTest.java:[63,8]
cannot find symbol
symbol  : method assertNotNull(org.apache.maven.archiva.model.ArchivaProjectModel)
location: class org.apache.maven.archiva.database.jdo.JdoProjectModelDAOTest

/home/continuum/data/working-directory/393/src/test/java/org/apache/maven/archiva/database/jdo/JdoProjectModelDAOTest.java:[65,8]
cannot find symbol
symbol  : method assertEquals(java.lang.String,java.lang.String)
location: class org.apache.maven.archiva.database.jdo.JdoProjectModelDAOTest

/home/continuum/data/working-directory/393/src/test/java/org/apache/maven/archiva/database/jdo/JdoProjectModelDAOTest.java:[69,8]
cannot find symbol
symbol  : method assertNotNull(java.util.List)
location: class org.apache.maven.archiva.database.jdo.JdoProjectModelDAOTest

/home/continuum/data/working-directory/393/src/test/java/org/apache/maven/archiva/database/jdo/JdoProjectModelDAOTest.java:[70,8]
cannot find symbol
symbol  : method assertEquals(int,int)
location: class org.apache.maven.archiva.database.jdo.JdoProjectModelDAOTest

/home/continuum/data/working-directory/393/src/test/java/org/apache/maven/archiva/database/jdo/JdoProjectModelDAOTest.java:[74,8]
cannot find symbol
symbol  : method assertNotNull(org.apache.maven.archiva.model.ArchivaProjectModel)
location: class org.apache.maven.archiva.database.jdo.JdoProjectModelDAOTest

/home/continuum/data/working-directory/393/src/test/java/org/apache/maven/archiva/database/jdo/JdoProjectModelDAOTest.java:[75,8]
cannot find symbol
symbol  : method assertEquals(java.lang.String,java.lang.String)
location: class org.apache.maven.archiva.database.jdo.JdoProjectModelDAOTest

/home/continuum/data/working-directory/393/src/test/java/org/apache/maven/archiva/database/jdo/JdoProjectModelDAOTest.java:[76,8]
cannot find symbol
symbol  : method assertEquals(java.lang.String,java.lang.String)
location: class org.apache.maven.archiva.database.jdo.JdoProjectModelDAOTest

/home/continuum/data/working-directory/393/src/test/java/org/apache/maven/archiva/database/jdo/JdoProjectModelDAOTest.java:[77,8]
cannot find symbol
symbol  : method assertEquals(java.lang.String,java.lang.String)
location: class org.apache.maven.archiva.database.jdo.JdoProjectModelDAOTest

/home/continuum/data/working-directory/393/src/test/java/org/apache/maven/archiva/database/jdo/JdoProjectModelDAOTest.java:[84,8]
cannot find symbol
symbol  : method assertEquals(int,int)
location: class org.apache.maven.archiva.database.jdo.JdoProjectModelDAOTest

/home/continuum/data/working-directory/393/src/test/java/org/apache/maven/archiva/database/jdo/JdoProjectModelDAOTest.java:[89,8]
cannot find symbol
symbol  : method assertNotNull(org.apache.maven.archiva.model.ArchivaProjectModel)
location: class org.apache.maven.archiva.database.jdo.JdoProjectModelDAOTest

/home/continuum/data/working-directory/393/src/test/java/org/apache/maven/archiva/database/jdo/JdoProjectModelDAOTest.java:[92,8]
cannot find symbol
symbol  : method assertEquals(java.lang.String,java.lang.String)
location: class org.apache.maven.archiva.database.jdo.JdoProjectModelDAOTest

/home/continuum/data/working-directory/393/src/test/java/org/apache/maven/archiva/database/jdo/JdoProjectModelDAOTest.java:[93,8]
cannot find symbol
symbol  : method assertEquals(java.lang.String,java.lang.String)
location: class org.apache.maven.archiva.database.jdo.JdoProjectModelDAOTest

/home/continuum/data/working-directory/393/src/test/java/org/apache/maven/archiva/database/jdo/JdoProjectModelDAOTest.java:[96,8]
cannot find symbol
symbol  : method assertEquals(int,int)
location: class org.apache.maven.archiva.database.jdo.JdoProjectModelDAOTest

/home/continuum/data/working-directory/393/src/test/java/org/apache/maven/archiva/database/jdo/JdoProjectModelDAOTest.java:[100,8]
cannot find symbol
symbol  : method assertEquals(int,int)
location: class org.apache.maven.archiva.database.jdo.JdoProjectModelDAOTest

/home/continuum/data/working-directory/393/src/test/java/org/apache/maven/archiva/database/jdo/JdoProjectModelDAOTest.java:[112,62]
cannot find symbol
symbol  : method lookup(java.lang.Class<org.apache.maven.archiva.repository.project.ProjectModelReader>,java.lang.String)
location: class org.apache.maven.archiva.database.jdo.JdoProjectModelDAOTest

/home/continuum/data/working-directory/393/src/test/java/org/apache/maven/archiva/database/jdo/JdoProjectModelDAOTest.java:[114,23]
cannot find symbol
symbol  : method getTestFile(java.lang.String)
location: class org.apache.maven.archiva.database.jdo.JdoProjectModelDAOTest

/home/continuum/data/working-directory/393/src/test/java/org/apache/maven/archiva/database/jdo/JdoProjectModelDAOTest.java:[116,8]
cannot find symbol
symbol  : method assertTrue(java.lang.String,boolean)
location: class org.apache.maven.archiva.database.jdo.JdoProjectModelDAOTest

/home/continuum/data/working-directory/393/src/test/java/org/apache/maven/archiva/database/jdo/JdoProjectModelDAOTest.java:[119,8]
cannot find symbol
symbol  : method assertNotNull(java.lang.String,org.apache.maven.archiva.model.ArchivaProjectModel)
location: class org.apache.maven.archiva.database.jdo.JdoProjectModelDAOTest

/home/continuum/data/working-directory/393/src/test/java/org/apache/maven/archiva/database/jdo/JdoProjectModelDAOTest.java:[133,8]
cannot find symbol
symbol  : method assertNotNull(java.lang.String,org.apache.maven.archiva.model.ArchivaProjectModel)
location: class org.apache.maven.archiva.database.jdo.JdoProjectModelDAOTest

/home/continuum/data/working-directory/393/src/test/java/org/apache/maven/archiva/database/jdo/JdoProjectModelDAOTest.java:[159,16]
cannot find symbol
symbol  : method assertNotNull(java.lang.String,java.lang.Object)
location: class org.apache.maven.archiva.database.jdo.JdoProjectModelDAOTest

/home/continuum/data/working-directory/393/src/test/java/org/apache/maven/archiva/database/jdo/JdoProjectModelDAOTest.java:[160,16]
cannot find symbol
symbol  : method assertTrue(java.lang.String,boolean)
location: class org.apache.maven.archiva.database.jdo.JdoProjectModelDAOTest

/home/continuum/data/working-directory/393/src/test/java/org/apache/maven/archiva/database/jdo/JdoProjectModelDAOTest.java:[162,16]
cannot find symbol
symbol  : method assertTrue(java.lang.String,boolean)
location: class org.apache.maven.archiva.database.jdo.JdoProjectModelDAOTest

/home/continuum/data/working-directory/393/src/test/java/org/apache/maven/archiva/database/jdo/JdoProjectModelDAOTest.java:[166,16]
cannot find symbol
symbol  : method fail(java.lang.String)
location: class org.apache.maven.archiva.database.jdo.JdoProjectModelDAOTest

/home/continuum/data/working-directory/393/src/test/java/org/apache/maven/archiva/database/constraints/UniqueFieldConstraintTest.java:[57,34]
cannot find symbol
symbol  : method lookup(java.lang.String,java.lang.String)
location: class org.apache.maven.archiva.database.constraints.UniqueFieldConstraintTest

/home/continuum/data/working-directory/393/src/test/java/org/apache/maven/archiva/database/constraints/UniqueFieldConstraintTest.java:[114,8]
cannot find symbol
symbol  : method assertNotNull(java.lang.String,java.util.List)
location: class org.apache.maven.archiva.database.constraints.UniqueFieldConstraintTest

/home/continuum/data/working-directory/393/src/test/java/org/apache/maven/archiva/database/constraints/UniqueFieldConstraintTest.java:[115,8]
cannot find symbol
symbol  : method assertEquals(java.lang.String,int,int)
location: class org.apache.maven.archiva.database.constraints.UniqueFieldConstraintTest

/home/continuum/data/working-directory/393/src/test/java/org/apache/maven/archiva/database/browsing/RepositoryBrowsingTest.java:[64,58]
cannot find symbol
symbol  : method lookup(java.lang.Class<org.apache.maven.archiva.database.browsing.RepositoryBrowsing>)
location: class org.apache.maven.archiva.database.browsing.RepositoryBrowsingTest

/home/continuum/data/working-directory/393/src/test/java/org/apache/maven/archiva/database/browsing/RepositoryBrowsingTest.java:[65,8]
cannot find symbol
symbol  : method assertNotNull(java.lang.String,org.apache.maven.archiva.database.browsing.RepositoryBrowsing)
location: class org.apache.maven.archiva.database.browsing.RepositoryBrowsingTest

/home/continuum/data/working-directory/393/src/test/java/org/apache/maven/archiva/database/browsing/RepositoryBrowsingTest.java:[113,8]
cannot find symbol
symbol  : method assertNotNull(java.lang.String,org.apache.maven.archiva.database.browsing.BrowsingResults)
location: class org.apache.maven.archiva.database.browsing.RepositoryBrowsingTest

/home/continuum/data/working-directory/393/src/test/java/org/apache/maven/archiva/database/browsing/RepositoryBrowsingTest.java:[126,8]
cannot find symbol
symbol  : method assertNotNull(java.lang.String,org.apache.maven.archiva.database.browsing.BrowsingResults)
location: class org.apache.maven.archiva.database.browsing.RepositoryBrowsingTest

/home/continuum/data/working-directory/393/src/test/java/org/apache/maven/archiva/database/browsing/RepositoryBrowsingTest.java:[135,8]
cannot find symbol
symbol  : method assertEquals(java.lang.String,int,int)
location: class org.apache.maven.archiva.database.browsing.RepositoryBrowsingTest

/home/continuum/data/working-directory/393/src/test/java/org/apache/maven/archiva/database/browsing/RepositoryBrowsingTest.java:[140,12]
cannot find symbol
symbol  : method assertTrue(java.lang.String,boolean)
location: class org.apache.maven.archiva.database.browsing.RepositoryBrowsingTest

/home/continuum/data/working-directory/393/src/test/java/org/apache/maven/archiva/database/browsing/RepositoryBrowsingTest.java:[150,38]
cannot find symbol
symbol  : method lookup(java.lang.String,java.lang.String)
location: class org.apache.maven.archiva.database.browsing.RepositoryBrowsingTest

/home/continuum/data/working-directory/393/src/test/java/org/apache/maven/archiva/database/jdo/JdoArtifactDAOTest.java:[46,8]
cannot find symbol
symbol  : method assertNotNull(java.lang.String,java.lang.Object)
location: class org.apache.maven.archiva.database.jdo.JdoArtifactDAOTest

/home/continuum/data/working-directory/393/src/test/java/org/apache/maven/archiva/database/jdo/JdoArtifactDAOTest.java:[47,8]
cannot find symbol
symbol  : method assertTrue(java.lang.String,boolean)
location: class org.apache.maven.archiva.database.jdo.JdoArtifactDAOTest

/home/continuum/data/working-directory/393/src/test/java/org/apache/maven/archiva/database/jdo/JdoArtifactDAOTest.java:[51,8]
cannot find symbol
symbol  : method assertEquals(java.lang.String,java.lang.String)
location: class org.apache.maven.archiva.database.jdo.JdoArtifactDAOTest

/home/continuum/data/working-directory/393/src/test/java/org/apache/maven/archiva/database/jdo/JdoArtifactDAOTest.java:[52,8]
cannot find symbol
symbol  : method assertEquals(java.lang.String,java.lang.String)
location: class org.apache.maven.archiva.database.jdo.JdoArtifactDAOTest

/home/continuum/data/working-directory/393/src/test/java/org/apache/maven/archiva/database/jdo/JdoArtifactDAOTest.java:[53,8]
cannot find symbol
symbol  : method assertEquals(java.lang.String,java.lang.String)
location: class org.apache.maven.archiva.database.jdo.JdoArtifactDAOTest

/home/continuum/data/working-directory/393/src/test/java/org/apache/maven/archiva/database/jdo/JdoArtifactDAOTest.java:[54,8]
cannot find symbol
symbol  : method assertEquals(java.lang.String,java.lang.String)
location: class org.apache.maven.archiva.database.jdo.JdoArtifactDAOTest

/home/continuum/data/working-directory/393/src/test/java/org/apache/maven/archiva/database/jdo/JdoArtifactDAOTest.java:[55,8]
cannot find symbol
symbol  : method assertEquals(java.lang.String,java.lang.String)
location: class org.apache.maven.archiva.database.jdo.JdoArtifactDAOTest

/home/continuum/data/working-directory/393/src/test/java/org/apache/maven/archiva/database/jdo/JdoArtifactDAOTest.java:[66,8]
cannot find symbol
symbol  : method assertNotNull(org.apache.maven.archiva.model.ArchivaArtifact)
location: class org.apache.maven.archiva.database.jdo.JdoArtifactDAOTest

/home/continuum/data/working-directory/393/src/test/java/org/apache/maven/archiva/database/jdo/JdoArtifactDAOTest.java:[74,8]
cannot find symbol
symbol  : method assertNotNull(org.apache.maven.archiva.model.ArchivaArtifact)
location: class org.apache.maven.archiva.database.jdo.JdoArtifactDAOTest

/home/continuum/data/working-directory/393/src/test/java/org/apache/maven/archiva/database/jdo/JdoArtifactDAOTest.java:[76,8]
cannot find symbol
symbol  : method assertEquals(java.lang.String,java.lang.String)
location: class org.apache.maven.archiva.database.jdo.JdoArtifactDAOTest

/home/continuum/data/working-directory/393/src/test/java/org/apache/maven/archiva/database/jdo/JdoArtifactDAOTest.java:[80,8]
cannot find symbol
symbol  : method assertNotNull(java.util.List)
location: class org.apache.maven.archiva.database.jdo.JdoArtifactDAOTest

/home/continuum/data/working-directory/393/src/test/java/org/apache/maven/archiva/database/jdo/JdoArtifactDAOTest.java:[81,8]
cannot find symbol
symbol  : method assertEquals(int,int)
location: class org.apache.maven.archiva.database.jdo.JdoArtifactDAOTest

/home/continuum/data/working-directory/393/src/test/java/org/apache/maven/archiva/database/jdo/JdoArtifactDAOTest.java:[85,8]
cannot find symbol
symbol  : method assertNotNull(org.apache.maven.archiva.model.ArchivaArtifact)
location: class org.apache.maven.archiva.database.jdo.JdoArtifactDAOTest

/home/continuum/data/working-directory/393/src/test/java/org/apache/maven/archiva/database/jdo/JdoArtifactDAOTest.java:[86,8]
cannot find symbol
symbol  : method assertEquals(java.lang.String,java.lang.String)
location: class org.apache.maven.archiva.database.jdo.JdoArtifactDAOTest

/home/continuum/data/working-directory/393/src/test/java/org/apache/maven/archiva/database/jdo/JdoArtifactDAOTest.java:[87,8]
cannot find symbol
symbol  : method assertEquals(java.lang.String,java.lang.String)
location: class org.apache.maven.archiva.database.jdo.JdoArtifactDAOTest

/home/continuum/data/working-directory/393/src/test/java/org/apache/maven/archiva/database/jdo/JdoArtifactDAOTest.java:[88,8]
cannot find symbol
symbol  : method assertEquals(java.lang.String,java.lang.String)
location: class org.apache.maven.archiva.database.jdo.JdoArtifactDAOTest

/home/continuum/data/working-directory/393/src/test/java/org/apache/maven/archiva/database/jdo/JdoArtifactDAOTest.java:[89,8]
cannot find symbol
symbol  : method assertEquals(java.lang.String,java.lang.String)
location: class org.apache.maven.archiva.database.jdo.JdoArtifactDAOTest

/home/continuum/data/working-directory/393/src/test/java/org/apache/maven/archiva/database/jdo/JdoArtifactDAOTest.java:[90,8]
cannot find symbol
symbol  : method assertEquals(java.lang.String,java.lang.String)
location: class org.apache.maven.archiva.database.jdo.JdoArtifactDAOTest

/home/continuum/data/working-directory/393/src/test/java/org/apache/maven/archiva/database/jdo/JdoArtifactDAOTest.java:[97,8]
cannot find symbol
symbol  : method assertEquals(int,int)
location: class org.apache.maven.archiva.database.jdo.JdoArtifactDAOTest

/home/continuum/data/working-directory/393/src/test/java/org/apache/maven/archiva/database/jdo/JdoArtifactDAOTest.java:[102,8]
cannot find symbol
symbol  : method assertNotNull(org.apache.maven.archiva.model.ArchivaArtifact)
location: class org.apache.maven.archiva.database.jdo.JdoArtifactDAOTest

/home/continuum/data/working-directory/393/src/test/java/org/apache/maven/archiva/database/jdo/JdoArtifactDAOTest.java:[105,8]
cannot find symbol
symbol  : method assertEquals(java.lang.String,java.lang.String)
location: class org.apache.maven.archiva.database.jdo.JdoArtifactDAOTest

/home/continuum/data/working-directory/393/src/test/java/org/apache/maven/archiva/database/jdo/JdoArtifactDAOTest.java:[106,8]
cannot find symbol
symbol  : method assertEquals(java.lang.String,java.lang.String)
location: class org.apache.maven.archiva.database.jdo.JdoArtifactDAOTest

/home/continuum/data/working-directory/393/src/test/java/org/apache/maven/archiva/database/jdo/JdoArtifactDAOTest.java:[109,8]
cannot find symbol
symbol  : method assertEquals(int,int)
location: class org.apache.maven.archiva.database.jdo.JdoArtifactDAOTest

/home/continuum/data/working-directory/393/src/test/java/org/apache/maven/archiva/database/jdo/JdoArtifactDAOTest.java:[113,8]
cannot find symbol
symbol  : method assertEquals(int,int)
location: class org.apache.maven.archiva.database.jdo.JdoArtifactDAOTest

/home/continuum/data/working-directory/393/src/test/java/org/apache/maven/archiva/database/constraints/RangeConstraintTest.java:[43,38]
cannot find symbol
symbol  : method lookup(java.lang.String,java.lang.String)
location: class org.apache.maven.archiva.database.constraints.RangeConstraintTest

/home/continuum/data/working-directory/393/src/test/java/org/apache/maven/archiva/database/constraints/RangeConstraintTest.java:[85,8]
cannot find symbol
symbol  : method assertNotNull(java.lang.String,java.util.List)
location: class org.apache.maven.archiva.database.constraints.RangeConstraintTest

/home/continuum/data/working-directory/393/src/test/java/org/apache/maven/archiva/database/constraints/RangeConstraintTest.java:[86,8]
cannot find symbol
symbol  : method assertEquals(java.lang.String,int,int)
location: class org.apache.maven.archiva.database.constraints.RangeConstraintTest


[INFO] ------------------------------------------------------------------------
[INFO] For more information, run Maven with the -e switch
[INFO] ------------------------------------------------------------------------
[INFO] Total time: 11 seconds
[INFO] Finished at: Sat Mar 15 22:44:27 PDT 2008
[INFO] Final Memory: 20M/36M
[INFO] ------------------------------------------------------------------------

****************************************************************************



Mime
View raw message