maven-notifications mailing list archives

Site index · List index
Message view « Date » · « Thread »
Top « Date » · « Thread »
From Continuum VMBuild Server <contin...@apache.org>
Subject [continuum] BUILD FAILURE: Archiva Consumers :: Database Consumers
Date Sun, 16 Mar 2008 05:45:44 GMT
Online report : http://vmbuild.apache.org/continuum/buildResult.action?buildId=66081&projectId=381

Build statistics:
  State: Failed
  Previous State: Ok
  Started at: Sat 15 Mar 2008 22:45:17 -0700
  Finished at: Sat 15 Mar 2008 22:45:35 -0700
  Total time: 18s
  Build Trigger: Schedule
  Build Number: 24
  Exit code: 1
  Building machine hostname: vmbuild.apache.org
  Operating system : Linux(unknown)
  Java Home version : 
          java version "1.6.0_05"
          Java(TM) SE Runtime Environment (build 1.6.0_05-b13)
          Java HotSpot(TM) Client VM (build 10.0-b19, mixed mode, sharing)
        
  Builder version :
          Maven version: 2.0.7
          Java version: 1.6.0_05
          OS name: "linux" version: "2.6.20-16-server" arch: "i386"
    
****************************************************************************
SCM Changes:
****************************************************************************
No files changed

****************************************************************************
Dependencies Changes:
****************************************************************************
org.apache.maven.archiva:archiva-consumer-api:1.1-SNAPSHOT

org.apache.maven.archiva:archiva-consumers:1.1-SNAPSHOT


****************************************************************************
Build Defintion:
****************************************************************************
POM filename: pom.xml
Goals: clean install   
Arguments: --batch-mode --non-recursive
Build Fresh: false
Always Build: false
Default Build Definition: true
Schedule: DEFAULT_SCHEDULE
Description: $build.buildDefinition.description


****************************************************************************
Test Summary:
****************************************************************************
Tests: 0
Failures: 0
Total time: 0

****************************************************************************
Output:
****************************************************************************
[INFO] Scanning for projects...
[INFO] ----------------------------------------------------------------------------
[INFO] Building Archiva Consumers :: Database Consumers
[INFO]    task-segment: [clean, install]
[INFO] ----------------------------------------------------------------------------
[INFO] [clean:clean]
[INFO] Deleting directory /home/continuum/data/working-directory/381/target
[INFO] Deleting directory /home/continuum/data/working-directory/381/target/classes
[INFO] Deleting directory /home/continuum/data/working-directory/381/target/test-classes
[INFO] Deleting directory /home/continuum/data/working-directory/381/target/site
[INFO] [plexus:descriptor {execution: generate}]
[INFO] snapshot org.apache.maven.archiva:archiva-database:1.1-SNAPSHOT: checking for updates
from apache.snapshots
[WARNING] POM for 'jpox:jpox:pom:1.1.9:compile' is invalid. It will be ignored for artifact
resolution. Reason: Not a v4.0.0 POM. for project jpox:jpox at /home/continuum/.m2/repository/jpox/jpox/1.1.9/jpox-1.1.9.pom
[INFO] snapshot org.apache.maven.archiva:archiva-artifact-reports:1.1-SNAPSHOT: checking for
updates from apache.snapshots
[INFO] snapshot org.apache.maven.archiva:archiva-reporting:1.1-SNAPSHOT: checking for updates
from apache.snapshots
[INFO] snapshot org.apache.maven.archiva:archiva-report-manager:1.1-SNAPSHOT: checking for
updates from apache.snapshots
[INFO] Setting property: classpath.resource.loader.class => 'org.codehaus.plexus.velocity.ContextClassLoaderResourceLoader'.
[INFO] Setting property: velocimacro.messages.on => 'false'.
[INFO] Setting property: resource.loader => 'classpath'.
[INFO] Setting property: resource.manager.logwhenfound => 'false'.
[INFO] [remote-resources:process {execution: default}]
[WARNING] Attempting to build MavenProject instance for Artifact of type: jar; constructing
POM artifact instead.
[WARNING] Invalid project model for artifact [jpox:jpox:1.1.9]. It will be ignored by the
remote resources Mojo.
[INFO] [resources:resources]
[INFO] Using default encoding to copy filtered resources.
[WARNING] POM for 'jpox:jpox:pom:1.1.9:compile' is invalid. It will be ignored for artifact
resolution. Reason: Not a v4.0.0 POM. for project jpox:jpox at /home/continuum/.m2/repository/jpox/jpox/1.1.9/jpox-1.1.9.pom
[INFO] [compiler:compile]
[INFO] Compiling 6 source files to /home/continuum/data/working-directory/381/target/classes
[INFO] [resources:testResources]
[INFO] Using default encoding to copy filtered resources.
[WARNING] POM for 'jpox:jpox:pom:1.1.9:compile' is invalid. It will be ignored for artifact
resolution. Reason: Not a v4.0.0 POM. for project jpox:jpox at /home/continuum/.m2/repository/jpox/jpox/1.1.9/jpox-1.1.9.pom
[INFO] [compiler:testCompile]
[INFO] Compiling 3 source files to /home/continuum/data/working-directory/381/target/test-classes
[INFO] ------------------------------------------------------------------------
[ERROR] BUILD FAILURE
[INFO] ------------------------------------------------------------------------
[INFO] Compilation failure

/home/continuum/data/working-directory/381/src/test/java/org/apache/maven/archiva/consumers/database/AbstractDatabaseCleanupTest.java:[30,33]
package org.codehaus.plexus.spring does not exist

/home/continuum/data/working-directory/381/src/test/java/org/apache/maven/archiva/consumers/database/AbstractDatabaseCleanupTest.java:[38,12]
cannot find symbol
symbol: class PlexusInSpringTestCase
    extends PlexusInSpringTestCase

/home/continuum/data/working-directory/381/src/test/java/org/apache/maven/archiva/consumers/database/AbstractDatabaseCleanupTest.java:[55,8]
cannot find symbol
symbol  : variable super
location: class org.apache.maven.archiva.consumers.database.AbstractDatabaseCleanupTest

/home/continuum/data/working-directory/381/src/test/java/org/apache/maven/archiva/consumers/database/AbstractDatabaseCleanupTest.java:[58,24]
cannot find symbol
symbol  : method getTestFile(java.lang.String)
location: class org.apache.maven.archiva.consumers.database.AbstractDatabaseCleanupTest

/home/continuum/data/working-directory/381/src/test/java/org/apache/maven/archiva/consumers/database/AbstractDatabaseCleanupTest.java:[60,8]
cannot find symbol
symbol  : method assertFalse(boolean)
location: class org.apache.maven.archiva.consumers.database.AbstractDatabaseCleanupTest

/home/continuum/data/working-directory/381/src/test/java/org/apache/maven/archiva/consumers/database/AbstractDatabaseCleanupTest.java:[63,39]
cannot find symbol
symbol  : method getTestFile(java.lang.String)
location: class org.apache.maven.archiva.consumers.database.AbstractDatabaseCleanupTest

/home/continuum/data/working-directory/381/src/test/java/org/apache/maven/archiva/consumers/database/AbstractDatabaseCleanupTest.java:[66,47]
cannot find symbol
symbol  : method lookup(java.lang.Class<org.apache.maven.archiva.configuration.ArchivaConfiguration>,java.lang.String)
location: class org.apache.maven.archiva.consumers.database.AbstractDatabaseCleanupTest

/home/continuum/data/working-directory/381/src/test/java/org/apache/maven/archiva/consumers/database/AbstractDatabaseCleanupTest.java:[70,36]
cannot find symbol
symbol  : method getBasedir()
location: class org.apache.maven.archiva.consumers.database.AbstractDatabaseCleanupTest

/home/continuum/data/working-directory/381/src/test/java/org/apache/maven/archiva/consumers/database/AbstractDatabaseCleanupTest.java:[74,55]
cannot find symbol
symbol  : method lookup(java.lang.Class<org.apache.maven.archiva.repository.RepositoryContentFactory>)
location: class org.apache.maven.archiva.consumers.database.AbstractDatabaseCleanupTest

/home/continuum/data/working-directory/381/src/test/java/org/apache/maven/archiva/consumers/database/DatabaseCleanupRemoveProjectConsumerTest.java:[105,13]
cannot find symbol
symbol  : method tearDown()
location: class org.apache.maven.archiva.consumers.database.AbstractDatabaseCleanupTest


[INFO] ------------------------------------------------------------------------
[INFO] For more information, run Maven with the -e switch
[INFO] ------------------------------------------------------------------------
[INFO] Total time: 10 seconds
[INFO] Finished at: Sat Mar 15 22:45:35 PDT 2008
[INFO] Final Memory: 20M/37M
[INFO] ------------------------------------------------------------------------

****************************************************************************



Mime
View raw message