maven-notifications mailing list archives

Site index · List index
Message view « Date » · « Thread »
Top « Date » · « Thread »
From Continuum VMBuild Server <contin...@apache.org>
Subject [continuum] BUILD FAILURE: Archiva Base :: Repository Converter
Date Sun, 16 Mar 2008 05:43:04 GMT
Online report : http://vmbuild.apache.org/continuum/buildResult.action?buildId=66079&projectId=392

Build statistics:
  State: Failed
  Previous State: Ok
  Started at: Sat 15 Mar 2008 22:42:38 -0700
  Finished at: Sat 15 Mar 2008 22:42:54 -0700
  Total time: 15s
  Build Trigger: Schedule
  Build Number: 24
  Exit code: 1
  Building machine hostname: vmbuild.apache.org
  Operating system : Linux(unknown)
  Java Home version : 
          java version "1.6.0_05"
          Java(TM) SE Runtime Environment (build 1.6.0_05-b13)
          Java HotSpot(TM) Client VM (build 10.0-b19, mixed mode, sharing)
        
  Builder version :
          Maven version: 2.0.7
          Java version: 1.6.0_05
          OS name: "linux" version: "2.6.20-16-server" arch: "i386"
    
****************************************************************************
SCM Changes:
****************************************************************************
Changed: joakime @ Sat 15 Mar 2008 21:48:58 -0700
Comment: Removing unused imports.
Files changed:
  /maven/archiva/trunk/archiva-base/archiva-artifact-converter/src/test/java/org/apache/maven/archiva/converter/artifact/LegacyToDefaultConverterTest.java
( 637540 )
  /maven/archiva/trunk/archiva-base/archiva-consumers/archiva-lucene-consumers/src/test/java/org/apache/maven/archiva/consumers/lucene/stubs/LuceneRepositoryContentIndexFactoryStub.java
( 637540 )
  /maven/archiva/trunk/archiva-base/archiva-converter/src/main/java/org/apache/maven/archiva/converter/legacy/DefaultLegacyRepositoryConverter.java
( 637540 )
  /maven/archiva/trunk/archiva-base/archiva-dependency-graph/src/test/java/org/apache/maven/archiva/dependency/graph/MavenProjectInfoReportsPluginDependencyGraphTest.java
( 637540 )
  /maven/archiva/trunk/archiva-base/archiva-dependency-graph/src/test/java/org/apache/maven/archiva/dependency/graph/tasks/DependencyManagementStackTest.java
( 637540 )
  /maven/archiva/trunk/archiva-base/archiva-dependency-graph/src/test/java/org/apache/maven/archiva/dependency/graph/walk/DependencyGraphWalkerTest.java
( 637540 )
  /maven/archiva/trunk/archiva-base/archiva-dependency-graph/src/test/java/org/apache/maven/archiva/dependency/graph/walk/WalkCollector.java
( 637540 )
  /maven/archiva/trunk/archiva-base/archiva-indexer/src/main/java/org/apache/maven/archiva/indexer/filecontent/FileContentRecord.java
( 637540 )
  /maven/archiva/trunk/archiva-base/archiva-indexer/src/main/java/org/apache/maven/archiva/indexer/lucene/analyzers/ClassnameTokenizer.java
( 637540 )
  /maven/archiva/trunk/archiva-base/archiva-indexer/src/main/java/org/apache/maven/archiva/indexer/lucene/analyzers/FilenamesTokenizer.java
( 637540 )
  /maven/archiva/trunk/archiva-base/archiva-indexer/src/main/java/org/apache/maven/archiva/indexer/lucene/analyzers/GroupIdTokenizer.java
( 637540 )
  /maven/archiva/trunk/archiva-base/archiva-indexer/src/main/java/org/apache/maven/archiva/indexer/lucene/analyzers/VersionTokenizer.java
( 637540 )
  /maven/archiva/trunk/archiva-base/archiva-model/src/main/java/org/apache/maven/archiva/model/Keys.java
( 637540 )
  /maven/archiva/trunk/archiva-base/archiva-repository-layer/src/main/java/org/apache/maven/archiva/repository/RemoteRepositoryContent.java
( 637540 )
  /maven/archiva/trunk/archiva-base/archiva-transaction/src/main/java/org/apache/maven/archiva/transaction/AbstractTransactionEvent.java
( 637540 )
  /maven/archiva/trunk/archiva-base/archiva-transaction/src/main/java/org/apache/maven/archiva/transaction/CreateFileEvent.java
( 637540 )
  /maven/archiva/trunk/archiva-base/archiva-transaction/src/test/java/org/apache/maven/archiva/transaction/AbstractFileEventTest.java
( 637540 )
  /maven/archiva/trunk/archiva-cli/src/main/java/org/apache/maven/archiva/cli/ArchivaCli.java
( 637540 )
  /maven/archiva/trunk/archiva-database/src/main/java/org/apache/maven/archiva/database/ArchivaDAO.java
( 637540 )
  /maven/archiva/trunk/archiva-scheduled/src/test/java/org/apache/maven/archiva/scheduled/executors/ArchivaDatabaseUpdateTaskExecutorTest.java
( 637540 )
  /maven/archiva/trunk/archiva-scheduled/src/test/java/org/apache/maven/archiva/scheduled/executors/ArchivaRepositoryScanningTaskExecutorTest.java
( 637540 )
  /maven/archiva/trunk/archiva-web/archiva-webapp/src/main/java/org/apache/maven/archiva/web/action/admin/repositories/AbstractRepositoriesAdminAction.java
( 637540 )
  /maven/archiva/trunk/archiva-web/archiva-webapp/src/main/java/org/apache/maven/archiva/web/util/VersionMerger.java
( 637540 )
  /maven/archiva/trunk/archiva-web/archiva-webapp/src/test/java/org/apache/maven/archiva/web/repository/RepositoryServletProxiedRelocatedTest.java
( 637540 )

****************************************************************************
Dependencies Changes:
****************************************************************************
org.apache.maven.archiva:archiva-consumer-api:1.1-SNAPSHOT

org.apache.maven.archiva:archiva-artifact-converter:1.1-SNAPSHOT

org.apache.maven.archiva:archiva-base:1.1-SNAPSHOT


****************************************************************************
Build Defintion:
****************************************************************************
POM filename: pom.xml
Goals: clean install   
Arguments: --batch-mode --non-recursive
Build Fresh: false
Always Build: false
Default Build Definition: true
Schedule: DEFAULT_SCHEDULE
Description: $build.buildDefinition.description


****************************************************************************
Test Summary:
****************************************************************************
Tests: 0
Failures: 0
Total time: 0

****************************************************************************
Output:
****************************************************************************
[INFO] Scanning for projects...
[INFO] ----------------------------------------------------------------------------
[INFO] Building Archiva Base :: Repository Converter
[INFO]    task-segment: [clean, install]
[INFO] ----------------------------------------------------------------------------
[INFO] [clean:clean]
[INFO] Deleting directory /home/continuum/data/working-directory/392/target
[INFO] Deleting directory /home/continuum/data/working-directory/392/target/classes
[INFO] Deleting directory /home/continuum/data/working-directory/392/target/test-classes
[INFO] Deleting directory /home/continuum/data/working-directory/392/target/site
[INFO] [plexus:descriptor {execution: generate}]
[INFO] snapshot org.apache.maven.archiva:archiva-artifact-converter:1.1-SNAPSHOT: checking
for updates from apache.snapshots
[INFO] Setting property: classpath.resource.loader.class => 'org.codehaus.plexus.velocity.ContextClassLoaderResourceLoader'.
[INFO] Setting property: velocimacro.messages.on => 'false'.
[INFO] Setting property: resource.loader => 'classpath'.
[INFO] Setting property: resource.manager.logwhenfound => 'false'.
[INFO] [remote-resources:process {execution: default}]
[INFO] [resources:resources]
[INFO] Using default encoding to copy filtered resources.
[INFO] [compiler:compile]
[INFO] Compiling 4 source files to /home/continuum/data/working-directory/392/target/classes
[INFO] [resources:testResources]
[INFO] Using default encoding to copy filtered resources.
[INFO] [compiler:testCompile]
[INFO] Compiling 1 source file to /home/continuum/data/working-directory/392/target/test-classes
[INFO] ------------------------------------------------------------------------
[ERROR] BUILD FAILURE
[INFO] ------------------------------------------------------------------------
[INFO] Compilation failure

/home/continuum/data/working-directory/392/src/test/java/org/apache/maven/archiva/converter/RepositoryConverterTest.java:[30,33]
package org.codehaus.plexus.spring does not exist

/home/continuum/data/working-directory/392/src/test/java/org/apache/maven/archiva/converter/RepositoryConverterTest.java:[47,12]
cannot find symbol
symbol: class PlexusInSpringTestCase
    extends PlexusInSpringTestCase

/home/continuum/data/working-directory/392/src/test/java/org/apache/maven/archiva/converter/RepositoryConverterTest.java:[64,8]
cannot find symbol
symbol  : variable super
location: class org.apache.maven.archiva.converter.RepositoryConverterTest

/home/continuum/data/working-directory/392/src/test/java/org/apache/maven/archiva/converter/RepositoryConverterTest.java:[66,72]
cannot find symbol
symbol  : method lookup(java.lang.String)
location: class org.apache.maven.archiva.converter.RepositoryConverterTest

/home/continuum/data/working-directory/392/src/test/java/org/apache/maven/archiva/converter/RepositoryConverterTest.java:[68,69]
cannot find symbol
symbol  : method lookup(java.lang.String,java.lang.String)
location: class org.apache.maven.archiva.converter.RepositoryConverterTest

/home/continuum/data/working-directory/392/src/test/java/org/apache/maven/archiva/converter/RepositoryConverterTest.java:[70,26]
cannot find symbol
symbol  : method getTestFile(java.lang.String)
location: class org.apache.maven.archiva.converter.RepositoryConverterTest

/home/continuum/data/working-directory/392/src/test/java/org/apache/maven/archiva/converter/RepositoryConverterTest.java:[74,44]
cannot find symbol
symbol  : method lookup(java.lang.String,java.lang.String)
location: class org.apache.maven.archiva.converter.RepositoryConverterTest

/home/continuum/data/working-directory/392/src/test/java/org/apache/maven/archiva/converter/RepositoryConverterTest.java:[76,26]
cannot find symbol
symbol  : method getTestFile(java.lang.String)
location: class org.apache.maven.archiva.converter.RepositoryConverterTest

/home/continuum/data/working-directory/392/src/test/java/org/apache/maven/archiva/converter/RepositoryConverterTest.java:[77,32]
cannot find symbol
symbol  : method getTestFile(java.lang.String)
location: class org.apache.maven.archiva.converter.RepositoryConverterTest

/home/continuum/data/working-directory/392/src/test/java/org/apache/maven/archiva/converter/RepositoryConverterTest.java:[85,58]
cannot find symbol
symbol  : method lookup(java.lang.String,java.lang.String)
location: class org.apache.maven.archiva.converter.RepositoryConverterTest

/home/continuum/data/working-directory/392/src/test/java/org/apache/maven/archiva/converter/RepositoryConverterTest.java:[87,44]
cannot find symbol
symbol  : method lookup(java.lang.String)
location: class org.apache.maven.archiva.converter.RepositoryConverterTest

/home/continuum/data/working-directory/392/src/test/java/org/apache/maven/archiva/converter/RepositoryConverterTest.java:[89,22]
cannot find symbol
symbol  : method lookup(java.lang.String)
location: class org.apache.maven.archiva.converter.RepositoryConverterTest

/home/continuum/data/working-directory/392/src/test/java/org/apache/maven/archiva/converter/RepositoryConverterTest.java:[95,8]
cannot find symbol
symbol  : variable super
location: class org.apache.maven.archiva.converter.RepositoryConverterTest


[INFO] ------------------------------------------------------------------------
[INFO] For more information, run Maven with the -e switch
[INFO] ------------------------------------------------------------------------
[INFO] Total time: 8 seconds
[INFO] Finished at: Sat Mar 15 22:42:53 PDT 2008
[INFO] Final Memory: 19M/35M
[INFO] ------------------------------------------------------------------------

****************************************************************************



Mime
View raw message