maven-notifications mailing list archives

Site index · List index
Message view « Date » · « Thread »
Top « Date » · « Thread »
From "Continuum@maven.zones.apache.org" <contin...@maven.zones.apache.org>
Subject [continuum] BUILD FAILURE: Archiva Base :: Proxy
Date Thu, 21 Feb 2008 05:09:27 GMT
Online report : http://maven.zones.apache.org/continuum/buildResult.action?buildId=42233&projectId=282

Build statistics:
  State: Failed
  Previous State: Ok
  Started at: Thu 21 Feb 2008 05:09:07 +0000
  Finished at: Thu 21 Feb 2008 05:09:22 +0000
  Total time: 15s
  Build Trigger: Schedule
  Build Number: 239
  Exit code: 1
  Building machine hostname: maven.zones.apache.org
  Operating system : SunOS(unknown)
  Java Home version : 
          java version "1.5.0_14"
          Java(TM) 2 Runtime Environment, Standard Edition (build 1.5.0_14-b03)
          Java HotSpot(TM) Server VM (build 1.5.0_14-b03, mixed mode)
        
  Builder version :
          Maven version: 2.0.7
          Java version: 1.5.0_14
          OS name: "sunos" version: "5.10" arch: "x86"
    
****************************************************************************
SCM Changes:
****************************************************************************
No files changed

****************************************************************************
Dependencies Changes:
****************************************************************************
org.apache.maven.archiva:archiva-base:1.1-SNAPSHOT


****************************************************************************
Build Defintion:
****************************************************************************
POM filename: pom.xml
Goals: clean install   
Arguments: --batch-mode --non-recursive
Build Fresh: false
Always Build: false
Default Build Definition: true
Schedule: DEFAULT_SCHEDULE
Description: 


****************************************************************************
Test Summary:
****************************************************************************
Tests: 217
Failures: 77
Total time: 2199

****************************************************************************
Output:
****************************************************************************
[INFO] Scanning for projects...
[INFO] ----------------------------------------------------------------------------
[INFO] Building Archiva Base :: Proxy
[INFO]    task-segment: [clean, install]
[INFO] ----------------------------------------------------------------------------
[INFO] [clean:clean]
[INFO] Deleting directory /export/home/build/data/continuum/checkouts/282/target
[INFO] [plexus:descriptor {execution: generate}]
[INFO] Setting property: classpath.resource.loader.class => 'org.codehaus.plexus.velocity.ContextClassLoaderResourceLoader'.
[INFO] Setting property: velocimacro.messages.on => 'false'.
[INFO] Setting property: resource.loader => 'classpath'.
[INFO] Setting property: resource.manager.logwhenfound => 'false'.
[INFO] [remote-resources:process {execution: default}]
[INFO] [resources:resources]
[INFO] Using default encoding to copy filtered resources.
[INFO] Resource directory does not exist: /export/home/build/data/continuum/checkouts/282/src/main/resources
[INFO] Copying 1 resource
[INFO] Copying 2 resources
[INFO] [compiler:compile]
[INFO] [resources:testResources]
[INFO] Using default encoding to copy filtered resources.
[INFO] Copying 8 resources
[INFO] Copying 2 resources
[INFO] [compiler:testCompile]
[INFO] [surefire:test]
[INFO] Surefire report directory: /export/home/build/data/continuum/checkouts/282/target/surefire-reports

-------------------------------------------------------
 T E S T S
-------------------------------------------------------
Running org.apache.maven.archiva.proxy.ManagedLegacyTransferTest
Tests run: 8, Failures: 0, Errors: 8, Skipped: 0, Time elapsed: 0.899 sec <<< FAILURE!
Running org.apache.maven.archiva.proxy.CacheFailuresTransferTest
Tests run: 3, Failures: 0, Errors: 3, Skipped: 0, Time elapsed: 0.126 sec <<< FAILURE!
Running org.apache.maven.archiva.proxy.SnapshotTransferTest
Tests run: 9, Failures: 0, Errors: 9, Skipped: 0, Time elapsed: 0.181 sec <<< FAILURE!
Running org.apache.maven.archiva.proxy.ChecksumTransferTest
Tests run: 18, Failures: 0, Errors: 18, Skipped: 0, Time elapsed: 0.345 sec <<< FAILURE!
Running org.apache.maven.archiva.proxy.MetadataTransferTest
Tests run: 25, Failures: 0, Errors: 25, Skipped: 0, Time elapsed: 0.598 sec <<< FAILURE!
Running org.apache.maven.archiva.proxy.ManagedDefaultTransferTest
Tests run: 14, Failures: 0, Errors: 14, Skipped: 0, Time elapsed: 0.233 sec <<< FAILURE!

Results :
Tests run: 77, Failures: 0, Errors: 77, Skipped: 0

[INFO] ------------------------------------------------------------------------
[ERROR] BUILD FAILURE
[INFO] ------------------------------------------------------------------------
[INFO] There are test failures.
[INFO] ------------------------------------------------------------------------
[INFO] For more information, run Maven with the -e switch
[INFO] ------------------------------------------------------------------------
[INFO] Total time: 12 seconds
[INFO] Finished at: Thu Feb 21 05:09:22 GMT+00:00 2008
[INFO] Final Memory: 17M/330M
[INFO] ------------------------------------------------------------------------

****************************************************************************



Mime
View raw message