maven-notifications mailing list archives

Site index · List index
Message view « Date » · « Thread »
Top « Date » · « Thread »
From "Continuum@maven.zones.apache.org" <contin...@maven.zones.apache.org>
Subject [continuum] BUILD FAILURE: Maven Ear plugin
Date Tue, 05 Feb 2008 05:47:33 GMT
Online report : http://maven.zones.apache.org/continuum/buildResult.action?buildId=41532&projectId=16

Build statistics:
  State: Failed
  Previous State: Ok
  Started at: Tue 5 Feb 2008 05:44:33 +0000
  Finished at: Tue 5 Feb 2008 05:47:29 +0000
  Total time: 2m 56s
  Build Trigger: Schedule
  Build Number: 109
  Exit code: 1
  Building machine hostname: maven.zones.apache.org
  Operating system : SunOS(unknown)
  Java Home version : 
          java version "1.4.2_09"
          Java(TM) 2 Runtime Environment, Standard Edition (build 1.4.2_09-b05)
          Java HotSpot(TM) Client VM (build 1.4.2_09-b05, mixed mode)
        
  Builder version :
          Maven version: 2.0.8
          Java version: 1.4.2_09
          OS name: "sunos" version: "5.10" arch: "x86" Family: "unix"
    
****************************************************************************
SCM Changes:
****************************************************************************
No files changed

****************************************************************************
Dependencies Changes:
****************************************************************************
No dependencies changed


****************************************************************************
Build Defintion:
****************************************************************************
POM filename: pom.xml
Goals: clean install   
Arguments: --batch-mode --non-recursive -P integration-tests
Build Fresh: true
Always Build: true
Default Build Definition: false
Schedule: Integration Test Run
Profile Name: JDK 1.4.2 / Maven 2.0.8
Description: 


****************************************************************************
Test Summary:
****************************************************************************
Tests: 63
Failures: 8
Total time: 161688

****************************************************************************
Output:
****************************************************************************
[INFO] Scanning for projects...
[INFO] ------------------------------------------------------------------------
[INFO] Building Maven Ear plugin
[INFO]    task-segment: [clean, install]
[INFO] ------------------------------------------------------------------------
[INFO] [clean:clean]
[INFO] [plugin:descriptor]
[INFO] Using 2 extractors.
[INFO] Applying extractor for language: java
[INFO] Extractor for language: java found 2 mojo descriptors.
[INFO] Applying extractor for language: bsh
[INFO] Extractor for language: bsh found 0 mojo descriptors.
[INFO] [resources:resources]
[INFO] Using default encoding to copy filtered resources.
[INFO] Copying 0 resource
[INFO] [compiler:compile]
[INFO] Compiling 32 source files to /export/home/build/data/continuum/checkouts/16/target/classes
[INFO] [resources:testResources]
[INFO] Using default encoding to copy filtered resources.
[INFO] Copying 120 resources
[INFO] [compiler:testCompile]
[INFO] Compiling 7 source files to /export/home/build/data/continuum/checkouts/16/target/test-classes
[INFO] [surefire:test]
[INFO] Surefire report directory: /export/home/build/data/continuum/checkouts/16/target/surefire-reports

-------------------------------------------------------
 T E S T S
-------------------------------------------------------
Running org.apache.maven.plugin.ear.EarModuleTest
Tests run: 1, Failures: 0, Errors: 0, Skipped: 0, Time elapsed: 0.054 sec
Running org.apache.maven.plugin.ear.output.FileNameMappingFactoryTest
Tests run: 6, Failures: 0, Errors: 0, Skipped: 0, Time elapsed: 0.015 sec
Running org.apache.maven.plugin.ear.util.ArtifactRepositoryTest
Tests run: 5, Failures: 0, Errors: 0, Skipped: 0, Time elapsed: 0.017 sec
Running org.apache.maven.plugin.ear.EarMojoTest
Skipped project-016: need a way to extract the EAR archive
Tests run: 42, Failures: 8, Errors: 0, Skipped: 0, Time elapsed: 161.646 sec <<<
FAILURE!
Running org.apache.maven.plugin.ear.util.ArtifactTypeMappingServiceTest
Tests run: 9, Failures: 0, Errors: 0, Skipped: 0, Time elapsed: 0.018 sec

Results :

Failed tests: 
  testProject031(org.apache.maven.plugin.ear.EarMojoTest)
  testProject032(org.apache.maven.plugin.ear.EarMojoTest)
  testProject033(org.apache.maven.plugin.ear.EarMojoTest)
  testProject034(org.apache.maven.plugin.ear.EarMojoTest)
  testProject036(org.apache.maven.plugin.ear.EarMojoTest)
  testProject039(org.apache.maven.plugin.ear.EarMojoTest)
  testProject041(org.apache.maven.plugin.ear.EarMojoTest)
  testProject042(org.apache.maven.plugin.ear.EarMojoTest)

Tests run: 63, Failures: 8, Errors: 0, Skipped: 0

[INFO] ------------------------------------------------------------------------
[ERROR] BUILD FAILURE
[INFO] ------------------------------------------------------------------------
[INFO] There are test failures.

Please refer to /export/home/build/data/continuum/checkouts/16/target/surefire-reports for
the individual test results.
[INFO] ------------------------------------------------------------------------
[INFO] For more information, run Maven with the -e switch
[INFO] ------------------------------------------------------------------------
[INFO] Total time: 2 minutes 53 seconds
[INFO] Finished at: Tue Feb 05 05:47:29 GMT+00:00 2008
[INFO] Final Memory: 15M/28M
[INFO] ------------------------------------------------------------------------

****************************************************************************



Mime
View raw message