maven-notifications mailing list archives

Site index · List index
Message view « Date » · « Thread »
Top « Date » · « Thread »
From "Continuum@maven.zones.apache.org" <contin...@maven.zones.apache.org>
Subject [continuum] BUILD FAILURE: Maven Eclipse Plugin
Date Mon, 04 Feb 2008 15:10:40 GMT
Online report : http://maven.zones.apache.org/continuum/buildResult.action?buildId=41388&projectId=17

Build statistics:
  State: Failed
  Previous State: Failed
  Started at: Mon 4 Feb 2008 14:51:40 +0000
  Finished at: Mon 4 Feb 2008 15:07:38 +0000
  Total time: 15m 58s
  Build Trigger: Schedule
  Build Number: 97
  Exit code: 1
  Building machine hostname: maven.zones.apache.org
  Operating system : SunOS(unknown)
  Java Home version : 
          java version "1.4.2_09"
          Java(TM) 2 Runtime Environment, Standard Edition (build 1.4.2_09-b05)
          Java HotSpot(TM) Client VM (build 1.4.2_09-b05, mixed mode)
        
  Builder version :
          Maven version: 2.0.7
          Java version: 1.4.2_09
          OS name: "sunos" version: "5.10" arch: "x86"
    
****************************************************************************
SCM Changes:
****************************************************************************
No files changed

****************************************************************************
Dependencies Changes:
****************************************************************************
No dependencies changed


****************************************************************************
Build Defintion:
****************************************************************************
POM filename: pom.xml
Goals: clean install   
Arguments: --batch-mode --non-recursive -P integration-tests
Build Fresh: true
Always Build: true
Default Build Definition: false
Schedule: Integration Test Run
Profile Name: JDK 1.4.2
Description: 


****************************************************************************
Test Summary:
****************************************************************************
Tests: 88
Failures: 3
Total time: 578842

****************************************************************************
Output:
****************************************************************************
[INFO] Scanning for projects...
[INFO] ----------------------------------------------------------------------------
[INFO] Building Maven Eclipse Plugin
[INFO]    task-segment: [clean, install]
[INFO] ----------------------------------------------------------------------------
[INFO] [clean:clean]
[INFO] [plugin:descriptor]
[INFO] Using 2 extractors.
[INFO] Applying extractor for language: java
[INFO] Extractor for language: java found 12 mojo descriptors.
[INFO] Applying extractor for language: bsh
[INFO] Extractor for language: bsh found 0 mojo descriptors.
[INFO] Setting property: classpath.resource.loader.class => 'org.codehaus.plexus.velocity.ContextClassLoaderResourceLoader'.
[INFO] Setting property: velocimacro.messages.on => 'false'.
[INFO] Setting property: resource.loader => 'classpath'.
[INFO] Setting property: resource.manager.logwhenfound => 'false'.
[INFO] [remote-resources:process {execution: default}]
[INFO] [resources:resources]
[INFO] Using default encoding to copy filtered resources.
[INFO] Copying 3 resources
[INFO] Copying 2 resources
[INFO] [compiler:compile]
[INFO] Compiling 62 source files to /export/home/build/data/continuum/checkouts/17/target/classes
[INFO] [resources:testResources]
[INFO] Using default encoding to copy filtered resources.
[INFO] Copying 425 resources
[INFO] Copying 2 resources
[INFO] [compiler:testCompile]
[INFO] Compiling 19 source files to /export/home/build/data/continuum/checkouts/17/target/test-classes
[INFO] [surefire:test]
[INFO] Surefire report directory: /export/home/build/data/continuum/checkouts/17/target/surefire-reports

-------------------------------------------------------
 T E S T S
-------------------------------------------------------
Running org.apache.maven.plugin.eclipse.AddMavenRepoMojoTest
Tests run: 1, Failures: 0, Errors: 0, Skipped: 0, Time elapsed: 0.484 sec
Running org.apache.maven.plugin.ide.IdeUtilsTest
Tests run: 1, Failures: 0, Errors: 0, Skipped: 0, Time elapsed: 0.018 sec
Running org.apache.maven.plugin.eclipse.BuildCommandTest
Tests run: 1, Failures: 0, Errors: 0, Skipped: 0, Time elapsed: 0.006 sec
Running org.apache.maven.plugin.eclipse.MyEclipsePluginTest
*** Running test builds; output will be directed to: target/surefire-reports/build-output

Using target/it-build-target and target/it-build-target/classes to build IT version of plugin
Now Building test version of the plugin...
Using staged plugin-pom: /export/home/build/data/continuum/checkouts/17/pom-test.xml
Using IT Plugin Jar: /export/home/build/data/continuum/checkouts/17/target/it-build-target/maven-eclipse-plugin-test.jar
[INFO] Installing /export/home/build/data/continuum/checkouts/17/target/it-build-target/maven-eclipse-plugin-test.jar
to /export/home/build/data/continuum/checkouts/17/target/test-classes/m2repo/org/apache/maven/plugins/maven-eclipse-plugin/test/maven-eclipse-plugin-test.jar
*** Installed test-version of the Eclipse plugin to: /export/home/build/data/continuum/checkouts/17/target/test-classes/m2repo

Tests run: 4, Failures: 0, Errors: 0, Skipped: 0, Time elapsed: 119.638 sec
Running org.apache.maven.plugin.eclipse.RadPluginTest
Tests run: 7, Failures: 0, Errors: 0, Skipped: 0, Time elapsed: 118.507 sec
Running org.apache.maven.plugin.eclipse.writers.EclipseOSGiManifestWriterTest
Tests run: 3, Failures: 0, Errors: 0, Skipped: 0, Time elapsed: 0.038 sec
Running org.apache.maven.plugin.eclipse.writers.workspace.EclipseCodeFormatterTest
Tests run: 1, Failures: 0, Errors: 0, Skipped: 0, Time elapsed: 0.007 sec
Running org.apache.maven.plugin.eclipse.EclipseWorkspaceTest
Tests run: 2, Failures: 0, Errors: 0, Skipped: 0, Time elapsed: 6.975 sec
Running org.apache.maven.plugin.eclipse.EclipsePluginMasterProjectTest
Tests run: 6, Failures: 0, Errors: 0, Skipped: 0, Time elapsed: 24.513 sec
Running org.apache.maven.plugin.eclipse.writers.EclipseClasspathWriterUnitTest
[debug] Processing resource src/main/resources: output=target/classes; default output=target/classes
[debug] Processing resource src/test/resources: output=target/classes/test-resources; default
output=target/classes
[debug] Marking as special to prevent output folder nesting: src/test/resources (output=target/classes/test-resources)
[info] Creating maven-eclipse.xml Ant file to handle resources
[info] Creating external launcher file
Tests run: 1, Failures: 0, Errors: 0, Skipped: 0, Time elapsed: 0.263 sec
Running org.apache.maven.plugin.eclipse.writers.testutils.TestEclipseWriterConfig
Tests run: 0, Failures: 0, Errors: 0, Skipped: 0, Time elapsed: 0.002 sec
Running org.apache.maven.plugin.eclipse.EclipsePluginTest
Tests run: 46, Failures: 0, Errors: 3, Skipped: 0, Time elapsed: 307.862 sec <<<
FAILURE!
Running org.apache.maven.plugin.eclipse.EclipsePluginUnitTest
[debug] testOutput toRelativeAndFixSeparator /var/tmp/EclipsePlugin.unitTest.1202137302845
, target/main-output
[debug] testOutput after toRelative : target/main-output
[debug] Processing resource dir: src/main/resources
[debug] Making relative and fixing separator: { /var/tmp/EclipsePlugin.unitTest.1202137302845,
/var/tmp/EclipsePlugin.unitTest.1202137302845/target/main-output, false }.
[debug] Adding eclipse source dir: { src/main/resources, target/main-output, true, true, null,
null }.
[debug] Processing resource dir: src/main/resources
[debug] Making relative and fixing separator: { /var/tmp/EclipsePlugin.unitTest.1202137303205,
/var/tmp/EclipsePlugin.unitTest.1202137303205/target/classes/main-output, false }.
[debug] Adding eclipse source dir: { src/main/resources, target/classes/main-output, true,
false, null, null }.
[debug] Processing resource dir: src/main/resources
[debug] Making relative and fixing separator: { /var/tmp/EclipsePlugin.unitTest.1202137303235,
/var/tmp/EclipsePlugin.unitTest.1202137303235/target/main-output, false }.
[debug] Adding eclipse source dir: { src/main/resources, target/main-output, true, false,
null, null }.
[debug] Processing resource dir: src/main/resources
[debug] Making relative and fixing separator: { /var/tmp/EclipsePlugin.unitTest.1202137303375,
/var/tmp/EclipsePlugin.unitTest.1202137303375/target/classes, false }.
[debug] Adding eclipse source dir: { src/main/resources, target/classes, true, false, null,
null }.
[debug] Processing resource dir: src/test/resources
[debug] Making relative and fixing separator: { /var/tmp/EclipsePlugin.unitTest.1202137303375,
/var/tmp/EclipsePlugin.unitTest.1202137303375/target/test-classes, false }.
[debug] Adding eclipse source dir: { src/test/resources, target/test-classes, true, false,
null, null }.
[debug] Processing resource dir: src/main/resources
[debug] Making relative and fixing separator: { /var/tmp/EclipsePlugin.unitTest.1202137303605,
/var/tmp/EclipsePlugin.unitTest.1202137303605/target/classes, false }.
[debug] Adding eclipse source dir: { src-main-resources, target/classes, true, false, null,
null }.
[debug] Processing resource dir: src/test/resources
[debug] Making relative and fixing separator: { /var/tmp/EclipsePlugin.unitTest.1202137303605,
/var/tmp/EclipsePlugin.unitTest.1202137303605/target/test-classes, false }.
[debug] Adding eclipse source dir: { src-test-resources, target/test-classes, true, false,
null, null }.
Tests run: 5, Failures: 0, Errors: 0, Skipped: 0, Time elapsed: 1.182 sec
Running org.apache.maven.plugin.eclipse.EclipseToMavenTest
Tests run: 5, Failures: 0, Errors: 0, Skipped: 0, Time elapsed: 0.259 sec
Running org.apache.maven.plugin.eclipse.MakeArtifactsTest
Tests run: 5, Failures: 0, Errors: 0, Skipped: 0, Time elapsed: 0.005 sec

Results :

Tests in error: 
  testProject16(org.apache.maven.plugin.eclipse.EclipsePluginTest)
  testProject17(org.apache.maven.plugin.eclipse.EclipsePluginTest)
  testMECLIPSE_56_encoding(org.apache.maven.plugin.eclipse.EclipsePluginTest)

Tests run: 88, Failures: 0, Errors: 3, Skipped: 0

[INFO] ------------------------------------------------------------------------
[ERROR] BUILD FAILURE
[INFO] ------------------------------------------------------------------------
[INFO] There are test failures.

Please refer to /export/home/build/data/continuum/checkouts/17/target/surefire-reports for
the individual test results.
[INFO] ------------------------------------------------------------------------
[INFO] For more information, run Maven with the -e switch
[INFO] ------------------------------------------------------------------------
[INFO] Total time: 15 minutes 55 seconds
[INFO] Finished at: Mon Feb 04 15:07:38 GMT+00:00 2008
[INFO] Final Memory: 32M/58M
[INFO] ------------------------------------------------------------------------

****************************************************************************



Mime
View raw message