maven-notifications mailing list archives

Site index · List index
Message view « Date » · « Thread »
Top « Date » · « Thread »
From "Continuum@maven.zones.apache.org" <contin...@maven.zones.apache.org>
Subject [continuum] BUILD FAILURE: Maven Eclipse Plugin
Date Thu, 31 Jan 2008 11:32:44 GMT
Online report : http://maven.zones.apache.org/continuum/buildResult.action?buildId=40887&projectId=17

Build statistics:
  State: Failed
  Previous State: Failed
  Started at: Thu 31 Jan 2008 11:23:44 +0000
  Finished at: Thu 31 Jan 2008 11:32:36 +0000
  Total time: 8m 52s
  Build Trigger: Schedule
  Build Number: 97
  Exit code: 1
  Building machine hostname: maven.zones.apache.org
  Operating system : SunOS(unknown)
  Java Home version : 
          java version "1.4.2_09"
          Java(TM) 2 Runtime Environment, Standard Edition (build 1.4.2_09-b05)
          Java HotSpot(TM) Client VM (build 1.4.2_09-b05, mixed mode)
        
  Builder version :
          Maven version: 2.0.7
          Java version: 1.4.2_09
          OS name: "sunos" version: "5.10" arch: "x86"
    
****************************************************************************
SCM Changes:
****************************************************************************
Changed: no author @ no date
Comment: no comment
Files changed:
  src/test/java/org/apache/maven/plugin/eclipse/EclipsePluginTest.java ( no revision )
  src/test/java/org/apache/maven/plugin/eclipse/TempEclipseWorkspace.java ( no revision )
  src/test/resources/eclipse/rad7WithDefault14/workspace/direct-compile/.project ( no revision
)
  src/test/resources/eclipse/rad7WithDefault14/workspace/direct-compile/pom.xml ( no revision
)
  src/test/resources/eclipse/rad7WithDefault14/workspace/.metadata/.plugins/org.eclipse.core.runtime/.settings/org.eclipse.jdt.launching.prefs
( no revision )
  src/test/resources/eclipse/rad7WithDefault14/workspace/.metadata/.plugins/org.eclipse.core.runtime/.settings/org.eclipse.wst.server.core.prefs
( no revision )
  src/test/resources/eclipse/rad7WithDefault14/workspace/.metadata/.plugins/org.eclipse.core.resources/.projects/direct-compile/.location
( no revision )
  src/test/resources/eclipse/dummyJDK/1.3.1/jre/lib/rt.jar ( no revision )
  src/test/resources/eclipse/dummyJDK/1.3/jre/lib/rt.jar ( no revision )
  src/test/resources/eclipse/dummyJDK/1.5.0/jre/lib/rt.jar ( no revision )
  src/test/resources/eclipse/dummyJDK/1.4/jre/lib/rt.jar ( no revision )
  src/test/resources/eclipse/dummyJDK/1.4.2/jre/lib/rt.jar ( no revision )
  src/test/resources/eclipse/dummyJDK/1.5/jre/lib/rt.jar ( no revision )
  src/test/resources/eclipse/eclipseWithDefault13/workspace/direct-compile/.project ( no revision
)
  src/test/resources/eclipse/eclipseWithDefault13/workspace/direct-compile/pom.xml ( no revision
)
  src/test/resources/eclipse/eclipseWithDefault13/workspace/.metadata/.plugins/org.eclipse.core.runtime/.settings/org.eclipse.jdt.launching.prefs
( no revision )
  src/test/resources/eclipse/eclipseWithDefault13/workspace/.metadata/.plugins/org.eclipse.core.resources/.projects/direct-compile/.location
( no revision )
  src/test/resources/eclipse/eclipseWithDefault15/workspace/direct-compile/.project ( no revision
)
  src/test/resources/eclipse/eclipseWithDefault15/workspace/direct-compile/pom.xml ( no revision
)
  src/test/resources/eclipse/eclipseWithDefault15/workspace/.metadata/.plugins/org.eclipse.core.runtime/.settings/org.eclipse.jdt.launching.prefs
( no revision )
  src/test/resources/eclipse/eclipseWithDefault15/workspace/.metadata/.plugins/org.eclipse.core.resources/.projects/direct-compile/.location
( no revision )
  src/test/resources/projects/project-40/expected/.project ( no revision )
  src/test/resources/projects/project-40/src/main/java/DummyClass.txt ( no revision )
  src/test/resources/projects/project-40/pom.xml ( no revision )
  src/test/resources/projects/project-41/expected/.project ( no revision )
  src/test/resources/projects/project-41/expected/.settings/org.eclipse.wst.common.project.facet.core.xml
( no revision )
  src/test/resources/projects/project-41/expected/.settings/org.eclipse.wst.common.component
( no revision )
  src/test/resources/projects/project-41/pom.xml ( no revision )
  src/test/resources/projects/project-42/expected/.project ( no revision )
  src/test/resources/projects/project-42/expected/.settings/org.eclipse.wst.common.project.facet.core.xml
( no revision )
  src/test/resources/projects/project-42/expected/.settings/org.eclipse.wst.common.component
( no revision )
  src/test/resources/projects/project-42/pom.xml ( no revision )
  src/test/resources/projects/project-07/expected/.classpath ( no revision )
  src/test/resources/projects/project-07/expected/.wtpmodules ( no revision )
  src/test/resources/projects/project-07/pom.xml ( no revision )
  src/test/resources/projects/project-33/pom.xml ( no revision )
  src/test/resources/projects/project-16/expected/.project ( no revision )
  src/test/resources/projects/project-39/expected/.project ( no revision )
  src/test/resources/projects/project-39/src/main/java/DummyClass.txt ( no revision )
  src/test/resources/projects/project-39/pom.xml ( no revision )
  src/main/java/org/apache/maven/plugin/ide/IdeDependency.java ( no revision )
  src/main/java/org/apache/maven/plugin/ide/IdeUtils.java ( no revision )
  src/main/java/org/apache/maven/plugin/ide/AbstractIdeSupportMojo.java ( no revision )
  src/main/java/org/apache/maven/plugin/eclipse/EclipsePlugin.java ( no revision )
  src/main/java/org/apache/maven/plugin/eclipse/writers/EclipseClasspathWriter.java ( no revision
)
  src/main/java/org/apache/maven/plugin/eclipse/writers/rad/RadWebSettingsWriter.java ( no
revision )
  src/main/java/org/apache/maven/plugin/eclipse/writers/EclipseWriterConfig.java ( no revision
)
  src/main/java/org/apache/maven/plugin/eclipse/writers/EclipseProjectWriter.java ( no revision
)
  src/main/java/org/apache/maven/plugin/eclipse/writers/wtp/EclipseWtpApplicationXMLWriter.java
( no revision )
  src/main/java/org/apache/maven/plugin/eclipse/writers/wtp/EclipseWtpFacetsWriter.java (
no revision )
  src/main/java/org/apache/maven/plugin/eclipse/writers/wtp/AbstractWtpResourceWriter.java
( no revision )
  src/main/java/org/apache/maven/plugin/eclipse/reader/ReadWorkspaceLocations.java ( no revision
)
  src/main/java/org/apache/maven/plugin/eclipse/WorkspaceConfiguration.java ( no revision
)
  src/main/java/org/apache/maven/plugin/eclipse/InstallPluginsMojo.java ( no revision )
  pom.xml ( no revision )

****************************************************************************
Dependencies Changes:
****************************************************************************
No dependencies changed


****************************************************************************
Build Defintion:
****************************************************************************
POM filename: pom.xml
Goals: clean install   
Arguments: -B -N
Build Fresh: false
Always Build: false
Default Build Definition: true
Schedule: DEFAULT_SCHEDULE
Profile Name: JDK 1.4.2
Description: 


****************************************************************************
Test Summary:
****************************************************************************
Tests: 86
Failures: 4
Total time: 458138

****************************************************************************
Output:
****************************************************************************
[INFO] Scanning for projects...
[INFO] ----------------------------------------------------------------------------
[INFO] Building Maven Eclipse Plugin
[INFO]    task-segment: [clean, install]
[INFO] ----------------------------------------------------------------------------
[INFO] [clean:clean]
[INFO] Deleting directory /export/home/build/data/continuum/checkouts/17/target
[INFO] [plugin:descriptor]
[INFO] Using 2 extractors.
[INFO] Applying extractor for language: java
[INFO] Extractor for language: java found 12 mojo descriptors.
[INFO] Applying extractor for language: bsh
[INFO] Extractor for language: bsh found 0 mojo descriptors.
[INFO] artifact org.eclipse.core:resources: checking for updates from central
Downloading: http://repo1.maven.org/maven2/org/eclipse/core/resources/3.3.0-v20070604/resources-3.3.0-v20070604.pom
1K downloaded
Downloading: http://repo1.maven.org/maven2/org/eclipse/core/resources/3.3.0-v20070604/resources-3.3.0-v20070604.jar
662K downloaded
[INFO] Setting property: classpath.resource.loader.class => 'org.codehaus.plexus.velocity.ContextClassLoaderResourceLoader'.
[INFO] Setting property: velocimacro.messages.on => 'false'.
[INFO] Setting property: resource.loader => 'classpath'.
[INFO] Setting property: resource.manager.logwhenfound => 'false'.
[INFO] [remote-resources:process {execution: default}]
[INFO] [resources:resources]
[INFO] Using default encoding to copy filtered resources.
[INFO] Copying 3 resources
[INFO] Copying 2 resources
[INFO] [compiler:compile]
[INFO] Compiling 62 source files to /export/home/build/data/continuum/checkouts/17/target/classes
[INFO] [resources:testResources]
[INFO] Using default encoding to copy filtered resources.
[INFO] Copying 414 resources
[INFO] Copying 2 resources
[INFO] [compiler:testCompile]
[INFO] Compiling 19 source files to /export/home/build/data/continuum/checkouts/17/target/test-classes
[INFO] [surefire:test]
[INFO] Surefire report directory: /export/home/build/data/continuum/checkouts/17/target/surefire-reports

-------------------------------------------------------
 T E S T S
-------------------------------------------------------
Running org.apache.maven.plugin.eclipse.AddMavenRepoMojoTest
Tests run: 1, Failures: 0, Errors: 0, Skipped: 0, Time elapsed: 0.557 sec
Running org.apache.maven.plugin.ide.IdeUtilsTest
Tests run: 1, Failures: 0, Errors: 0, Skipped: 0, Time elapsed: 0.015 sec
Running org.apache.maven.plugin.eclipse.BuildCommandTest
Tests run: 1, Failures: 0, Errors: 0, Skipped: 0, Time elapsed: 0.007 sec
Running org.apache.maven.plugin.eclipse.MyEclipsePluginTest
*** Running test builds; output will be directed to: target/surefire-reports/build-output

Using target/it-build-target and target/it-build-target/classes to build IT version of plugin
Now Building test version of the plugin...
Using staged plugin-pom: /export/home/build/data/continuum/checkouts/17/pom-test.xml
Using IT Plugin Jar: /export/home/build/data/continuum/checkouts/17/target/it-build-target/maven-eclipse-plugin-test.jar
[INFO] Installing /export/home/build/data/continuum/checkouts/17/target/it-build-target/maven-eclipse-plugin-test.jar
to /export/home/build/data/continuum/checkouts/17/target/test-classes/m2repo/org/apache/maven/plugins/maven-eclipse-plugin/test/maven-eclipse-plugin-test.jar
*** Installed test-version of the Eclipse plugin to: /export/home/build/data/continuum/checkouts/17/target/test-classes/m2repo

Tests run: 4, Failures: 0, Errors: 0, Skipped: 0, Time elapsed: 108.11 sec
Running org.apache.maven.plugin.eclipse.RadPluginTest
Tests run: 7, Failures: 0, Errors: 0, Skipped: 0, Time elapsed: 81.601 sec
Running org.apache.maven.plugin.eclipse.writers.EclipseOSGiManifestWriterTest
Tests run: 3, Failures: 0, Errors: 0, Skipped: 0, Time elapsed: 0.006 sec
Running org.apache.maven.plugin.eclipse.writers.workspace.EclipseCodeFormatterTest
Tests run: 1, Failures: 0, Errors: 0, Skipped: 0, Time elapsed: 0.006 sec
Running org.apache.maven.plugin.eclipse.EclipseWorkspaceTest
Tests run: 2, Failures: 0, Errors: 0, Skipped: 0, Time elapsed: 6.315 sec
Running org.apache.maven.plugin.eclipse.EclipsePluginMasterProjectTest
Tests run: 6, Failures: 0, Errors: 0, Skipped: 0, Time elapsed: 21.283 sec
Running org.apache.maven.plugin.eclipse.writers.EclipseClasspathWriterUnitTest
[debug] Processing resource src/main/resources: output=target/classes; default output=target/classes
[debug] Processing resource src/test/resources: output=target/classes/test-resources; default
output=target/classes
[debug] Marking as special to prevent output folder nesting: src/test/resources (output=target/classes/test-resources)
[info] Creating maven-eclipse.xml Ant file to handle resources
[info] Creating external launcher file
Tests run: 1, Failures: 0, Errors: 0, Skipped: 0, Time elapsed: 0.221 sec
Running org.apache.maven.plugin.eclipse.writers.testutils.TestEclipseWriterConfig
Tests run: 0, Failures: 0, Errors: 0, Skipped: 0, Time elapsed: 0.001 sec
Running org.apache.maven.plugin.eclipse.EclipsePluginTest
Tests run: 44, Failures: 3, Errors: 1, Skipped: 0, Time elapsed: 239.797 sec <<<
FAILURE!
Running org.apache.maven.plugin.eclipse.EclipsePluginUnitTest
[debug] testOutput toRelativeAndFixSeparator /var/tmp/EclipsePlugin.unitTest.1201779130827
, target/main-output
[debug] testOutput after toRelative : target/main-output
[debug] Processing resource dir: src/main/resources
[debug] Making relative and fixing separator: { /var/tmp/EclipsePlugin.unitTest.1201779130827,
/var/tmp/EclipsePlugin.unitTest.1201779130827/target/main-output, false }.
[debug] Adding eclipse source dir: { src/main/resources, target/main-output, true, true, null,
null }.
[debug] Processing resource dir: src/main/resources
[debug] Making relative and fixing separator: { /var/tmp/EclipsePlugin.unitTest.1201779130867,
/var/tmp/EclipsePlugin.unitTest.1201779130867/target/classes/main-output, false }.
[debug] Adding eclipse source dir: { src/main/resources, target/classes/main-output, true,
false, null, null }.
[debug] Processing resource dir: src/main/resources
[debug] Making relative and fixing separator: { /var/tmp/EclipsePlugin.unitTest.1201779130897,
/var/tmp/EclipsePlugin.unitTest.1201779130897/target/main-output, false }.
[debug] Adding eclipse source dir: { src/main/resources, target/main-output, true, false,
null, null }.
[debug] Processing resource dir: src/main/resources
[debug] Making relative and fixing separator: { /var/tmp/EclipsePlugin.unitTest.1201779130947,
/var/tmp/EclipsePlugin.unitTest.1201779130947/target/classes, false }.
[debug] Adding eclipse source dir: { src/main/resources, target/classes, true, false, null,
null }.
[debug] Processing resource dir: src/test/resources
[debug] Making relative and fixing separator: { /var/tmp/EclipsePlugin.unitTest.1201779130947,
/var/tmp/EclipsePlugin.unitTest.1201779130947/target/test-classes, false }.
[debug] Adding eclipse source dir: { src/test/resources, target/test-classes, true, false,
null, null }.
[debug] Processing resource dir: src/main/resources
[debug] Making relative and fixing separator: { /var/tmp/EclipsePlugin.unitTest.1201779131007,
/var/tmp/EclipsePlugin.unitTest.1201779131007/target/classes, false }.
[debug] Adding eclipse source dir: { src-main-resources, target/classes, true, false, null,
null }.
[debug] Processing resource dir: src/test/resources
[debug] Making relative and fixing separator: { /var/tmp/EclipsePlugin.unitTest.1201779131007,
/var/tmp/EclipsePlugin.unitTest.1201779131007/target/test-classes, false }.
[debug] Adding eclipse source dir: { src-test-resources, target/test-classes, true, false,
null, null }.
Tests run: 5, Failures: 0, Errors: 0, Skipped: 0, Time elapsed: 0.246 sec
Running org.apache.maven.plugin.eclipse.EclipseToMavenTest
Tests run: 5, Failures: 0, Errors: 0, Skipped: 0, Time elapsed: 0.022 sec
Running org.apache.maven.plugin.eclipse.MakeArtifactsTest
Tests run: 5, Failures: 0, Errors: 0, Skipped: 0, Time elapsed: 0.005 sec

Results :

Failed tests: 
  testProject16(org.apache.maven.plugin.eclipse.EclipsePluginTest)
  testProject17(org.apache.maven.plugin.eclipse.EclipsePluginTest)
  testProject33(org.apache.maven.plugin.eclipse.EclipsePluginTest)

Tests in error: 
  testMECLIPSE_56_encoding(org.apache.maven.plugin.eclipse.EclipsePluginTest)

Tests run: 86, Failures: 3, Errors: 1, Skipped: 0

[INFO] ------------------------------------------------------------------------
[ERROR] BUILD FAILURE
[INFO] ------------------------------------------------------------------------
[INFO] There are test failures.

Please refer to /export/home/build/data/continuum/checkouts/17/target/surefire-reports for
the individual test results.
[INFO] ------------------------------------------------------------------------
[INFO] For more information, run Maven with the -e switch
[INFO] ------------------------------------------------------------------------
[INFO] Total time: 8 minutes 50 seconds
[INFO] Finished at: Thu Jan 31 11:32:36 GMT+00:00 2008
[INFO] Final Memory: 33M/63M
[INFO] ------------------------------------------------------------------------

****************************************************************************



Mime
View raw message