maven-notifications mailing list archives

Site index · List index
Message view « Date » · « Thread »
Top « Date » · « Thread »
From "Continuum@maven.zones.apache.org" <contin...@maven.zones.apache.org>
Subject [continuum] BUILD FAILURE: Archiva Web :: Application
Date Mon, 28 Jan 2008 14:25:53 GMT
Online report : http://maven.zones.apache.org/continuum/buildResult.action?buildId=40552&projectId=296

Build statistics:
  State: Failed
  Previous State: Ok
  Started at: Mon 28 Jan 2008 14:23:08 +0000
  Finished at: Mon 28 Jan 2008 14:25:45 +0000
  Total time: 2m 37s
  Build Trigger: Schedule
  Build Number: 210
  Exit code: 1
  Building machine hostname: maven.zones.apache.org
  Operating system : SunOS(unknown)
  Java Home version : 
          java version "1.5.0_13"
          Java(TM) 2 Runtime Environment, Standard Edition (build 1.5.0_13-b05)
          Java HotSpot(TM) Server VM (build 1.5.0_13-b05, mixed mode)
        
  Builder version :
          Maven version: 2.0.7
          Java version: 1.5.0_13
          OS name: "sunos" version: "5.10" arch: "x86"
    
****************************************************************************
SCM Changes:
****************************************************************************
No files changed

****************************************************************************
Dependencies Changes:
****************************************************************************
org.apache.maven.archiva:archiva-proxy:1.1-SNAPSHOT

org.apache.maven.wagon:wagon-http:1.0-rc1-SNAPSHOT

org.apache.maven.wagon:wagon-file:1.0-rc1-SNAPSHOT


****************************************************************************
Build Defintion:
****************************************************************************
POM filename: pom.xml
Goals: clean install   
Arguments: --batch-mode --non-recursive
Build Fresh: false
Always Build: false
Default Build Definition: true
Schedule: DEFAULT_SCHEDULE
Description: 


****************************************************************************
Test Summary:
****************************************************************************
Tests: 2050
Failures: 1
Total time: 109487

****************************************************************************
Output:
****************************************************************************
[INFO] Scanning for projects...
[INFO] ----------------------------------------------------------------------------
[INFO] Building Archiva Web :: Application
[INFO]    task-segment: [clean, install]
[INFO] ----------------------------------------------------------------------------
[INFO] [clean:clean]
[INFO] Deleting directory /export/home/build/data/continuum/checkouts/296/target
[INFO] Deleting directory /export/home/build/data/continuum/checkouts/296/target/classes
[INFO] Deleting directory /export/home/build/data/continuum/checkouts/296/target/test-classes
[INFO] Deleting directory /export/home/build/data/continuum/checkouts/296/target/site
[INFO] Deleting file-set: /export/home/build/data/continuum/checkouts/296/src/main/webapp (included: [META-INF, archiva-applet.jar, images/redback, template/redback, WEB-INF/classes, WEB-INF/lib, WEB-INF/database, WEB-INF/logs, redback, css/redback, WEB-INF/jsp/redback, WEB-INF/template/redback, WEB-INF/logs, WEB-INF/temp, WEB-INF/jasperreports], excluded: [])
[INFO] [plexus:descriptor {execution: generate}]
[WARNING] POM for 'jpox:jpox:pom:1.1.9:compile' is invalid. It will be ignored for artifact resolution. Reason: Not a v4.0.0 POM. for project jpox:jpox at /export/home/build/.m2/repository/jpox/jpox/1.1.9/jpox-1.1.9.pom
[WARNING] POM for 'jpox:jpox:pom:1.1.9:compile' is invalid. It will be ignored for artifact resolution. Reason: Not a v4.0.0 POM. for project jpox:jpox at /export/home/build/.m2/repository/jpox/jpox/1.1.9/jpox-1.1.9.pom
[WARNING] POM for 'jpox:jpox:pom:1.1.9:compile' is invalid. It will be ignored for artifact resolution. Reason: Not a v4.0.0 POM. for project jpox:jpox at /export/home/build/.m2/repository/jpox/jpox/1.1.9/jpox-1.1.9.pom
[WARNING] POM for 'jpox:jpox:pom:1.1.9:compile' is invalid. It will be ignored for artifact resolution. Reason: Not a v4.0.0 POM. for project jpox:jpox at /export/home/build/.m2/repository/jpox/jpox/1.1.9/jpox-1.1.9.pom
[INFO] Setting property: classpath.resource.loader.class => 'org.codehaus.plexus.velocity.ContextClassLoaderResourceLoader'.
[INFO] Setting property: velocimacro.messages.on => 'false'.
[INFO] Setting property: resource.loader => 'classpath'.
[INFO] Setting property: resource.manager.logwhenfound => 'false'.
[INFO] [remote-resources:process {execution: default}]
[WARNING] Attempting to build MavenProject instance for Artifact of type: jar; constructing POM artifact instead.
[WARNING] Invalid project model for artifact [jpox:jpox:1.1.9]. It will be ignored by the remote resources Mojo.
[WARNING] POM for 'jpox:jpox:pom:1.1.9:compile' is invalid. It will be ignored for artifact resolution. Reason: Not a v4.0.0 POM. for project jpox:jpox at /export/home/build/.m2/repository/jpox/jpox/1.1.9/jpox-1.1.9.pom
[WARNING] POM for 'jpox:jpox:pom:1.1.9:compile' is invalid. It will be ignored for artifact resolution. Reason: Not a v4.0.0 POM. for project jpox:jpox at /export/home/build/.m2/repository/jpox/jpox/1.1.9/jpox-1.1.9.pom
[WARNING] POM for 'jpox:jpox:pom:1.1.9:compile' is invalid. It will be ignored for artifact resolution. Reason: Not a v4.0.0 POM. for project jpox:jpox at /export/home/build/.m2/repository/jpox/jpox/1.1.9/jpox-1.1.9.pom
[WARNING] POM for 'jpox:jpox:pom:1.1.9:compile' is invalid. It will be ignored for artifact resolution. Reason: Not a v4.0.0 POM. for project jpox:jpox at /export/home/build/.m2/repository/jpox/jpox/1.1.9/jpox-1.1.9.pom
[INFO] [antrun:run {execution: default}]
[INFO] Executing tasks
     [copy] Copying 2 files to /export/home/build/data/continuum/checkouts/296/target/appserver-base
[INFO] Executed tasks
[INFO] [resources:resources]
[INFO] Using default encoding to copy filtered resources.
[INFO] Copying 26 resources
[INFO] Copying 1 resource
[INFO] Copying 2 resources
[INFO] [dependency:copy {execution: copy}]
[INFO] Configured Artifact: org.apache.maven.archiva:archiva-applet:null:1.1-SNAPSHOT:jar
[INFO] Copying /export/home/build/.m2/repository/org/apache/maven/archiva/archiva-applet/1.1-SNAPSHOT/archiva-applet-1.1-SNAPSHOT.jar to /export/home/build/data/continuum/checkouts/296/src/main/webapp/archiva-applet.jar
[WARNING] POM for 'jpox:jpox:pom:1.1.9:compile' is invalid. It will be ignored for artifact resolution. Reason: Not a v4.0.0 POM. for project jpox:jpox at /export/home/build/.m2/repository/jpox/jpox/1.1.9/jpox-1.1.9.pom
[WARNING] POM for 'jpox:jpox:pom:1.1.9:compile' is invalid. It will be ignored for artifact resolution. Reason: Not a v4.0.0 POM. for project jpox:jpox at /export/home/build/.m2/repository/jpox/jpox/1.1.9/jpox-1.1.9.pom
[WARNING] POM for 'jpox:jpox:pom:1.1.9:compile' is invalid. It will be ignored for artifact resolution. Reason: Not a v4.0.0 POM. for project jpox:jpox at /export/home/build/.m2/repository/jpox/jpox/1.1.9/jpox-1.1.9.pom
[WARNING] POM for 'jpox:jpox:pom:1.1.9:compile' is invalid. It will be ignored for artifact resolution. Reason: Not a v4.0.0 POM. for project jpox:jpox at /export/home/build/.m2/repository/jpox/jpox/1.1.9/jpox-1.1.9.pom
[INFO] [compiler:compile]
[INFO] Compiling 66 source files to /export/home/build/data/continuum/checkouts/296/target/classes
[WARNING] POM for 'jpox:jpox:pom:1.1.9:compile' is invalid. It will be ignored for artifact resolution. Reason: Not a v4.0.0 POM. for project jpox:jpox at /export/home/build/.m2/repository/jpox/jpox/1.1.9/jpox-1.1.9.pom
[WARNING] POM for 'jpox:jpox:pom:1.1.9:compile' is invalid. It will be ignored for artifact resolution. Reason: Not a v4.0.0 POM. for project jpox:jpox at /export/home/build/.m2/repository/jpox/jpox/1.1.9/jpox-1.1.9.pom
[WARNING] POM for 'jpox:jpox:pom:1.1.9:compile' is invalid. It will be ignored for artifact resolution. Reason: Not a v4.0.0 POM. for project jpox:jpox at /export/home/build/.m2/repository/jpox/jpox/1.1.9/jpox-1.1.9.pom
[WARNING] POM for 'jpox:jpox:pom:1.1.9:compile' is invalid. It will be ignored for artifact resolution. Reason: Not a v4.0.0 POM. for project jpox:jpox at /export/home/build/.m2/repository/jpox/jpox/1.1.9/jpox-1.1.9.pom
[INFO] [war:inplace {execution: default}]
[INFO] Generating webapp in source directory... /export/home/build/data/continuum/checkouts/296/src/main/webapp
[INFO] Exploding webapp...
[INFO] Assembling webapp archiva-webapp in /export/home/build/data/continuum/checkouts/296/src/main/webapp
[INFO] Expanding: /export/home/build/.m2/repository/org/codehaus/plexus/redback/redback-xwork-content/1.0-alpha-4/redback-xwork-content-1.0-alpha-4.war into /export/home/build/data/continuum/checkouts/296/target/war/work/redback-xwork-content-1.0-alpha-4
[INFO] Overlaying 1 war(s).
[INFO] [resources:testResources]
[INFO] Using default encoding to copy filtered resources.
[INFO] Copying 12 resources
[INFO] Copying 2 resources
[WARNING] POM for 'jpox:jpox:pom:1.1.9:compile' is invalid. It will be ignored for artifact resolution. Reason: Not a v4.0.0 POM. for project jpox:jpox at /export/home/build/.m2/repository/jpox/jpox/1.1.9/jpox-1.1.9.pom
[WARNING] POM for 'jpox:jpox:pom:1.1.9:compile' is invalid. It will be ignored for artifact resolution. Reason: Not a v4.0.0 POM. for project jpox:jpox at /export/home/build/.m2/repository/jpox/jpox/1.1.9/jpox-1.1.9.pom
[WARNING] POM for 'jpox:jpox:pom:1.1.9:compile' is invalid. It will be ignored for artifact resolution. Reason: Not a v4.0.0 POM. for project jpox:jpox at /export/home/build/.m2/repository/jpox/jpox/1.1.9/jpox-1.1.9.pom
[WARNING] POM for 'jpox:jpox:pom:1.1.9:compile' is invalid. It will be ignored for artifact resolution. Reason: Not a v4.0.0 POM. for project jpox:jpox at /export/home/build/.m2/repository/jpox/jpox/1.1.9/jpox-1.1.9.pom
[INFO] [compiler:testCompile]
[INFO] Compiling 39 source files to /export/home/build/data/continuum/checkouts/296/target/test-classes
[WARNING] POM for 'jpox:jpox:pom:1.1.9:compile' is invalid. It will be ignored for artifact resolution. Reason: Not a v4.0.0 POM. for project jpox:jpox at /export/home/build/.m2/repository/jpox/jpox/1.1.9/jpox-1.1.9.pom
[WARNING] POM for 'jpox:jpox:pom:1.1.9:compile' is invalid. It will be ignored for artifact resolution. Reason: Not a v4.0.0 POM. for project jpox:jpox at /export/home/build/.m2/repository/jpox/jpox/1.1.9/jpox-1.1.9.pom
[WARNING] POM for 'jpox:jpox:pom:1.1.9:compile' is invalid. It will be ignored for artifact resolution. Reason: Not a v4.0.0 POM. for project jpox:jpox at /export/home/build/.m2/repository/jpox/jpox/1.1.9/jpox-1.1.9.pom
[WARNING] POM for 'jpox:jpox:pom:1.1.9:compile' is invalid. It will be ignored for artifact resolution. Reason: Not a v4.0.0 POM. for project jpox:jpox at /export/home/build/.m2/repository/jpox/jpox/1.1.9/jpox-1.1.9.pom
[INFO] [surefire:test]
[INFO] Surefire report directory: /export/home/build/data/continuum/checkouts/296/target/surefire-reports

-------------------------------------------------------
 T E S T S
-------------------------------------------------------
Running org.apache.maven.archiva.web.repository.RepositoryServletNoProxyMetadataTest
 WARN|main|    0|ConfigurationFactory           - No configuration found. Configuring ehcache from ehcache-failsafe.xml  found in the classpath: jar:file:/export/home/build/.m2/repository/net/sf/ehcache/ehcache/1.3.0/ehcache-1.3.0.jar!/ehcache-failsafe.xml
Rhino classes (js.jar) not found - Javascript disabled
 INFO|main| 1169|AuditLog                       - internal guest 127.0.0.1 "/commons-lang/commons-lang/2.1/maven-metadata.xml" "Modify File (proxied)"
 INFO|main| 1195|Cache:url-failures-cache       - Disposing cache: [ name = url-failures-cache status = STATUS_ALIVE eternal = false overflowToDisk = false maxElementsInMemory = 1000 maxElementsOnDisk = 0 memoryStoreEvictionPolicy = LRU timeToLiveSeconds = 1800 timeToIdleSeconds = 2700 diskPersistent = false diskExpiryThreadIntervalSeconds = 600 cacheEventListeners:  hitCount = 0 memoryStoreHitCount = 0 diskStoreHitCount = 0 missCountNotFound = 0 missCountExpired = 0 ]
There was no such logger 'org.codehaus.plexus.redback.xwork.filter.authentication.HttpAuthenticator:basic' 33081055.
 WARN|main| 1196|PlexusContainer                - Component manager not found for returned component. Ignored. component=org.apache.maven.archiva.web.repository.ProxiedDavServer@1295fe8
 INFO|main| 1512|AuditLog                       - internal guest 127.0.0.1 "/commons-lang/commons-lang/maven-metadata.xml" "Modify File (proxied)"
 INFO|main| 1516|Cache:url-failures-cache       - Disposing cache: [ name = url-failures-cache status = STATUS_ALIVE eternal = false overflowToDisk = false maxElementsInMemory = 1000 maxElementsOnDisk = 0 memoryStoreEvictionPolicy = LRU timeToLiveSeconds = 1800 timeToIdleSeconds = 2700 diskPersistent = false diskExpiryThreadIntervalSeconds = 600 cacheEventListeners:  hitCount = 0 memoryStoreHitCount = 0 diskStoreHitCount = 0 missCountNotFound = 0 missCountExpired = 0 ]
There was no such logger 'org.codehaus.plexus.redback.xwork.filter.authentication.HttpAuthenticator:basic' 7437713.
 WARN|main| 1516|PlexusContainer                - Component manager not found for returned component. Ignored. component=org.apache.maven.archiva.web.repository.ProxiedDavServer@156b386
There was no such logger 'org.codehaus.plexus.redback.xwork.filter.authentication.HttpAuthenticator:basic' 31128398.
 INFO|main| 1858|AuditLog                       - internal guest 127.0.0.1 "/org/apache/maven/plugins/maven-assembly-plugin/2.2-beta-2-SNAPSHOT/maven-metadata.xml" "Modify File (proxied)"
 INFO|main| 1863|Cache:url-failures-cache       - Disposing cache: [ name = url-failures-cache status = STATUS_ALIVE eternal = false overflowToDisk = false maxElementsInMemory = 1000 maxElementsOnDisk = 0 memoryStoreEvictionPolicy = LRU timeToLiveSeconds = 1800 timeToIdleSeconds = 2700 diskPersistent = false diskExpiryThreadIntervalSeconds = 600 cacheEventListeners:  hitCount = 0 memoryStoreHitCount = 0 diskStoreHitCount = 0 missCountNotFound = 0 missCountExpired = 0 ]
 WARN|main| 1864|PlexusContainer                - Component manager not found for returned component. Ignored. component=org.apache.maven.archiva.web.repository.ProxiedDavServer@1128f5a
Tests run: 3, Failures: 0, Errors: 0, Skipped: 0, Time elapsed: 3.558 sec
Running org.apache.maven.archiva.web.repository.ArchivaMimeTypeLoaderTest
Tests run: 1, Failures: 0, Errors: 0, Skipped: 0, Time elapsed: 0.278 sec
Running org.apache.maven.archiva.web.repository.RepositoryServletProxiedPluginSnapshotPolicyTest
 INFO|main| 2404|log                            - Logging to org.slf4j.impl.Log4jLoggerAdapter(org.mortbay.log) via org.mortbay.log.Slf4jLog
 INFO|main| 2468|log                            - jetty-6.1.5
 INFO|main| 2525|log                            - Started SocketConnector@0.0.0.0:37180
Remote HTTP Server started on http://localhost:37180/snapshots
 INFO|main| 4013|Cache:url-failures-cache       - Disposing cache: [ name = url-failures-cache status = STATUS_ALIVE eternal = false overflowToDisk = false maxElementsInMemory = 1000 maxElementsOnDisk = 0 memoryStoreEvictionPolicy = LRU timeToLiveSeconds = 1800 timeToIdleSeconds = 2700 diskPersistent = false diskExpiryThreadIntervalSeconds = 600 cacheEventListeners:  hitCount = 0 memoryStoreHitCount = 0 diskStoreHitCount = 0 missCountNotFound = 0 missCountExpired = 0 ]
 WARN|main| 4022|PlexusContainer                - Component manager not found for returned component. Ignored. component=org.apache.maven.archiva.web.repository.ProxiedDavServer@134c5ff
There was no such logger 'org.codehaus.plexus.redback.xwork.filter.authentication.HttpAuthenticator:basic' 1497769.
 INFO|main| 4434|log                            - jetty-6.1.5
 INFO|main| 4435|log                            - Started SocketConnector@0.0.0.0:37192
Remote HTTP Server started on http://localhost:37192/snapshots
 INFO|main| 5533|AuditLog                       - internal guest 127.0.0.1 "org/apache/archiva/archivatest-maven-plugin/4.0-alpha-1-SNAPSHOT/archivatest-maven-plugin-4.0-alpha-1-20070822.033400-42.jar" "Modify File (proxied)"
 INFO|main| 5642|Cache:url-failures-cache       - Disposing cache: [ name = url-failures-cache status = STATUS_ALIVE eternal = false overflowToDisk = false maxElementsInMemory = 1000 maxElementsOnDisk = 0 memoryStoreEvictionPolicy = LRU timeToLiveSeconds = 1800 timeToIdleSeconds = 2700 diskPersistent = false diskExpiryThreadIntervalSeconds = 600 cacheEventListeners:  hitCount = 0 memoryStoreHitCount = 0 diskStoreHitCount = 0 missCountNotFound = 0 missCountExpired = 0 ]
There was no such logger 'org.codehaus.plexus.redback.xwork.filter.authentication.HttpAuthenticator:basic' 28286616.
 WARN|main| 5643|PlexusContainer                - Component manager not found for returned component. Ignored. component=org.apache.maven.archiva.web.repository.ProxiedDavServer@8d3d62
 INFO|main| 5833|log                            - jetty-6.1.5
 INFO|main| 5834|log                            - Started SocketConnector@0.0.0.0:37199
Remote HTTP Server started on http://localhost:37199/snapshots
 INFO|main| 6937|AuditLog                       - internal guest 127.0.0.1 "org/apache/archiva/archivatest-maven-plugin/4.0-alpha-1-SNAPSHOT/archivatest-maven-plugin-4.0-alpha-1-20070822.033400-42.jar" "Modify File (proxied)"
 INFO|main| 6941|Cache:url-failures-cache       - Disposing cache: [ name = url-failures-cache status = STATUS_ALIVE eternal = false overflowToDisk = false maxElementsInMemory = 1000 maxElementsOnDisk = 0 memoryStoreEvictionPolicy = LRU timeToLiveSeconds = 1800 timeToIdleSeconds = 2700 diskPersistent = false diskExpiryThreadIntervalSeconds = 600 cacheEventListeners:  hitCount = 0 memoryStoreHitCount = 0 diskStoreHitCount = 0 missCountNotFound = 0 missCountExpired = 0 ]
There was no such logger 'org.codehaus.plexus.redback.xwork.filter.authentication.HttpAuthenticator:basic' 12031745.
 WARN|main| 6942|PlexusContainer                - Component manager not found for returned component. Ignored. component=org.apache.maven.archiva.web.repository.ProxiedDavServer@128594c
 INFO|main| 7130|log                            - jetty-6.1.5
 INFO|main| 7132|log                            - Started SocketConnector@0.0.0.0:37205
Remote HTTP Server started on http://localhost:37205/snapshots
 INFO|main| 8149|RepositoryProxyConnectors:default - Transfer not attempted on http://localhost:37205/snapshots/org/apache/archiva/archivatest-maven-plugin/4.0-alpha-1-SNAPSHOT/archivatest-maven-plugin-4.0-alpha-1-20070822.033400-42.jar : NO to update snapshots, policy is DAILY, local file exist, and has been updated within the last day.: using already present local file.
 INFO|main| 8154|AuditLog                       - internal guest 127.0.0.1 "org/apache/archiva/archivatest-maven-plugin/4.0-alpha-1-SNAPSHOT/archivatest-maven-plugin-4.0-alpha-1-20070822.033400-42.jar" "Modify File (proxied)"
 INFO|main| 8261|Cache:url-failures-cache       - Disposing cache: [ name = url-failures-cache status = STATUS_ALIVE eternal = false overflowToDisk = false maxElementsInMemory = 1000 maxElementsOnDisk = 0 memoryStoreEvictionPolicy = LRU timeToLiveSeconds = 1800 timeToIdleSeconds = 2700 diskPersistent = false diskExpiryThreadIntervalSeconds = 600 cacheEventListeners:  hitCount = 0 memoryStoreHitCount = 0 diskStoreHitCount = 0 missCountNotFound = 0 missCountExpired = 0 ]
There was no such logger 'org.codehaus.plexus.redback.xwork.filter.authentication.HttpAuthenticator:basic' 7060068.
 WARN|main| 8262|PlexusContainer                - Component manager not found for returned component. Ignored. component=org.apache.maven.archiva.web.repository.ProxiedDavServer@9daa17
 INFO|main| 8606|log                            - jetty-6.1.5
 INFO|main| 8608|log                            - Started SocketConnector@0.0.0.0:37212
Remote HTTP Server started on http://localhost:37212/snapshots
 INFO|main|10070|AuditLog                       - internal guest 127.0.0.1 "org/apache/archiva/archivatest-maven-plugin/4.0-alpha-1-SNAPSHOT/archivatest-maven-plugin-4.0-alpha-1-20070822.033400-42.jar" "Modify File (proxied)"
 INFO|main|10075|Cache:url-failures-cache       - Disposing cache: [ name = url-failures-cache status = STATUS_ALIVE eternal = false overflowToDisk = false maxElementsInMemory = 1000 maxElementsOnDisk = 0 memoryStoreEvictionPolicy = LRU timeToLiveSeconds = 1800 timeToIdleSeconds = 2700 diskPersistent = false diskExpiryThreadIntervalSeconds = 600 cacheEventListeners:  hitCount = 0 memoryStoreHitCount = 0 diskStoreHitCount = 0 missCountNotFound = 0 missCountExpired = 0 ]
 WARN|main|10076|PlexusContainer                - Component manager not found for returned component. Ignored. component=org.apache.maven.archiva.web.repository.ProxiedDavServer@19ee8a
There was no such logger 'org.codehaus.plexus.redback.xwork.filter.authentication.HttpAuthenticator:basic' 16531630.
 INFO|main|10252|log                            - jetty-6.1.5
 INFO|main|10253|log                            - Started SocketConnector@0.0.0.0:37220
Remote HTTP Server started on http://localhost:37220/snapshots
 INFO|main|11255|AuditLog                       - internal guest 127.0.0.1 "org/apache/archiva/archivatest-maven-plugin/4.0-alpha-1-SNAPSHOT/archivatest-maven-plugin-4.0-alpha-1-20070822.033400-42.jar" "Modify File (proxied)"
 INFO|main|11361|Cache:url-failures-cache       - Disposing cache: [ name = url-failures-cache status = STATUS_ALIVE eternal = false overflowToDisk = false maxElementsInMemory = 1000 maxElementsOnDisk = 0 memoryStoreEvictionPolicy = LRU timeToLiveSeconds = 1800 timeToIdleSeconds = 2700 diskPersistent = false diskExpiryThreadIntervalSeconds = 600 cacheEventListeners:  hitCount = 0 memoryStoreHitCount = 0 diskStoreHitCount = 0 missCountNotFound = 0 missCountExpired = 0 ]
There was no such logger 'org.codehaus.plexus.redback.xwork.filter.authentication.HttpAuthenticator:basic' 23387737.
 WARN|main|11361|PlexusContainer                - Component manager not found for returned component. Ignored. component=org.apache.maven.archiva.web.repository.ProxiedDavServer@ec1f9e
 INFO|main|11493|log                            - jetty-6.1.5
 INFO|main|11495|log                            - Started SocketConnector@0.0.0.0:37226
Remote HTTP Server started on http://localhost:37226/snapshots
 INFO|main|12504|RepositoryProxyConnectors:default - Transfer not attempted on http://localhost:37226/snapshots/org/apache/archiva/archivatest-maven-plugin/4.0-alpha-1-SNAPSHOT/archivatest-maven-plugin-4.0-alpha-1-20070822.033400-42.pom : NO to update, snapshots policy set to NEVER.
 INFO|main|12505|RepositoryProxyConnectors:default - Transfer not attempted on http://localhost:37226/snapshots/org/apache/archiva/archivatest-maven-plugin/4.0-alpha-1-SNAPSHOT/archivatest-maven-plugin-4.0-alpha-1-20070822.033400-42.jar : NO to update, snapshots policy set to NEVER.: using already present local file.
 INFO|main|12507|AuditLog                       - internal guest 127.0.0.1 "org/apache/archiva/archivatest-maven-plugin/4.0-alpha-1-SNAPSHOT/archivatest-maven-plugin-4.0-alpha-1-20070822.033400-42.jar" "Modify File (proxied)"
 INFO|main|12511|Cache:url-failures-cache       - Disposing cache: [ name = url-failures-cache status = STATUS_ALIVE eternal = false overflowToDisk = false maxElementsInMemory = 1000 maxElementsOnDisk = 0 memoryStoreEvictionPolicy = LRU timeToLiveSeconds = 1800 timeToIdleSeconds = 2700 diskPersistent = false diskExpiryThreadIntervalSeconds = 600 cacheEventListeners:  hitCount = 0 memoryStoreHitCount = 0 diskStoreHitCount = 0 missCountNotFound = 0 missCountExpired = 0 ]
There was no such logger 'org.codehaus.plexus.redback.xwork.filter.authentication.HttpAuthenticator:basic' 8239415.
 WARN|main|12511|PlexusContainer                - Component manager not found for returned component. Ignored. component=org.apache.maven.archiva.web.repository.ProxiedDavServer@a638fc
 INFO|main|12686|log                            - jetty-6.1.5
 INFO|main|12687|log                            - Started SocketConnector@0.0.0.0:37229
Remote HTTP Server started on http://localhost:37229/snapshots
 INFO|main|13671|RepositoryProxyConnectors:default - Transfer not attempted on http://localhost:37229/snapshots/org/apache/archiva/archivatest-maven-plugin/4.0-alpha-1-SNAPSHOT/archivatest-maven-plugin-4.0-alpha-1-20070822.033400-42.pom : NO to update, snapshots policy set to NEVER.
 INFO|main|13671|RepositoryProxyConnectors:default - Transfer not attempted on http://localhost:37229/snapshots/org/apache/archiva/archivatest-maven-plugin/4.0-alpha-1-SNAPSHOT/archivatest-maven-plugin-4.0-alpha-1-20070822.033400-42.jar : NO to update, snapshots policy set to NEVER.
 INFO|main|13791|Cache:url-failures-cache       - Disposing cache: [ name = url-failures-cache status = STATUS_ALIVE eternal = false overflowToDisk = false maxElementsInMemory = 1000 maxElementsOnDisk = 0 memoryStoreEvictionPolicy = LRU timeToLiveSeconds = 1800 timeToIdleSeconds = 2700 diskPersistent = false diskExpiryThreadIntervalSeconds = 600 cacheEventListeners:  hitCount = 0 memoryStoreHitCount = 0 diskStoreHitCount = 0 missCountNotFound = 0 missCountExpired = 0 ]
There was no such logger 'org.codehaus.plexus.redback.xwork.filter.authentication.HttpAuthenticator:basic' 12401453.
 WARN|main|13791|PlexusContainer                - Component manager not found for returned component. Ignored. component=org.apache.maven.archiva.web.repository.ProxiedDavServer@135d18b
 INFO|main|13956|log                            - jetty-6.1.5
 INFO|main|13957|log                            - Started SocketConnector@0.0.0.0:37233
Remote HTTP Server started on http://localhost:37233/snapshots
 INFO|main|15238|RepositoryProxyConnectors:default - Transfer not attempted on http://localhost:37233/snapshots/org/apache/archiva/archivatest-maven-plugin/4.0-alpha-1-SNAPSHOT/archivatest-maven-plugin-4.0-alpha-1-20070822.033400-42.pom : NO to update, snapshots policy set to NEVER.
 INFO|main|15238|RepositoryProxyConnectors:default - Transfer not attempted on http://localhost:37233/snapshots/org/apache/archiva/archivatest-maven-plugin/4.0-alpha-1-SNAPSHOT/archivatest-maven-plugin-4.0-alpha-1-20070822.033400-42.jar : NO to update, snapshots policy set to NEVER.: using already present local file.
 INFO|main|15240|AuditLog                       - internal guest 127.0.0.1 "org/apache/archiva/archivatest-maven-plugin/4.0-alpha-1-SNAPSHOT/archivatest-maven-plugin-4.0-alpha-1-20070822.033400-42.jar" "Modify File (proxied)"
 INFO|main|15350|Cache:url-failures-cache       - Disposing cache: [ name = url-failures-cache status = STATUS_ALIVE eternal = false overflowToDisk = false maxElementsInMemory = 1000 maxElementsOnDisk = 0 memoryStoreEvictionPolicy = LRU timeToLiveSeconds = 1800 timeToIdleSeconds = 2700 diskPersistent = false diskExpiryThreadIntervalSeconds = 600 cacheEventListeners:  hitCount = 0 memoryStoreHitCount = 0 diskStoreHitCount = 0 missCountNotFound = 0 missCountExpired = 0 ]
There was no such logger 'org.codehaus.plexus.redback.xwork.filter.authentication.HttpAuthenticator:basic' 26270841.
 WARN|main|15351|PlexusContainer                - Component manager not found for returned component. Ignored. component=org.apache.maven.archiva.web.repository.ProxiedDavServer@15ede11
 INFO|main|15476|log                            - jetty-6.1.5
 INFO|main|15477|log                            - Started SocketConnector@0.0.0.0:37238
Remote HTTP Server started on http://localhost:37238/snapshots
 INFO|main|16463|RepositoryProxyConnectors:default - Transfer not attempted on http://localhost:37238/snapshots/org/apache/archiva/archivatest-maven-plugin/4.0-alpha-1-SNAPSHOT/archivatest-maven-plugin-4.0-alpha-1-20070822.033400-42.jar : NO to update snapshots, policy is HOURLY, local file exist, and has been updated within the last hour.: using already present local file.
 INFO|main|16465|AuditLog                       - internal guest 127.0.0.1 "org/apache/archiva/archivatest-maven-plugin/4.0-alpha-1-SNAPSHOT/archivatest-maven-plugin-4.0-alpha-1-20070822.033400-42.jar" "Modify File (proxied)"
 INFO|main|16570|Cache:url-failures-cache       - Disposing cache: [ name = url-failures-cache status = STATUS_ALIVE eternal = false overflowToDisk = false maxElementsInMemory = 1000 maxElementsOnDisk = 0 memoryStoreEvictionPolicy = LRU timeToLiveSeconds = 1800 timeToIdleSeconds = 2700 diskPersistent = false diskExpiryThreadIntervalSeconds = 600 cacheEventListeners:  hitCount = 0 memoryStoreHitCount = 0 diskStoreHitCount = 0 missCountNotFound = 0 missCountExpired = 0 ]
There was no such logger 'org.codehaus.plexus.redback.xwork.filter.authentication.HttpAuthenticator:basic' 17401236.
 WARN|main|16571|PlexusContainer                - Component manager not found for returned component. Ignored. component=org.apache.maven.archiva.web.repository.ProxiedDavServer@fd0a62
 INFO|main|16836|log                            - jetty-6.1.5
 INFO|main|16836|log                            - Started SocketConnector@0.0.0.0:37244
Remote HTTP Server started on http://localhost:37244/snapshots
 INFO|main|17943|AuditLog                       - internal guest 127.0.0.1 "org/apache/archiva/archivatest-maven-plugin/4.0-alpha-1-SNAPSHOT/archivatest-maven-plugin-4.0-alpha-1-20070822.033400-42.jar" "Modify File (proxied)"
 INFO|main|17948|Cache:url-failures-cache       - Disposing cache: [ name = url-failures-cache status = STATUS_ALIVE eternal = false overflowToDisk = false maxElementsInMemory = 1000 maxElementsOnDisk = 0 memoryStoreEvictionPolicy = LRU timeToLiveSeconds = 1800 timeToIdleSeconds = 2700 diskPersistent = false diskExpiryThreadIntervalSeconds = 600 cacheEventListeners:  hitCount = 0 memoryStoreHitCount = 0 diskStoreHitCount = 0 missCountNotFound = 0 missCountExpired = 0 ]
There was no such logger 'org.codehaus.plexus.redback.xwork.filter.authentication.HttpAuthenticator:basic' 23860416.
 WARN|main|17948|PlexusContainer                - Component manager not found for returned component. Ignored. component=org.apache.maven.archiva.web.repository.ProxiedDavServer@e64795
 INFO|main|18113|log                            - jetty-6.1.5
 INFO|main|18114|log                            - Started SocketConnector@0.0.0.0:37249
Remote HTTP Server started on http://localhost:37249/snapshots
 INFO|main|19124|AuditLog                       - internal guest 127.0.0.1 "org/apache/archiva/archivatest-maven-plugin/4.0-alpha-1-SNAPSHOT/archivatest-maven-plugin-4.0-alpha-1-20070822.033400-42.jar" "Modify File (proxied)"
 INFO|main|19230|Cache:url-failures-cache       - Disposing cache: [ name = url-failures-cache status = STATUS_ALIVE eternal = false overflowToDisk = false maxElementsInMemory = 1000 maxElementsOnDisk = 0 memoryStoreEvictionPolicy = LRU timeToLiveSeconds = 1800 timeToIdleSeconds = 2700 diskPersistent = false diskExpiryThreadIntervalSeconds = 600 cacheEventListeners:  hitCount = 0 memoryStoreHitCount = 0 diskStoreHitCount = 0 missCountNotFound = 0 missCountExpired = 0 ]
There was no such logger 'org.codehaus.plexus.redback.xwork.filter.authentication.HttpAuthenticator:basic' 25054444.
 WARN|main|19230|PlexusContainer                - Component manager not found for returned component. Ignored. component=org.apache.maven.archiva.web.repository.ProxiedDavServer@1a82e92
 INFO|main|20009|log                            - jetty-6.1.5
 INFO|main|20011|log                            - Started SocketConnector@0.0.0.0:37254
Remote HTTP Server started on http://localhost:37254/snapshots
 INFO|main|21027|RepositoryProxyConnectors:default - Transfer not attempted on http://localhost:37254/snapshots/org/apache/archiva/archivatest-maven-plugin/4.0-alpha-1-SNAPSHOT/archivatest-maven-plugin-4.0-alpha-1-20070822.033400-42.jar : NO to update snapshots, policy is ONCE, and local file exist.: using already present local file.
 INFO|main|21030|AuditLog                       - internal guest 127.0.0.1 "org/apache/archiva/archivatest-maven-plugin/4.0-alpha-1-SNAPSHOT/archivatest-maven-plugin-4.0-alpha-1-20070822.033400-42.jar" "Modify File (proxied)"
 INFO|main|21140|Cache:url-failures-cache       - Disposing cache: [ name = url-failures-cache status = STATUS_ALIVE eternal = false overflowToDisk = false maxElementsInMemory = 1000 maxElementsOnDisk = 0 memoryStoreEvictionPolicy = LRU timeToLiveSeconds = 1800 timeToIdleSeconds = 2700 diskPersistent = false diskExpiryThreadIntervalSeconds = 600 cacheEventListeners:  hitCount = 0 memoryStoreHitCount = 0 diskStoreHitCount = 0 missCountNotFound = 0 missCountExpired = 0 ]
There was no such logger 'org.codehaus.plexus.redback.xwork.filter.authentication.HttpAuthenticator:basic' 1269514.
 WARN|main|21140|PlexusContainer                - Component manager not found for returned component. Ignored. component=org.apache.maven.archiva.web.repository.ProxiedDavServer@a16605
 INFO|main|21288|log                            - jetty-6.1.5
 INFO|main|21289|log                            - Started SocketConnector@0.0.0.0:37258
Remote HTTP Server started on http://localhost:37258/snapshots
 INFO|main|22312|AuditLog                       - internal guest 127.0.0.1 "org/apache/archiva/archivatest-maven-plugin/4.0-alpha-1-SNAPSHOT/archivatest-maven-plugin-4.0-alpha-1-20070822.033400-42.jar" "Modify File (proxied)"
 INFO|main|22419|Cache:url-failures-cache       - Disposing cache: [ name = url-failures-cache status = STATUS_ALIVE eternal = false overflowToDisk = false maxElementsInMemory = 1000 maxElementsOnDisk = 0 memoryStoreEvictionPolicy = LRU timeToLiveSeconds = 1800 timeToIdleSeconds = 2700 diskPersistent = false diskExpiryThreadIntervalSeconds = 600 cacheEventListeners:  hitCount = 0 memoryStoreHitCount = 0 diskStoreHitCount = 0 missCountNotFound = 0 missCountExpired = 0 ]
There was no such logger 'org.codehaus.plexus.redback.xwork.filter.authentication.HttpAuthenticator:basic' 17286677.
 WARN|main|22420|PlexusContainer                - Component manager not found for returned component. Ignored. component=org.apache.maven.archiva.web.repository.ProxiedDavServer@15cb235
 INFO|main|22548|log                            - jetty-6.1.5
 INFO|main|22550|log                            - Started SocketConnector@0.0.0.0:37262
Remote HTTP Server started on http://localhost:37262/snapshots
 INFO|main|23572|AuditLog                       - internal guest 127.0.0.1 "org/apache/archiva/archivatest-maven-plugin/4.0-alpha-1-SNAPSHOT/archivatest-maven-plugin-4.0-alpha-1-20070822.033400-42.jar" "Modify File (proxied)"
 INFO|main|23681|Cache:url-failures-cache       - Disposing cache: [ name = url-failures-cache status = STATUS_ALIVE eternal = false overflowToDisk = false maxElementsInMemory = 1000 maxElementsOnDisk = 0 memoryStoreEvictionPolicy = LRU timeToLiveSeconds = 1800 timeToIdleSeconds = 2700 diskPersistent = false diskExpiryThreadIntervalSeconds = 600 cacheEventListeners:  hitCount = 0 memoryStoreHitCount = 0 diskStoreHitCount = 0 missCountNotFound = 0 missCountExpired = 0 ]
There was no such logger 'org.codehaus.plexus.redback.xwork.filter.authentication.HttpAuthenticator:basic' 11086506.
 WARN|main|23682|PlexusContainer                - Component manager not found for returned component. Ignored. component=org.apache.maven.archiva.web.repository.ProxiedDavServer@873b9f
Tests run: 15, Failures: 0, Errors: 0, Skipped: 0, Time elapsed: 21.524 sec
Running org.apache.maven.archiva.web.action.admin.repositories.EditManagedRepositoryActionTest
Tests run: 3, Failures: 0, Errors: 0, Skipped: 0, Time elapsed: 0.419 sec
Running org.apache.maven.archiva.web.action.admin.connectors.proxy.AddProxyConnectorActionTest
 INFO|main|24198|Cache:url-failures-cache       - Disposing cache: [ name = url-failures-cache status = STATUS_ALIVE eternal = false overflowToDisk = false maxElementsInMemory = 1000 maxElementsOnDisk = 0 memoryStoreEvictionPolicy = LRU timeToLiveSeconds = 1800 timeToIdleSeconds = 2700 diskPersistent = false diskExpiryThreadIntervalSeconds = 600 cacheEventListeners:  hitCount = 0 memoryStoreHitCount = 0 diskStoreHitCount = 0 missCountNotFound = 0 missCountExpired = 0 ]
 INFO|main|24274|Cache:url-failures-cache       - Disposing cache: [ name = url-failures-cache status = STATUS_ALIVE eternal = false overflowToDisk = false maxElementsInMemory = 1000 maxElementsOnDisk = 0 memoryStoreEvictionPolicy = LRU timeToLiveSeconds = 1800 timeToIdleSeconds = 2700 diskPersistent = false diskExpiryThreadIntervalSeconds = 600 cacheEventListeners:  hitCount = 0 memoryStoreHitCount = 0 diskStoreHitCount = 0 missCountNotFound = 0 missCountExpired = 0 ]
 INFO|main|24566|Cache:url-failures-cache       - Disposing cache: [ name = url-failures-cache status = STATUS_ALIVE eternal = false overflowToDisk = false maxElementsInMemory = 1000 maxElementsOnDisk = 0 memoryStoreEvictionPolicy = LRU timeToLiveSeconds = 1800 timeToIdleSeconds = 2700 diskPersistent = false diskExpiryThreadIntervalSeconds = 600 cacheEventListeners:  hitCount = 0 memoryStoreHitCount = 0 diskStoreHitCount = 0 missCountNotFound = 0 missCountExpired = 0 ]
 INFO|main|24636|Cache:url-failures-cache       - Disposing cache: [ name = url-failures-cache status = STATUS_ALIVE eternal = false overflowToDisk = false maxElementsInMemory = 1000 maxElementsOnDisk = 0 memoryStoreEvictionPolicy = LRU timeToLiveSeconds = 1800 timeToIdleSeconds = 2700 diskPersistent = false diskExpiryThreadIntervalSeconds = 600 cacheEventListeners:  hitCount = 0 memoryStoreHitCount = 0 diskStoreHitCount = 0 missCountNotFound = 0 missCountExpired = 0 ]
 INFO|main|24711|Cache:url-failures-cache       - Disposing cache: [ name = url-failures-cache status = STATUS_ALIVE eternal = false overflowToDisk = false maxElementsInMemory = 1000 maxElementsOnDisk = 0 memoryStoreEvictionPolicy = LRU timeToLiveSeconds = 1800 timeToIdleSeconds = 2700 diskPersistent = false diskExpiryThreadIntervalSeconds = 600 cacheEventListeners:  hitCount = 0 memoryStoreHitCount = 0 diskStoreHitCount = 0 missCountNotFound = 0 missCountExpired = 0 ]
 INFO|main|24795|Cache:url-failures-cache       - Disposing cache: [ name = url-failures-cache status = STATUS_ALIVE eternal = false overflowToDisk = false maxElementsInMemory = 1000 maxElementsOnDisk = 0 memoryStoreEvictionPolicy = LRU timeToLiveSeconds = 1800 timeToIdleSeconds = 2700 diskPersistent = false diskExpiryThreadIntervalSeconds = 600 cacheEventListeners:  hitCount = 0 memoryStoreHitCount = 0 diskStoreHitCount = 0 missCountNotFound = 0 missCountExpired = 0 ]
 INFO|main|24871|Cache:url-failures-cache       - Disposing cache: [ name = url-failures-cache status = STATUS_ALIVE eternal = false overflowToDisk = false maxElementsInMemory = 1000 maxElementsOnDisk = 0 memoryStoreEvictionPolicy = LRU timeToLiveSeconds = 1800 timeToIdleSeconds = 2700 diskPersistent = false diskExpiryThreadIntervalSeconds = 600 cacheEventListeners:  hitCount = 0 memoryStoreHitCount = 0 diskStoreHitCount = 0 missCountNotFound = 0 missCountExpired = 0 ]
 INFO|main|25080|Cache:url-failures-cache       - Disposing cache: [ name = url-failures-cache status = STATUS_ALIVE eternal = false overflowToDisk = false maxElementsInMemory = 1000 maxElementsOnDisk = 0 memoryStoreEvictionPolicy = LRU timeToLiveSeconds = 1800 timeToIdleSeconds = 2700 diskPersistent = false diskExpiryThreadIntervalSeconds = 600 cacheEventListeners:  hitCount = 0 memoryStoreHitCount = 0 diskStoreHitCount = 0 missCountNotFound = 0 missCountExpired = 0 ]
 INFO|main|25150|Cache:url-failures-cache       - Disposing cache: [ name = url-failures-cache status = STATUS_ALIVE eternal = false overflowToDisk = false maxElementsInMemory = 1000 maxElementsOnDisk = 0 memoryStoreEvictionPolicy = LRU timeToLiveSeconds = 1800 timeToIdleSeconds = 2700 diskPersistent = false diskExpiryThreadIntervalSeconds = 600 cacheEventListeners:  hitCount = 0 memoryStoreHitCount = 0 diskStoreHitCount = 0 missCountNotFound = 0 missCountExpired = 0 ]
Tests run: 9, Failures: 0, Errors: 0, Skipped: 0, Time elapsed: 1.029 sec
Running org.apache.maven.archiva.web.action.admin.repositories.DeleteManagedRepositoryActionTest
 INFO|main|25415|Action:deleteManagedRepositoryAction - Removing artifact org.apache.maven.archiva:test-artifact:jar:1.0 from the database.
 INFO|main|25508|Action:deleteManagedRepositoryAction - Removing artifact org.apache.maven.archiva:test-artifact:jar:1.0 from the database.
 INFO|main|25578|Action:deleteManagedRepositoryAction - Removing artifact org.apache.maven.archiva:test-artifact:jar:1.0 from the database.
Tests run: 6, Failures: 0, Errors: 0, Skipped: 0, Time elapsed: 0.488 sec
Running org.apache.maven.archiva.web.startup.BannerTest
Tests run: 3, Failures: 0, Errors: 0, Skipped: 0, Time elapsed: 0.006 sec
Running org.apache.maven.archiva.web.action.admin.connectors.proxy.DeleteProxyConnectorActionTest
[INFO] Disposing cache: [ name = url-failures-cache status = STATUS_ALIVE eternal = false overflowToDisk = false maxElementsInMemory = 1000 maxElementsOnDisk = 0 memoryStoreEvictionPolicy = LRU timeToLiveSeconds = 1800 timeToIdleSeconds = 2700 diskPersistent = true diskExpiryThreadIntervalSeconds = 600 cacheEventListeners:  hitCount = 0 memoryStoreHitCount = 0 diskStoreHitCount = 0 missCountNotFound = 0 missCountExpired = 0 ]
[INFO] Disposing cache: [ name = url-failures-cache status = STATUS_ALIVE eternal = false overflowToDisk = false maxElementsInMemory = 1000 maxElementsOnDisk = 0 memoryStoreEvictionPolicy = LRU timeToLiveSeconds = 1800 timeToIdleSeconds = 2700 diskPersistent = true diskExpiryThreadIntervalSeconds = 600 cacheEventListeners:  hitCount = 0 memoryStoreHitCount = 0 diskStoreHitCount = 0 missCountNotFound = 0 missCountExpired = 0 ]
[INFO] Disposing cache: [ name = url-failures-cache status = STATUS_ALIVE eternal = false overflowToDisk = false maxElementsInMemory = 1000 maxElementsOnDisk = 0 memoryStoreEvictionPolicy = LRU timeToLiveSeconds = 1800 timeToIdleSeconds = 2700 diskPersistent = true diskExpiryThreadIntervalSeconds = 600 cacheEventListeners:  hitCount = 0 memoryStoreHitCount = 0 diskStoreHitCount = 0 missCountNotFound = 0 missCountExpired = 0 ]
[INFO] Disposing cache: [ name = url-failures-cache status = STATUS_ALIVE eternal = false overflowToDisk = false maxElementsInMemory = 1000 maxElementsOnDisk = 0 memoryStoreEvictionPolicy = LRU timeToLiveSeconds = 1800 timeToIdleSeconds = 2700 diskPersistent = true diskExpiryThreadIntervalSeconds = 600 cacheEventListeners:  hitCount = 0 memoryStoreHitCount = 0 diskStoreHitCount = 0 missCountNotFound = 0 missCountExpired = 0 ]
[INFO] Disposing cache: [ name = url-failures-cache status = STATUS_ALIVE eternal = false overflowToDisk = false maxElementsInMemory = 1000 maxElementsOnDisk = 0 memoryStoreEvictionPolicy = LRU timeToLiveSeconds = 1800 timeToIdleSeconds = 2700 diskPersistent = true diskExpiryThreadIntervalSeconds = 600 cacheEventListeners:  hitCount = 0 memoryStoreHitCount = 0 diskStoreHitCount = 0 missCountNotFound = 0 missCountExpired = 0 ]
Tests run: 5, Failures: 0, Errors: 0, Skipped: 0, Time elapsed: 0.436 sec
Running org.apache.maven.archiva.web.action.admin.repositories.DeleteRemoteRepositoryActionTest
[INFO] Disposing cache: [ name = url-failures-cache status = STATUS_ALIVE eternal = false overflowToDisk = false maxElementsInMemory = 1000 maxElementsOnDisk = 0 memoryStoreEvictionPolicy = LRU timeToLiveSeconds = 1800 timeToIdleSeconds = 2700 diskPersistent = true diskExpiryThreadIntervalSeconds = 600 cacheEventListeners:  hitCount = 0 memoryStoreHitCount = 0 diskStoreHitCount = 0 missCountNotFound = 0 missCountExpired = 0 ]
[INFO] Disposing cache: [ name = url-failures-cache status = STATUS_ALIVE eternal = false overflowToDisk = false maxElementsInMemory = 1000 maxElementsOnDisk = 0 memoryStoreEvictionPolicy = LRU timeToLiveSeconds = 1800 timeToIdleSeconds = 2700 diskPersistent = true diskExpiryThreadIntervalSeconds = 600 cacheEventListeners:  hitCount = 0 memoryStoreHitCount = 0 diskStoreHitCount = 0 missCountNotFound = 0 missCountExpired = 0 ]
[INFO] Disposing cache: [ name = url-failures-cache status = STATUS_ALIVE eternal = false overflowToDisk = false maxElementsInMemory = 1000 maxElementsOnDisk = 0 memoryStoreEvictionPolicy = LRU timeToLiveSeconds = 1800 timeToIdleSeconds = 2700 diskPersistent = true diskExpiryThreadIntervalSeconds = 600 cacheEventListeners:  hitCount = 0 memoryStoreHitCount = 0 diskStoreHitCount = 0 missCountNotFound = 0 missCountExpired = 0 ]
Tests run: 3, Failures: 0, Errors: 0, Skipped: 0, Time elapsed: 0.214 sec
Running org.apache.maven.archiva.web.action.admin.connectors.proxy.EditProxyConnectorActionTest
 INFO|main|26390|Cache:url-failures-cache       - Disposing cache: [ name = url-failures-cache status = STATUS_ALIVE eternal = false overflowToDisk = false maxElementsInMemory = 1000 maxElementsOnDisk = 0 memoryStoreEvictionPolicy = LRU timeToLiveSeconds = 1800 timeToIdleSeconds = 2700 diskPersistent = false diskExpiryThreadIntervalSeconds = 600 cacheEventListeners:  hitCount = 0 memoryStoreHitCount = 0 diskStoreHitCount = 0 missCountNotFound = 0 missCountExpired = 0 ]
 INFO|main|26818|Cache:url-failures-cache       - Disposing cache: [ name = url-failures-cache status = STATUS_ALIVE eternal = false overflowToDisk = false maxElementsInMemory = 1000 maxElementsOnDisk = 0 memoryStoreEvictionPolicy = LRU timeToLiveSeconds = 1800 timeToIdleSeconds = 2700 diskPersistent = false diskExpiryThreadIntervalSeconds = 600 cacheEventListeners:  hitCount = 0 memoryStoreHitCount = 0 diskStoreHitCount = 0 missCountNotFound = 0 missCountExpired = 0 ]
 INFO|main|26887|Cache:url-failures-cache       - Disposing cache: [ name = url-failures-cache status = STATUS_ALIVE eternal = false overflowToDisk = false maxElementsInMemory = 1000 maxElementsOnDisk = 0 memoryStoreEvictionPolicy = LRU timeToLiveSeconds = 1800 timeToIdleSeconds = 2700 diskPersistent = false diskExpiryThreadIntervalSeconds = 600 cacheEventListeners:  hitCount = 0 memoryStoreHitCount = 0 diskStoreHitCount = 0 missCountNotFound = 0 missCountExpired = 0 ]
 INFO|main|26955|Cache:url-failures-cache       - Disposing cache: [ name = url-failures-cache status = STATUS_ALIVE eternal = false overflowToDisk = false maxElementsInMemory = 1000 maxElementsOnDisk = 0 memoryStoreEvictionPolicy = LRU timeToLiveSeconds = 1800 timeToIdleSeconds = 2700 diskPersistent = false diskExpiryThreadIntervalSeconds = 600 cacheEventListeners:  hitCount = 0 memoryStoreHitCount = 0 diskStoreHitCount = 0 missCountNotFound = 0 missCountExpired = 0 ]
 INFO|main|27025|Cache:url-failures-cache       - Disposing cache: [ name = url-failures-cache status = STATUS_ALIVE eternal = false overflowToDisk = false maxElementsInMemory = 1000 maxElementsOnDisk = 0 memoryStoreEvictionPolicy = LRU timeToLiveSeconds = 1800 timeToIdleSeconds = 2700 diskPersistent = false diskExpiryThreadIntervalSeconds = 600 cacheEventListeners:  hitCount = 0 memoryStoreHitCount = 0 diskStoreHitCount = 0 missCountNotFound = 0 missCountExpired = 0 ]
 INFO|main|27205|Cache:url-failures-cache       - Disposing cache: [ name = url-failures-cache status = STATUS_ALIVE eternal = false overflowToDisk = false maxElementsInMemory = 1000 maxElementsOnDisk = 0 memoryStoreEvictionPolicy = LRU timeToLiveSeconds = 1800 timeToIdleSeconds = 2700 diskPersistent = false diskExpiryThreadIntervalSeconds = 600 cacheEventListeners:  hitCount = 0 memoryStoreHitCount = 0 diskStoreHitCount = 0 missCountNotFound = 0 missCountExpired = 0 ]
 INFO|main|27278|Cache:url-failures-cache       - Disposing cache: [ name = url-failures-cache status = STATUS_ALIVE eternal = false overflowToDisk = false maxElementsInMemory = 1000 maxElementsOnDisk = 0 memoryStoreEvictionPolicy = LRU timeToLiveSeconds = 1800 timeToIdleSeconds = 2700 diskPersistent = false diskExpiryThreadIntervalSeconds = 600 cacheEventListeners:  hitCount = 0 memoryStoreHitCount = 0 diskStoreHitCount = 0 missCountNotFound = 0 missCountExpired = 0 ]
 INFO|main|27349|Cache:url-failures-cache       - Disposing cache: [ name = url-failures-cache status = STATUS_ALIVE eternal = false overflowToDisk = false maxElementsInMemory = 1000 maxElementsOnDisk = 0 memoryStoreEvictionPolicy = LRU timeToLiveSeconds = 1800 timeToIdleSeconds = 2700 diskPersistent = false diskExpiryThreadIntervalSeconds = 600 cacheEventListeners:  hitCount = 0 memoryStoreHitCount = 0 diskStoreHitCount = 0 missCountNotFound = 0 missCountExpired = 0 ]
 INFO|main|27425|Cache:url-failures-cache       - Disposing cache: [ name = url-failures-cache status = STATUS_ALIVE eternal = false overflowToDisk = false maxElementsInMemory = 1000 maxElementsOnDisk = 0 memoryStoreEvictionPolicy = LRU timeToLiveSeconds = 1800 timeToIdleSeconds = 2700 diskPersistent = false diskExpiryThreadIntervalSeconds = 600 cacheEventListeners:  hitCount = 0 memoryStoreHitCount = 0 diskStoreHitCount = 0 missCountNotFound = 0 missCountExpired = 0 ]
Tests run: 9, Failures: 0, Errors: 0, Skipped: 0, Time elapsed: 1.109 sec
Running org.apache.maven.archiva.web.action.admin.repositories.AddRemoteRepositoryActionTest
[INFO] Disposing cache: [ name = url-failures-cache status = STATUS_ALIVE eternal = false overflowToDisk = false maxElementsInMemory = 1000 maxElementsOnDisk = 0 memoryStoreEvictionPolicy = LRU timeToLiveSeconds = 1800 timeToIdleSeconds = 2700 diskPersistent = true diskExpiryThreadIntervalSeconds = 600 cacheEventListeners:  hitCount = 0 memoryStoreHitCount = 0 diskStoreHitCount = 0 missCountNotFound = 0 missCountExpired = 0 ]
[INFO] Disposing cache: [ name = url-failures-cache status = STATUS_ALIVE eternal = false overflowToDisk = false maxElementsInMemory = 1000 maxElementsOnDisk = 0 memoryStoreEvictionPolicy = LRU timeToLiveSeconds = 1800 timeToIdleSeconds = 2700 diskPersistent = true diskExpiryThreadIntervalSeconds = 600 cacheEventListeners:  hitCount = 0 memoryStoreHitCount = 0 diskStoreHitCount = 0 missCountNotFound = 0 missCountExpired = 0 ]
[INFO] Disposing cache: [ name = url-failures-cache status = STATUS_ALIVE eternal = false overflowToDisk = false maxElementsInMemory = 1000 maxElementsOnDisk = 0 memoryStoreEvictionPolicy = LRU timeToLiveSeconds = 1800 timeToIdleSeconds = 2700 diskPersistent = true diskExpiryThreadIntervalSeconds = 600 cacheEventListeners:  hitCount = 0 memoryStoreHitCount = 0 diskStoreHitCount = 0 missCountNotFound = 0 missCountExpired = 0 ]
Tests run: 3, Failures: 0, Errors: 0, Skipped: 0, Time elapsed: 0.648 sec
Running org.apache.maven.archiva.web.action.admin.repositories.AddManagedRepositoryActionTest
Tests run: 3, Failures: 0, Errors: 0, Skipped: 0, Time elapsed: 0.576 sec
Running org.apache.maven.archiva.web.repository.RepositoryServletSecurityTest
There was no such logger 'org.apache.maven.archiva.configuration.ArchivaConfiguration:default' 13254846.
 INFO|main|28805|Cache:url-failures-cache       - Disposing cache: [ name = url-failures-cache status = STATUS_ALIVE eternal = false overflowToDisk = false maxElementsInMemory = 1000 maxElementsOnDisk = 0 memoryStoreEvictionPolicy = LRU timeToLiveSeconds = 1800 timeToIdleSeconds = 2700 diskPersistent = false diskExpiryThreadIntervalSeconds = 600 cacheEventListeners:  hitCount = 0 memoryStoreHitCount = 0 diskStoreHitCount = 0 missCountNotFound = 0 missCountExpired = 0 ]
There was no such logger 'org.apache.maven.archiva.configuration.ArchivaConfiguration:default' 6033295.
 INFO|main|28938|Cache:url-failures-cache       - Disposing cache: [ name = url-failures-cache status = STATUS_ALIVE eternal = false overflowToDisk = false maxElementsInMemory = 1000 maxElementsOnDisk = 0 memoryStoreEvictionPolicy = LRU timeToLiveSeconds = 1800 timeToIdleSeconds = 2700 diskPersistent = false diskExpiryThreadIntervalSeconds = 600 cacheEventListeners:  hitCount = 0 memoryStoreHitCount = 0 diskStoreHitCount = 0 missCountNotFound = 0 missCountExpired = 0 ]
Tests run: 2, Failures: 0, Errors: 0, Skipped: 0, Time elapsed: 0.278 sec
Running org.apache.maven.archiva.web.repository.RepositoryServletProxiedMetadataRemoteOnlyTest
 INFO|main|29081|log                            - jetty-6.1.5
 INFO|main|29082|log                            - Started SocketConnector@0.0.0.0:37269
Remote HTTP Server started on http://localhost:37269/snapshots
 INFO|main|30045|log                            - jetty-6.1.5
 INFO|main|30046|log                            - Started SocketConnector@0.0.0.0:37272
Remote HTTP Server started on http://localhost:37272/private-snapshots
 INFO|main|31372|AuditLog                       - internal guest 127.0.0.1 "/org/apache/archiva/archivatest-maven-plugin/4.0-alpha-1-SNAPSHOT/maven-metadata.xml" "Modify File (proxied)"
 INFO|main|31628|Cache:url-failures-cache       - Disposing cache: [ name = url-failures-cache status = STATUS_ALIVE eternal = false overflowToDisk = false maxElementsInMemory = 1000 maxElementsOnDisk = 0 memoryStoreEvictionPolicy = LRU timeToLiveSeconds = 1800 timeToIdleSeconds = 2700 diskPersistent = false diskExpiryThreadIntervalSeconds = 600 cacheEventListeners:  hitCount = 0 memoryStoreHitCount = 0 diskStoreHitCount = 0 missCountNotFound = 0 missCountExpired = 0 ]
There was no such logger 'org.codehaus.plexus.redback.xwork.filter.authentication.HttpAuthenticator:basic' 8951503.
 WARN|main|31629|PlexusContainer                - Component manager not found for returned component. Ignored. component=org.apache.maven.archiva.web.repository.ProxiedDavServer@95c2b4
 INFO|main|31767|log                            - jetty-6.1.5
 INFO|main|31768|log                            - Started SocketConnector@0.0.0.0:37280
Remote HTTP Server started on http://localhost:37280/snapshots
 INFO|main|32683|log                            - jetty-6.1.5
 INFO|main|32684|log                            - Started SocketConnector@0.0.0.0:37283
Remote HTTP Server started on http://localhost:37283/private-snapshots
 INFO|main|33760|AuditLog                       - internal guest 127.0.0.1 "/org/apache/maven/plugins/maven-assembly-plugin/2.2-beta-2-SNAPSHOT/maven-metadata.xml" "Modify File (proxied)"
 INFO|main|33978|Cache:url-failures-cache       - Disposing cache: [ name = url-failures-cache status = STATUS_ALIVE eternal = false overflowToDisk = false maxElementsInMemory = 1000 maxElementsOnDisk = 0 memoryStoreEvictionPolicy = LRU timeToLiveSeconds = 1800 timeToIdleSeconds = 2700 diskPersistent = false diskExpiryThreadIntervalSeconds = 600 cacheEventListeners:  hitCount = 0 memoryStoreHitCount = 0 diskStoreHitCount = 0 missCountNotFound = 0 missCountExpired = 0 ]
There was no such logger 'org.codehaus.plexus.redback.xwork.filter.authentication.HttpAuthenticator:basic' 32891370.
 WARN|main|33979|PlexusContainer                - Component manager not found for returned component. Ignored. component=org.apache.maven.archiva.web.repository.ProxiedDavServer@1db0c7e
 INFO|main|34101|log                            - jetty-6.1.5
 INFO|main|34102|log                            - Started SocketConnector@0.0.0.0:37290
Remote HTTP Server started on http://localhost:37290/snapshots
 INFO|main|35013|log                            - jetty-6.1.5
 INFO|main|35014|log                            - Started SocketConnector@0.0.0.0:37296
Remote HTTP Server started on http://localhost:37296/private-snapshots
 INFO|main|36063|AuditLog                       - internal guest 127.0.0.1 "/org/apache/archiva/archivatest-maven-plugin/4.0-alpha-2/maven-metadata.xml" "Modify File (proxied)"
 INFO|main|36288|Cache:url-failures-cache       - Disposing cache: [ name = url-failures-cache status = STATUS_ALIVE eternal = false overflowToDisk = false maxElementsInMemory = 1000 maxElementsOnDisk = 0 memoryStoreEvictionPolicy = LRU timeToLiveSeconds = 1800 timeToIdleSeconds = 2700 diskPersistent = false diskExpiryThreadIntervalSeconds = 600 cacheEventListeners:  hitCount = 0 memoryStoreHitCount = 0 diskStoreHitCount = 0 missCountNotFound = 0 missCountExpired = 0 ]
There was no such logger 'org.codehaus.plexus.redback.xwork.filter.authentication.HttpAuthenticator:basic' 2114627.
 WARN|main|36289|PlexusContainer                - Component manager not found for returned component. Ignored. component=org.apache.maven.archiva.web.repository.ProxiedDavServer@19cf00a
 INFO|main|36575|log                            - jetty-6.1.5
 INFO|main|36577|log                            - Started SocketConnector@0.0.0.0:37304
Remote HTTP Server started on http://localhost:37304/snapshots
 INFO|main|37413|log                            - jetty-6.1.5
 INFO|main|37414|log                            - Started SocketConnector@0.0.0.0:37306
Remote HTTP Server started on http://localhost:37306/private-snapshots
 INFO|main|38430|AuditLog                       - internal guest 127.0.0.1 "/org/apache/archiva/archivatest-maven-plugin/maven-metadata.xml" "Modify File (proxied)"
 INFO|main|38648|Cache:url-failures-cache       - Disposing cache: [ name = url-failures-cache status = STATUS_ALIVE eternal = false overflowToDisk = false maxElementsInMemory = 1000 maxElementsOnDisk = 0 memoryStoreEvictionPolicy = LRU timeToLiveSeconds = 1800 timeToIdleSeconds = 2700 diskPersistent = false diskExpiryThreadIntervalSeconds = 600 cacheEventListeners:  hitCount = 0 memoryStoreHitCount = 0 diskStoreHitCount = 0 missCountNotFound = 0 missCountExpired = 0 ]
 WARN|main|38648|PlexusContainer                - Component manager not found for returned component. Ignored. component=org.apache.maven.archiva.web.repository.ProxiedDavServer@6c211a
There was no such logger 'org.codehaus.plexus.redback.xwork.filter.authentication.HttpAuthenticator:basic' 5992485.
Tests run: 4, Failures: 0, Errors: 0, Skipped: 0, Time elapsed: 9.707 sec
Running org.apache.maven.archiva.web.action.admin.repositories.RepositoriesActionTest
 INFO|main|38726|Cache:url-failures-cache       - Disposing cache: [ name = url-failures-cache status = STATUS_ALIVE eternal = false overflowToDisk = false maxElementsInMemory = 1000 maxElementsOnDisk = 0 memoryStoreEvictionPolicy = LRU timeToLiveSeconds = 1800 timeToIdleSeconds = 2700 diskPersistent = true diskExpiryThreadIntervalSeconds = 600 cacheEventListeners:  hitCount = 0 memoryStoreHitCount = 0 diskStoreHitCount = 0 missCountNotFound = 0 missCountExpired = 0 ]
 INFO|main|38823|Cache:url-failures-cache       - Disposing cache: [ name = url-failures-cache status = STATUS_ALIVE eternal = false overflowToDisk = false maxElementsInMemory = 1000 maxElementsOnDisk = 0 memoryStoreEvictionPolicy = LRU timeToLiveSeconds = 1800 timeToIdleSeconds = 2700 diskPersistent = true diskExpiryThreadIntervalSeconds = 600 cacheEventListeners:  hitCount = 0 memoryStoreHitCount = 0 diskStoreHitCount = 0 missCountNotFound = 0 missCountExpired = 0 ]
Tests run: 2, Failures: 0, Errors: 0, Skipped: 0, Time elapsed: 0.173 sec
Running org.apache.maven.archiva.web.repository.RepositoryServletProxiedTimestampedSnapshotPolicyTest
 INFO|main|38959|log                            - jetty-6.1.5
 INFO|main|38960|log                            - Started SocketConnector@0.0.0.0:37316
Remote HTTP Server started on http://localhost:37316/snapshots
 INFO|main|40037|Cache:url-failures-cache       - Disposing cache: [ name = url-failures-cache status = STATUS_ALIVE eternal = false overflowToDisk = false maxElementsInMemory = 1000 maxElementsOnDisk = 0 memoryStoreEvictionPolicy = LRU timeToLiveSeconds = 1800 timeToIdleSeconds = 2700 diskPersistent = false diskExpiryThreadIntervalSeconds = 600 cacheEventListeners:  hitCount = 0 memoryStoreHitCount = 0 diskStoreHitCount = 0 missCountNotFound = 0 missCountExpired = 0 ]
 WARN|main|40038|PlexusContainer                - Component manager not found for returned component. Ignored. component=org.apache.maven.archiva.web.repository.ProxiedDavServer@e9c0a8
There was no such logger 'org.codehaus.plexus.redback.xwork.filter.authentication.HttpAuthenticator:basic' 13112946.
 INFO|main|40426|log                            - jetty-6.1.5
 INFO|main|40427|log                            - Started SocketConnector@0.0.0.0:37322
Remote HTTP Server started on http://localhost:37322/snapshots
 INFO|main|41409|AuditLog                       - internal guest 127.0.0.1 "org/apache/archiva/test/3.0-SNAPSHOT/test-3.0-20070822.033400-42.jar" "Modify File (proxied)"
 INFO|main|41517|Cache:url-failures-cache       - Disposing cache: [ name = url-failures-cache status = STATUS_ALIVE eternal = false overflowToDisk = false maxElementsInMemory = 1000 maxElementsOnDisk = 0 memoryStoreEvictionPolicy = LRU timeToLiveSeconds = 1800 timeToIdleSeconds = 2700 diskPersistent = false diskExpiryThreadIntervalSeconds = 600 cacheEventListeners:  hitCount = 0 memoryStoreHitCount = 0 diskStoreHitCount = 0 missCountNotFound = 0 missCountExpired = 0 ]
There was no such logger 'org.codehaus.plexus.redback.xwork.filter.authentication.HttpAuthenticator:basic' 26233524.
 WARN|main|41518|PlexusContainer                - Component manager not found for returned component. Ignored. component=org.apache.maven.archiva.web.repository.ProxiedDavServer@1650b0e
 INFO|main|41660|log                            - jetty-6.1.5
 INFO|main|41661|log                            - Started SocketConnector@0.0.0.0:37330
Remote HTTP Server started on http://localhost:37330/snapshots
 INFO|main|42679|AuditLog                       - internal guest 127.0.0.1 "org/apache/archiva/test/3.0-SNAPSHOT/test-3.0-20070822.033400-42.jar" "Modify File (proxied)"
 INFO|main|42787|Cache:url-failures-cache       - Disposing cache: [ name = url-failures-cache status = STATUS_ALIVE eternal = false overflowToDisk = false maxElementsInMemory = 1000 maxElementsOnDisk = 0 memoryStoreEvictionPolicy = LRU timeToLiveSeconds = 1800 timeToIdleSeconds = 2700 diskPersistent = false diskExpiryThreadIntervalSeconds = 600 cacheEventListeners:  hitCount = 0 memoryStoreHitCount = 0 diskStoreHitCount = 0 missCountNotFound = 0 missCountExpired = 0 ]
There was no such logger 'org.codehaus.plexus.redback.xwork.filter.authentication.HttpAuthenticator:basic' 8244018.
 WARN|main|42787|PlexusContainer                - Component manager not found for returned component. Ignored. component=org.apache.maven.archiva.web.repository.ProxiedDavServer@79ae24
 INFO|main|42920|log                            - jetty-6.1.5
 INFO|main|42921|log                            - Started SocketConnector@0.0.0.0:37335
Remote HTTP Server started on http://localhost:37335/snapshots
 INFO|main|43886|RepositoryProxyConnectors:default - Transfer not attempted on http://localhost:37335/snapshots/org/apache/archiva/test/3.0-SNAPSHOT/test-3.0-20070822.033400-42.jar : NO to update snapshots, policy is DAILY, local file exist, and has been updated within the last day.: using already present local file.
 INFO|main|43888|AuditLog                       - internal guest 127.0.0.1 "org/apache/archiva/test/3.0-SNAPSHOT/test-3.0-20070822.033400-42.jar" "Modify File (proxied)"
 INFO|main|43892|Cache:url-failures-cache       - Disposing cache: [ name = url-failures-cache status = STATUS_ALIVE eternal = false overflowToDisk = false maxElementsInMemory = 1000 maxElementsOnDisk = 0 memoryStoreEvictionPolicy = LRU timeToLiveSeconds = 1800 timeToIdleSeconds = 2700 diskPersistent = false diskExpiryThreadIntervalSeconds = 600 cacheEventListeners:  hitCount = 0 memoryStoreHitCount = 0 diskStoreHitCount = 0 missCountNotFound = 0 missCountExpired = 0 ]
There was no such logger 'org.codehaus.plexus.redback.xwork.filter.authentication.HttpAuthenticator:basic' 26687282.
 WARN|main|43892|PlexusContainer                - Component manager not found for returned component. Ignored. component=org.apache.maven.archiva.web.repository.ProxiedDavServer@aa780b
 INFO|main|44154|log                            - jetty-6.1.5
 INFO|main|44155|log                            - Started SocketConnector@0.0.0.0:37341
Remote HTTP Server started on http://localhost:37341/snapshots
 INFO|main|45179|AuditLog                       - internal guest 127.0.0.1 "org/apache/archiva/test/3.0-SNAPSHOT/test-3.0-20070822.033400-42.jar" "Modify File (proxied)"
 INFO|main|45287|Cache:url-failures-cache       - Disposing cache: [ name = url-failures-cache status = STATUS_ALIVE eternal = false overflowToDisk = false maxElementsInMemory = 1000 maxElementsOnDisk = 0 memoryStoreEvictionPolicy = LRU timeToLiveSeconds = 1800 timeToIdleSeconds = 2700 diskPersistent = false diskExpiryThreadIntervalSeconds = 600 cacheEventListeners:  hitCount = 0 memoryStoreHitCount = 0 diskStoreHitCount = 0 missCountNotFound = 0 missCountExpired = 0 ]
There was no such logger 'org.codehaus.plexus.redback.xwork.filter.authentication.HttpAuthenticator:basic' 24340699.
 WARN|main|45287|PlexusContainer                - Component manager not found for returned component. Ignored. component=org.apache.maven.archiva.web.repository.ProxiedDavServer@66db21
 INFO|main|45412|log                            - jetty-6.1.5
 INFO|main|45413|log                            - Started SocketConnector@0.0.0.0:37347
Remote HTTP Server started on http://localhost:37347/snapshots
 INFO|main|46409|AuditLog                       - internal guest 127.0.0.1 "org/apache/archiva/test/3.0-SNAPSHOT/test-3.0-20070822.033400-42.jar" "Modify File (proxied)"
 INFO|main|46517|Cache:url-failures-cache       - Disposing cache: [ name = url-failures-cache status = STATUS_ALIVE eternal = false overflowToDisk = false maxElementsInMemory = 1000 maxElementsOnDisk = 0 memoryStoreEvictionPolicy = LRU timeToLiveSeconds = 1800 timeToIdleSeconds = 2700 diskPersistent = false diskExpiryThreadIntervalSeconds = 600 cacheEventListeners:  hitCount = 0 memoryStoreHitCount = 0 diskStoreHitCount = 0 missCountNotFound = 0 missCountExpired = 0 ]
There was no such logger 'org.codehaus.plexus.redback.xwork.filter.authentication.HttpAuthenticator:basic' 10320726.
 WARN|main|46517|PlexusContainer                - Component manager not found for returned component. Ignored. component=org.apache.maven.archiva.web.repository.ProxiedDavServer@1f97ae0
 INFO|main|46639|log                            - jetty-6.1.5
 INFO|main|46640|log                            - Started SocketConnector@0.0.0.0:37355
Remote HTTP Server started on http://localhost:37355/snapshots
 INFO|main|47616|RepositoryProxyConnectors:default - Transfer not attempted on http://localhost:37355/snapshots/org/apache/archiva/test/3.0-SNAPSHOT/test-3.0-20070822.033400-42.pom : NO to update, snapshots policy set to NEVER.
 INFO|main|47617|RepositoryProxyConnectors:default - Transfer not attempted on http://localhost:37355/snapshots/org/apache/archiva/test/3.0-SNAPSHOT/test-3.0-20070822.033400-42.jar : NO to update, snapshots policy set to NEVER.: using already present local file.
 INFO|main|47617|AuditLog                       - internal guest 127.0.0.1 "org/apache/archiva/test/3.0-SNAPSHOT/test-3.0-20070822.033400-42.jar" "Modify File (proxied)"
 INFO|main|47726|Cache:url-failures-cache       - Disposing cache: [ name = url-failures-cache status = STATUS_ALIVE eternal = false overflowToDisk = false maxElementsInMemory = 1000 maxElementsOnDisk = 0 memoryStoreEvictionPolicy = LRU timeToLiveSeconds = 1800 timeToIdleSeconds = 2700 diskPersistent = false diskExpiryThreadIntervalSeconds = 600 cacheEventListeners:  hitCount = 0 memoryStoreHitCount = 0 diskStoreHitCount = 0 missCountNotFound = 0 missCountExpired = 0 ]
There was no such logger 'org.codehaus.plexus.redback.xwork.filter.authentication.HttpAuthenticator:basic' 3359717.
 WARN|main|47727|PlexusContainer                - Component manager not found for returned component. Ignored. component=org.apache.maven.archiva.web.repository.ProxiedDavServer@1a38891
 INFO|main|47847|log                            - jetty-6.1.5
 INFO|main|47847|log                            - Started SocketConnector@0.0.0.0:37360
Remote HTTP Server started on http://localhost:37360/snapshots
 INFO|main|49131|RepositoryProxyConnectors:default - Transfer not attempted on http://localhost:37360/snapshots/org/apache/archiva/test/3.0-SNAPSHOT/test-3.0-20070822.033400-42.pom : NO to update, snapshots policy set to NEVER.
 INFO|main|49131|RepositoryProxyConnectors:default - Transfer not attempted on http://localhost:37360/snapshots/org/apache/archiva/test/3.0-SNAPSHOT/test-3.0-20070822.033400-42.jar : NO to update, snapshots policy set to NEVER.
 INFO|main|49236|Cache:url-failures-cache       - Disposing cache: [ name = url-failures-cache status = STATUS_ALIVE eternal = false overflowToDisk = false maxElementsInMemory = 1000 maxElementsOnDisk = 0 memoryStoreEvictionPolicy = LRU timeToLiveSeconds = 1800 timeToIdleSeconds = 2700 diskPersistent = false diskExpiryThreadIntervalSeconds = 600 cacheEventListeners:  hitCount = 0 memoryStoreHitCount = 0 diskStoreHitCount = 0 missCountNotFound = 0 missCountExpired = 0 ]
 WARN|main|49236|PlexusContainer                - Component manager not found for returned component. Ignored. component=org.apache.maven.archiva.web.repository.ProxiedDavServer@10a1b36
There was no such logger 'org.codehaus.plexus.redback.xwork.filter.authentication.HttpAuthenticator:basic' 30040639.
 INFO|main|49348|log                            - jetty-6.1.5
 INFO|main|49349|log                            - Started SocketConnector@0.0.0.0:37366
Remote HTTP Server started on http://localhost:37366/snapshots
 INFO|main|50268|RepositoryProxyConnectors:default - Transfer not attempted on http://localhost:37366/snapshots/org/apache/archiva/test/3.0-SNAPSHOT/test-3.0-20070822.033400-42.pom : NO to update, snapshots policy set to NEVER.
 INFO|main|50269|RepositoryProxyConnectors:default - Transfer not attempted on http://localhost:37366/snapshots/org/apache/archiva/test/3.0-SNAPSHOT/test-3.0-20070822.033400-42.jar : NO to update, snapshots policy set to NEVER.: using already present local file.
 INFO|main|50269|AuditLog                       - internal guest 127.0.0.1 "org/apache/archiva/test/3.0-SNAPSHOT/test-3.0-20070822.033400-42.jar" "Modify File (proxied)"
There was no such logger 'org.codehaus.plexus.redback.xwork.filter.authentication.HttpAuthenticator:basic' 27724273.
 INFO|main|50273|Cache:url-failures-cache       - Disposing cache: [ name = url-failures-cache status = STATUS_ALIVE eternal = false overflowToDisk = false maxElementsInMemory = 1000 maxElementsOnDisk = 0 memoryStoreEvictionPolicy = LRU timeToLiveSeconds = 1800 timeToIdleSeconds = 2700 diskPersistent = false diskExpiryThreadIntervalSeconds = 600 cacheEventListeners:  hitCount = 0 memoryStoreHitCount = 0 diskStoreHitCount = 0 missCountNotFound = 0 missCountExpired = 0 ]
 WARN|main|50273|PlexusContainer                - Component manager not found for returned component. Ignored. component=org.apache.maven.archiva.web.repository.ProxiedDavServer@7783ea
 INFO|main|50390|log                            - jetty-6.1.5
 INFO|main|50390|log                            - Started SocketConnector@0.0.0.0:37371
Remote HTTP Server started on http://localhost:37371/snapshots
 INFO|main|51398|RepositoryProxyConnectors:default - Transfer not attempted on http://localhost:37371/snapshots/org/apache/archiva/test/3.0-SNAPSHOT/test-3.0-20070822.033400-42.jar : NO to update snapshots, policy is HOURLY, local file exist, and has been updated within the last hour.: using already present local file.
 INFO|main|51398|AuditLog                       - internal guest 127.0.0.1 "org/apache/archiva/test/3.0-SNAPSHOT/test-3.0-20070822.033400-42.jar" "Modify File (proxied)"
 INFO|main|51506|Cache:url-failures-cache       - Disposing cache: [ name = url-failures-cache status = STATUS_ALIVE eternal = false overflowToDisk = false maxElementsInMemory = 1000 maxElementsOnDisk = 0 memoryStoreEvictionPolicy = LRU timeToLiveSeconds = 1800 timeToIdleSeconds = 2700 diskPersistent = false diskExpiryThreadIntervalSeconds = 600 cacheEventListeners:  hitCount = 0 memoryStoreHitCount = 0 diskStoreHitCount = 0 missCountNotFound = 0 missCountExpired = 0 ]
 WARN|main|51506|PlexusContainer                - Component manager not found for returned component. Ignored. component=org.apache.maven.archiva.web.repository.ProxiedDavServer@68fede
There was no such logger 'org.codehaus.plexus.redback.xwork.filter.authentication.HttpAuthenticator:basic' 2457779.
 INFO|main|51615|log                            - jetty-6.1.5
 INFO|main|51616|log                            - Started SocketConnector@0.0.0.0:37375
Remote HTTP Server started on http://localhost:37375/snapshots
 INFO|main|52648|AuditLog                       - internal guest 127.0.0.1 "org/apache/archiva/test/3.0-SNAPSHOT/test-3.0-20070822.033400-42.jar" "Modify File (proxied)"
 INFO|main|52756|Cache:url-failures-cache       - Disposing cache: [ name = url-failures-cache status = STATUS_ALIVE eternal = false overflowToDisk = false maxElementsInMemory = 1000 maxElementsOnDisk = 0 memoryStoreEvictionPolicy = LRU timeToLiveSeconds = 1800 timeToIdleSeconds = 2700 diskPersistent = false diskExpiryThreadIntervalSeconds = 600 cacheEventListeners:  hitCount = 0 memoryStoreHitCount = 0 diskStoreHitCount = 0 missCountNotFound = 0 missCountExpired = 0 ]
There was no such logger 'org.codehaus.plexus.redback.xwork.filter.authentication.HttpAuthenticator:basic' 28449506.
 WARN|main|52756|PlexusContainer                - Component manager not found for returned component. Ignored. component=org.apache.maven.archiva.web.repository.ProxiedDavServer@39410a
 INFO|main|53175|log                            - jetty-6.1.5
 INFO|main|53176|log                            - Started SocketConnector@0.0.0.0:37383
Remote HTTP Server started on http://localhost:37383/snapshots
 INFO|main|54178|AuditLog                       - internal guest 127.0.0.1 "org/apache/archiva/test/3.0-SNAPSHOT/test-3.0-20070822.033400-42.jar" "Modify File (proxied)"
 INFO|main|54286|Cache:url-failures-cache       - Disposing cache: [ name = url-failures-cache status = STATUS_ALIVE eternal = false overflowToDisk = false maxElementsInMemory = 1000 maxElementsOnDisk = 0 memoryStoreEvictionPolicy = LRU timeToLiveSeconds = 1800 timeToIdleSeconds = 2700 diskPersistent = false diskExpiryThreadIntervalSeconds = 600 cacheEventListeners:  hitCount = 0 memoryStoreHitCount = 0 diskStoreHitCount = 0 missCountNotFound = 0 missCountExpired = 0 ]
There was no such logger 'org.codehaus.plexus.redback.xwork.filter.authentication.HttpAuthenticator:basic' 11058755.
 WARN|main|54286|PlexusContainer                - Component manager not found for returned component. Ignored. component=org.apache.maven.archiva.web.repository.ProxiedDavServer@eb9b73
 INFO|main|54417|log                            - jetty-6.1.5
 INFO|main|54418|log                            - Started SocketConnector@0.0.0.0:37388
Remote HTTP Server started on http://localhost:37388/snapshots
 INFO|main|55367|RepositoryProxyConnectors:default - Transfer not attempted on http://localhost:37388/snapshots/org/apache/archiva/test/3.0-SNAPSHOT/test-3.0-20070822.033400-42.jar : NO to update snapshots, policy is ONCE, and local file exist.: using already present local file.
 INFO|main|55368|AuditLog                       - internal guest 127.0.0.1 "org/apache/archiva/test/3.0-SNAPSHOT/test-3.0-20070822.033400-42.jar" "Modify File (proxied)"
 INFO|main|55475|Cache:url-failures-cache       - Disposing cache: [ name = url-failures-cache status = STATUS_ALIVE eternal = false overflowToDisk = false maxElementsInMemory = 1000 maxElementsOnDisk = 0 memoryStoreEvictionPolicy = LRU timeToLiveSeconds = 1800 timeToIdleSeconds = 2700 diskPersistent = false diskExpiryThreadIntervalSeconds = 600 cacheEventListeners:  hitCount = 0 memoryStoreHitCount = 0 diskStoreHitCount = 0 missCountNotFound = 0 missCountExpired = 0 ]
There was no such logger 'org.codehaus.plexus.redback.xwork.filter.authentication.HttpAuthenticator:basic' 6803859.
 WARN|main|55476|PlexusContainer                - Component manager not found for returned component. Ignored. component=org.apache.maven.archiva.web.repository.ProxiedDavServer@559e7f
 INFO|main|55593|log                            - jetty-6.1.5
 INFO|main|55594|log                            - Started SocketConnector@0.0.0.0:37394
Remote HTTP Server started on http://localhost:37394/snapshots
 INFO|main|56638|AuditLog                       - internal guest 127.0.0.1 "org/apache/archiva/test/3.0-SNAPSHOT/test-3.0-20070822.033400-42.jar" "Modify File (proxied)"
 INFO|main|56745|Cache:url-failures-cache       - Disposing cache: [ name = url-failures-cache status = STATUS_ALIVE eternal = false overflowToDisk = false maxElementsInMemory = 1000 maxElementsOnDisk = 0 memoryStoreEvictionPolicy = LRU timeToLiveSeconds = 1800 timeToIdleSeconds = 2700 diskPersistent = false diskExpiryThreadIntervalSeconds = 600 cacheEventListeners:  hitCount = 0 memoryStoreHitCount = 0 diskStoreHitCount = 0 missCountNotFound = 0 missCountExpired = 0 ]
There was no such logger 'org.codehaus.plexus.redback.xwork.filter.authentication.HttpAuthenticator:basic' 28354945.
 WARN|main|56746|PlexusContainer                - Component manager not found for returned component. Ignored. component=org.apache.maven.archiva.web.repository.ProxiedDavServer@1600b34
 INFO|main|56861|log                            - jetty-6.1.5
 INFO|main|56862|log                            - Started SocketConnector@0.0.0.0:37400
Remote HTTP Server started on http://localhost:37400/snapshots
 INFO|main|58246|AuditLog                       - internal guest 127.0.0.1 "org/apache/archiva/test/3.0-SNAPSHOT/test-3.0-20070822.033400-42.jar" "Modify File (proxied)"
 INFO|main|58355|Cache:url-failures-cache       - Disposing cache: [ name = url-failures-cache status = STATUS_ALIVE eternal = false overflowToDisk = false maxElementsInMemory = 1000 maxElementsOnDisk = 0 memoryStoreEvictionPolicy = LRU timeToLiveSeconds = 1800 timeToIdleSeconds = 2700 diskPersistent = false diskExpiryThreadIntervalSeconds = 600 cacheEventListeners:  hitCount = 0 memoryStoreHitCount = 0 diskStoreHitCount = 0 missCountNotFound = 0 missCountExpired = 0 ]
There was no such logger 'org.codehaus.plexus.redback.xwork.filter.authentication.HttpAuthenticator:basic' 6658001.
 WARN|main|58356|PlexusContainer                - Component manager not found for returned component. Ignored. component=org.apache.maven.archiva.web.repository.ProxiedDavServer@1d69fa3
Tests run: 15, Failures: 0, Errors: 0, Skipped: 0, Time elapsed: 19.529 sec
Running org.apache.maven.archiva.web.repository.RepositoryServletProxiedSnapshotPolicyTest
 INFO|main|58478|log                            - jetty-6.1.5
 INFO|main|58479|log                            - Started SocketConnector@0.0.0.0:37406
Remote HTTP Server started on http://localhost:37406/snapshots
 INFO|main|59605|Cache:url-failures-cache       - Disposing cache: [ name = url-failures-cache status = STATUS_ALIVE eternal = false overflowToDisk = false maxElementsInMemory = 1000 maxElementsOnDisk = 0 memoryStoreEvictionPolicy = LRU timeToLiveSeconds = 1800 timeToIdleSeconds = 2700 diskPersistent = false diskExpiryThreadIntervalSeconds = 600 cacheEventListeners:  hitCount = 0 memoryStoreHitCount = 0 diskStoreHitCount = 0 missCountNotFound = 0 missCountExpired = 0 ]
There was no such logger 'org.codehaus.plexus.redback.xwork.filter.authentication.HttpAuthenticator:basic' 24381839.
 WARN|main|59605|PlexusContainer                - Component manager not found for returned component. Ignored. component=org.apache.maven.archiva.web.repository.ProxiedDavServer@15dff59
 INFO|main|59721|log                            - jetty-6.1.5
 INFO|main|59722|log                            - Started SocketConnector@0.0.0.0:37411
Remote HTTP Server started on http://localhost:37411/snapshots
 INFO|main|60756|AuditLog                       - internal guest 127.0.0.1 "org/apache/archiva/test/2.0-SNAPSHOT/test-2.0-SNAPSHOT.jar" "Modify File (proxied)"
 INFO|main|60865|Cache:url-failures-cache       - Disposing cache: [ name = url-failures-cache status = STATUS_ALIVE eternal = false overflowToDisk = false maxElementsInMemory = 1000 maxElementsOnDisk = 0 memoryStoreEvictionPolicy = LRU timeToLiveSeconds = 1800 timeToIdleSeconds = 2700 diskPersistent = false diskExpiryThreadIntervalSeconds = 600 cacheEventListeners:  hitCount = 0 memoryStoreHitCount = 0 diskStoreHitCount = 0 missCountNotFound = 0 missCountExpired = 0 ]
There was no such logger 'org.codehaus.plexus.redback.xwork.filter.authentication.HttpAuthenticator:basic' 9528826.
 WARN|main|60865|PlexusContainer                - Component manager not found for returned component. Ignored. component=org.apache.maven.archiva.web.repository.ProxiedDavServer@e64a7f
 INFO|main|60987|log                            - jetty-6.1.5
 INFO|main|60988|log                            - Started SocketConnector@0.0.0.0:37417
Remote HTTP Server started on http://localhost:37417/snapshots
 INFO|main|61988|AuditLog                       - internal guest 127.0.0.1 "org/apache/archiva/test/2.0-SNAPSHOT/test-2.0-SNAPSHOT.jar" "Modify File (proxied)"
 INFO|main|62095|Cache:url-failures-cache       - Disposing cache: [ name = url-failures-cache status = STATUS_ALIVE eternal = false overflowToDisk = false maxElementsInMemory = 1000 maxElementsOnDisk = 0 memoryStoreEvictionPolicy = LRU timeToLiveSeconds = 1800 timeToIdleSeconds = 2700 diskPersistent = false diskExpiryThreadIntervalSeconds = 600 cacheEventListeners:  hitCount = 0 memoryStoreHitCount = 0 diskStoreHitCount = 0 missCountNotFound = 0 missCountExpired = 0 ]
There was no such logger 'org.codehaus.plexus.redback.xwork.filter.authentication.HttpAuthenticator:basic' 11946014.
 WARN|main|62095|PlexusContainer                - Component manager not found for returned component. Ignored. component=org.apache.maven.archiva.web.repository.ProxiedDavServer@7a40fc
 INFO|main|62531|log                            - jetty-6.1.5
 INFO|main|62531|log                            - Started SocketConnector@0.0.0.0:37423
Remote HTTP Server started on http://localhost:37423/snapshots
 INFO|main|63445|RepositoryProxyConnectors:default - Transfer not attempted on http://localhost:37423/snapshots/org/apache/archiva/test/2.0-SNAPSHOT/test-2.0-SNAPSHOT.jar : NO to update snapshots, policy is DAILY, local file exist, and has been updated within the last day.: using already present local file.
 INFO|main|63446|AuditLog                       - internal guest 127.0.0.1 "org/apache/archiva/test/2.0-SNAPSHOT/test-2.0-SNAPSHOT.jar" "Modify File (proxied)"
 INFO|main|63555|Cache:url-failures-cache       - Disposing cache: [ name = url-failures-cache status = STATUS_ALIVE eternal = false overflowToDisk = false maxElementsInMemory = 1000 maxElementsOnDisk = 0 memoryStoreEvictionPolicy = LRU timeToLiveSeconds = 1800 timeToIdleSeconds = 2700 diskPersistent = false diskExpiryThreadIntervalSeconds = 600 cacheEventListeners:  hitCount = 0 memoryStoreHitCount = 0 diskStoreHitCount = 0 missCountNotFound = 0 missCountExpired = 0 ]
 WARN|main|63555|PlexusContainer                - Component manager not found for returned component. Ignored. component=org.apache.maven.archiva.web.repository.ProxiedDavServer@9bfaff
There was no such logger 'org.codehaus.plexus.redback.xwork.filter.authentication.HttpAuthenticator:basic' 25118608.
 INFO|main|63665|log                            - jetty-6.1.5
 INFO|main|63666|log                            - Started SocketConnector@0.0.0.0:37427
Remote HTTP Server started on http://localhost:37427/snapshots
 INFO|main|64656|AuditLog                       - internal guest 127.0.0.1 "org/apache/archiva/test/2.0-SNAPSHOT/test-2.0-SNAPSHOT.jar" "Modify File (proxied)"
 INFO|main|64764|Cache:url-failures-cache       - Disposing cache: [ name = url-failures-cache status = STATUS_ALIVE eternal = false overflowToDisk = false maxElementsInMemory = 1000 maxElementsOnDisk = 0 memoryStoreEvictionPolicy = LRU timeToLiveSeconds = 1800 timeToIdleSeconds = 2700 diskPersistent = false diskExpiryThreadIntervalSeconds = 600 cacheEventListeners:  hitCount = 0 memoryStoreHitCount = 0 diskStoreHitCount = 0 missCountNotFound = 0 missCountExpired = 0 ]
There was no such logger 'org.codehaus.plexus.redback.xwork.filter.authentication.HttpAuthenticator:basic' 22043457.
 WARN|main|64765|PlexusContainer                - Component manager not found for returned component. Ignored. component=org.apache.maven.archiva.web.repository.ProxiedDavServer@c78689
 INFO|main|64876|log                            - jetty-6.1.5
 INFO|main|64877|log                            - Started SocketConnector@0.0.0.0:37434
Remote HTTP Server started on http://localhost:37434/snapshots
 INFO|main|65876|AuditLog                       - internal guest 127.0.0.1 "org/apache/archiva/test/2.0-SNAPSHOT/test-2.0-SNAPSHOT.jar" "Modify File (proxied)"
 INFO|main|65984|Cache:url-failures-cache       - Disposing cache: [ name = url-failures-cache status = STATUS_ALIVE eternal = false overflowToDisk = false maxElementsInMemory = 1000 maxElementsOnDisk = 0 memoryStoreEvictionPolicy = LRU timeToLiveSeconds = 1800 timeToIdleSeconds = 2700 diskPersistent = false diskExpiryThreadIntervalSeconds = 600 cacheEventListeners:  hitCount = 0 memoryStoreHitCount = 0 diskStoreHitCount = 0 missCountNotFound = 0 missCountExpired = 0 ]
 WARN|main|65985|PlexusContainer                - Component manager not found for returned component. Ignored. component=org.apache.maven.archiva.web.repository.ProxiedDavServer@8f334b
There was no such logger 'org.codehaus.plexus.redback.xwork.filter.authentication.HttpAuthenticator:basic' 20112431.
 INFO|main|66102|log                            - jetty-6.1.5
 INFO|main|66103|log                            - Started SocketConnector@0.0.0.0:37439
Remote HTTP Server started on http://localhost:37439/snapshots
 INFO|main|67021|RepositoryProxyConnectors:default - Transfer not attempted on http://localhost:37439/snapshots/org/apache/archiva/test/2.0-SNAPSHOT/test-2.0-SNAPSHOT.pom : NO to update, snapshots policy set to NEVER.
 INFO|main|67021|RepositoryProxyConnectors:default - Transfer not attempted on http://localhost:37439/snapshots/org/apache/archiva/test/2.0-SNAPSHOT/test-2.0-SNAPSHOT.jar : NO to update, snapshots policy set to NEVER.: using already present local file.
 INFO|main|67022|AuditLog                       - internal guest 127.0.0.1 "org/apache/archiva/test/2.0-SNAPSHOT/test-2.0-SNAPSHOT.jar" "Modify File (proxied)"
 INFO|main|67124|Cache:url-failures-cache       - Disposing cache: [ name = url-failures-cache status = STATUS_ALIVE eternal = false overflowToDisk = false maxElementsInMemory = 1000 maxElementsOnDisk = 0 memoryStoreEvictionPolicy = LRU timeToLiveSeconds = 1800 timeToIdleSeconds = 2700 diskPersistent = false diskExpiryThreadIntervalSeconds = 600 cacheEventListeners:  hitCount = 0 memoryStoreHitCount = 0 diskStoreHitCount = 0 missCountNotFound = 0 missCountExpired = 0 ]
There was no such logger 'org.codehaus.plexus.redback.xwork.filter.authentication.HttpAuthenticator:basic' 14898358.
 WARN|main|67124|PlexusContainer                - Component manager not found for returned component. Ignored. component=org.apache.maven.archiva.web.repository.ProxiedDavServer@128a245
 INFO|main|67602|log                            - jetty-6.1.5
 INFO|main|67603|log                            - Started SocketConnector@0.0.0.0:37443
Remote HTTP Server started on http://localhost:37443/snapshots
 INFO|main|68603|RepositoryProxyConnectors:default - Transfer not attempted on http://localhost:37443/snapshots/org/apache/archiva/test/2.0-SNAPSHOT/test-2.0-SNAPSHOT.pom : NO to update, snapshots policy set to NEVER.
 INFO|main|68604|RepositoryProxyConnectors:default - Transfer not attempted on http://localhost:37443/snapshots/org/apache/archiva/test/2.0-SNAPSHOT/test-2.0-SNAPSHOT.jar : NO to update, snapshots policy set to NEVER.
 INFO|main|68714|Cache:url-failures-cache       - Disposing cache: [ name = url-failures-cache status = STATUS_ALIVE eternal = false overflowToDisk = false maxElementsInMemory = 1000 maxElementsOnDisk = 0 memoryStoreEvictionPolicy = LRU timeToLiveSeconds = 1800 timeToIdleSeconds = 2700 diskPersistent = false diskExpiryThreadIntervalSeconds = 600 cacheEventListeners:  hitCount = 0 memoryStoreHitCount = 0 diskStoreHitCount = 0 missCountNotFound = 0 missCountExpired = 0 ]
There was no such logger 'org.codehaus.plexus.redback.xwork.filter.authentication.HttpAuthenticator:basic' 27228817.
 WARN|main|68714|PlexusContainer                - Component manager not found for returned component. Ignored. component=org.apache.maven.archiva.web.repository.ProxiedDavServer@f56cd4
 INFO|main|68830|log                            - jetty-6.1.5
 INFO|main|68830|log                            - Started SocketConnector@0.0.0.0:37449
Remote HTTP Server started on http://localhost:37449/snapshots
 INFO|main|69816|RepositoryProxyConnectors:default - Transfer not attempted on http://localhost:37449/snapshots/org/apache/archiva/test/2.0-SNAPSHOT/test-2.0-SNAPSHOT.pom : NO to update, snapshots policy set to NEVER.
 INFO|main|69816|RepositoryProxyConnectors:default - Transfer not attempted on http://localhost:37449/snapshots/org/apache/archiva/test/2.0-SNAPSHOT/test-2.0-SNAPSHOT.jar : NO to update, snapshots policy set to NEVER.: using already present local file.
 INFO|main|69816|AuditLog                       - internal guest 127.0.0.1 "org/apache/archiva/test/2.0-SNAPSHOT/test-2.0-SNAPSHOT.jar" "Modify File (proxied)"
 INFO|main|69924|Cache:url-failures-cache       - Disposing cache: [ name = url-failures-cache status = STATUS_ALIVE eternal = false overflowToDisk = false maxElementsInMemory = 1000 maxElementsOnDisk = 0 memoryStoreEvictionPolicy = LRU timeToLiveSeconds = 1800 timeToIdleSeconds = 2700 diskPersistent = false diskExpiryThreadIntervalSeconds = 600 cacheEventListeners:  hitCount = 0 memoryStoreHitCount = 0 diskStoreHitCount = 0 missCountNotFound = 0 missCountExpired = 0 ]
 WARN|main|69924|PlexusContainer                - Component manager not found for returned component. Ignored. component=org.apache.maven.archiva.web.repository.ProxiedDavServer@e1fbe3
There was no such logger 'org.codehaus.plexus.redback.xwork.filter.authentication.HttpAuthenticator:basic' 22676246.
 INFO|main|70038|log                            - jetty-6.1.5
 INFO|main|70039|log                            - Started SocketConnector@0.0.0.0:37452
Remote HTTP Server started on http://localhost:37452/snapshots
 INFO|main|71010|RepositoryProxyConnectors:default - Transfer not attempted on http://localhost:37452/snapshots/org/apache/archiva/test/2.0-SNAPSHOT/test-2.0-SNAPSHOT.jar : NO to update snapshots, policy is HOURLY, local file exist, and has been updated within the last hour.: using already present local file.
 INFO|main|71010|AuditLog                       - internal guest 127.0.0.1 "org/apache/archiva/test/2.0-SNAPSHOT/test-2.0-SNAPSHOT.jar" "Modify File (proxied)"
 INFO|main|71114|Cache:url-failures-cache       - Disposing cache: [ name = url-failures-cache status = STATUS_ALIVE eternal = false overflowToDisk = false maxElementsInMemory = 1000 maxElementsOnDisk = 0 memoryStoreEvictionPolicy = LRU timeToLiveSeconds = 1800 timeToIdleSeconds = 2700 diskPersistent = false diskExpiryThreadIntervalSeconds = 600 cacheEventListeners:  hitCount = 0 memoryStoreHitCount = 0 diskStoreHitCount = 0 missCountNotFound = 0 missCountExpired = 0 ]
There was no such logger 'org.codehaus.plexus.redback.xwork.filter.authentication.HttpAuthenticator:basic' 30669061.
 WARN|main|71114|PlexusContainer                - Component manager not found for returned component. Ignored. component=org.apache.maven.archiva.web.repository.ProxiedDavServer@15b4f9c
 INFO|main|71222|log                            - jetty-6.1.5
 INFO|main|71223|log                            - Started SocketConnector@0.0.0.0:37457
Remote HTTP Server started on http://localhost:37457/snapshots
 INFO|main|72585|AuditLog                       - internal guest 127.0.0.1 "org/apache/archiva/test/2.0-SNAPSHOT/test-2.0-SNAPSHOT.jar" "Modify File (proxied)"
 INFO|main|72693|Cache:url-failures-cache       - Disposing cache: [ name = url-failures-cache status = STATUS_ALIVE eternal = false overflowToDisk = false maxElementsInMemory = 1000 maxElementsOnDisk = 0 memoryStoreEvictionPolicy = LRU timeToLiveSeconds = 1800 timeToIdleSeconds = 2700 diskPersistent = false diskExpiryThreadIntervalSeconds = 600 cacheEventListeners:  hitCount = 0 memoryStoreHitCount = 0 diskStoreHitCount = 0 missCountNotFound = 0 missCountExpired = 0 ]
There was no such logger 'org.codehaus.plexus.redback.xwork.filter.authentication.HttpAuthenticator:basic' 4392946.
 WARN|main|72694|PlexusContainer                - Component manager not found for returned component. Ignored. component=org.apache.maven.archiva.web.repository.ProxiedDavServer@ee271d
 INFO|main|72815|log                            - jetty-6.1.5
 INFO|main|72816|log                            - Started SocketConnector@0.0.0.0:37463
Remote HTTP Server started on http://localhost:37463/snapshots
 INFO|main|73815|AuditLog                       - internal guest 127.0.0.1 "org/apache/archiva/test/2.0-SNAPSHOT/test-2.0-SNAPSHOT.jar" "Modify File (proxied)"
 INFO|main|73923|Cache:url-failures-cache       - Disposing cache: [ name = url-failures-cache status = STATUS_ALIVE eternal = false overflowToDisk = false maxElementsInMemory = 1000 maxElementsOnDisk = 0 memoryStoreEvictionPolicy = LRU timeToLiveSeconds = 1800 timeToIdleSeconds = 2700 diskPersistent = false diskExpiryThreadIntervalSeconds = 600 cacheEventListeners:  hitCount = 0 memoryStoreHitCount = 0 diskStoreHitCount = 0 missCountNotFound = 0 missCountExpired = 0 ]
There was no such logger 'org.codehaus.plexus.redback.xwork.filter.authentication.HttpAuthenticator:basic' 5635395.
 WARN|main|73924|PlexusContainer                - Component manager not found for returned component. Ignored. component=org.apache.maven.archiva.web.repository.ProxiedDavServer@15ccf46
 INFO|main|74048|log                            - jetty-6.1.5
 INFO|main|74049|log                            - Started SocketConnector@0.0.0.0:37469
Remote HTTP Server started on http://localhost:37469/snapshots
 INFO|main|74985|RepositoryProxyConnectors:default - Transfer not attempted on http://localhost:37469/snapshots/org/apache/archiva/test/2.0-SNAPSHOT/test-2.0-SNAPSHOT.jar : NO to update snapshots, policy is ONCE, and local file exist.: using already present local file.
 INFO|main|74985|AuditLog                       - internal guest 127.0.0.1 "org/apache/archiva/test/2.0-SNAPSHOT/test-2.0-SNAPSHOT.jar" "Modify File (proxied)"
 INFO|main|75093|Cache:url-failures-cache       - Disposing cache: [ name = url-failures-cache status = STATUS_ALIVE eternal = false overflowToDisk = false maxElementsInMemory = 1000 maxElementsOnDisk = 0 memoryStoreEvictionPolicy = LRU timeToLiveSeconds = 1800 timeToIdleSeconds = 2700 diskPersistent = false diskExpiryThreadIntervalSeconds = 600 cacheEventListeners:  hitCount = 0 memoryStoreHitCount = 0 diskStoreHitCount = 0 missCountNotFound = 0 missCountExpired = 0 ]
There was no such logger 'org.codehaus.plexus.redback.xwork.filter.authentication.HttpAuthenticator:basic' 9667616.
 WARN|main|75093|PlexusContainer                - Component manager not found for returned component. Ignored. component=org.apache.maven.archiva.web.repository.ProxiedDavServer@1cc6cb4
 INFO|main|75199|log                            - jetty-6.1.5
 INFO|main|75200|log                            - Started SocketConnector@0.0.0.0:37474
Remote HTTP Server started on http://localhost:37474/snapshots
 INFO|main|76164|AuditLog                       - internal guest 127.0.0.1 "org/apache/archiva/test/2.0-SNAPSHOT/test-2.0-SNAPSHOT.jar" "Modify File (proxied)"
 INFO|main|76273|Cache:url-failures-cache       - Disposing cache: [ name = url-failures-cache status = STATUS_ALIVE eternal = false overflowToDisk = false maxElementsInMemory = 1000 maxElementsOnDisk = 0 memoryStoreEvictionPolicy = LRU timeToLiveSeconds = 1800 timeToIdleSeconds = 2700 diskPersistent = false diskExpiryThreadIntervalSeconds = 600 cacheEventListeners:  hitCount = 0 memoryStoreHitCount = 0 diskStoreHitCount = 0 missCountNotFound = 0 missCountExpired = 0 ]
 WARN|main|76273|PlexusContainer                - Component manager not found for returned component. Ignored. component=org.apache.maven.archiva.web.repository.ProxiedDavServer@67564
There was no such logger 'org.codehaus.plexus.redback.xwork.filter.authentication.HttpAuthenticator:basic' 2140202.
 INFO|main|76748|log                            - jetty-6.1.5
 INFO|main|76749|log                            - Started SocketConnector@0.0.0.0:37478
Remote HTTP Server started on http://localhost:37478/snapshots
 INFO|main|77784|AuditLog                       - internal guest 127.0.0.1 "org/apache/archiva/test/2.0-SNAPSHOT/test-2.0-SNAPSHOT.jar" "Modify File (proxied)"
 INFO|main|77893|Cache:url-failures-cache       - Disposing cache: [ name = url-failures-cache status = STATUS_ALIVE eternal = false overflowToDisk = false maxElementsInMemory = 1000 maxElementsOnDisk = 0 memoryStoreEvictionPolicy = LRU timeToLiveSeconds = 1800 timeToIdleSeconds = 2700 diskPersistent = false diskExpiryThreadIntervalSeconds = 600 cacheEventListeners:  hitCount = 0 memoryStoreHitCount = 0 diskStoreHitCount = 0 missCountNotFound = 0 missCountExpired = 0 ]
 WARN|main|77893|PlexusContainer                - Component manager not found for returned component. Ignored. component=org.apache.maven.archiva.web.repository.ProxiedDavServer@16c72cc
There was no such logger 'org.codehaus.plexus.redback.xwork.filter.authentication.HttpAuthenticator:basic' 17502052.
Tests run: 15, Failures: 0, Errors: 0, Skipped: 0, Time elapsed: 19.535 sec
Running org.apache.maven.archiva.web.repository.RepositoryServletBrowseTest
 INFO|main|78045|Cache:url-failures-cache       - Disposing cache: [ name = url-failures-cache status = STATUS_ALIVE eternal = false overflowToDisk = false maxElementsInMemory = 1000 maxElementsOnDisk = 0 memoryStoreEvictionPolicy = LRU timeToLiveSeconds = 1800 timeToIdleSeconds = 2700 diskPersistent = false diskExpiryThreadIntervalSeconds = 600 cacheEventListeners:  hitCount = 0 memoryStoreHitCount = 0 diskStoreHitCount = 0 missCountNotFound = 0 missCountExpired = 0 ]
There was no such logger 'org.codehaus.plexus.redback.xwork.filter.authentication.HttpAuthenticator:basic' 18372147.
 WARN|main|78045|PlexusContainer                - Component manager not found for returned component. Ignored. component=org.apache.maven.archiva.web.repository.ProxiedDavServer@44eabe
Tests run: 1, Failures: 0, Errors: 0, Skipped: 0, Time elapsed: 0.149 sec
Running org.apache.maven.archiva.web.repository.RepositoryServletProxiedMetadataLocalOnlyTest
 INFO|main|78169|log                            - jetty-6.1.5
 INFO|main|78170|log                            - Started SocketConnector@0.0.0.0:37484
Remote HTTP Server started on http://localhost:37484/snapshots
 INFO|main|79107|log                            - jetty-6.1.5
 INFO|main|79108|log                            - Started SocketConnector@0.0.0.0:37487
Remote HTTP Server started on http://localhost:37487/private-snapshots
 INFO|main|80035|AuditLog                       - internal guest 127.0.0.1 "/org/apache/archiva/archivatest-maven-plugin/4.0-alpha-1-SNAPSHOT/maven-metadata.xml" "Modify File (proxied)"
 INFO|main|80253|Cache:url-failures-cache       - Disposing cache: [ name = url-failures-cache status = STATUS_ALIVE eternal = false overflowToDisk = false maxElementsInMemory = 1000 maxElementsOnDisk = 0 memoryStoreEvictionPolicy = LRU timeToLiveSeconds = 1800 timeToIdleSeconds = 2700 diskPersistent = false diskExpiryThreadIntervalSeconds = 600 cacheEventListeners:  hitCount = 0 memoryStoreHitCount = 0 diskStoreHitCount = 0 missCountNotFound = 0 missCountExpired = 0 ]
There was no such logger 'org.codehaus.plexus.redback.xwork.filter.authentication.HttpAuthenticator:basic' 6622182.
 WARN|main|80253|PlexusContainer                - Component manager not found for returned component. Ignored. component=org.apache.maven.archiva.web.repository.ProxiedDavServer@98c0fe
 INFO|main|80378|log                            - jetty-6.1.5
 INFO|main|80379|log                            - Started SocketConnector@0.0.0.0:37493
Remote HTTP Server started on http://localhost:37493/snapshots
 INFO|main|81267|log                            - jetty-6.1.5
 INFO|main|81268|log                            - Started SocketConnector@0.0.0.0:37496
Remote HTTP Server started on http://localhost:37496/private-snapshots
 INFO|main|82149|AuditLog                       - internal guest 127.0.0.1 "/org/apache/archiva/archivatest-maven-plugin/4.0-alpha-2/maven-metadata.xml" "Modify File (proxied)"
 INFO|main|82372|Cache:url-failures-cache       - Disposing cache: [ name = url-failures-cache status = STATUS_ALIVE eternal = false overflowToDisk = false maxElementsInMemory = 1000 maxElementsOnDisk = 0 memoryStoreEvictionPolicy = LRU timeToLiveSeconds = 1800 timeToIdleSeconds = 2700 diskPersistent = false diskExpiryThreadIntervalSeconds = 600 cacheEventListeners:  hitCount = 0 memoryStoreHitCount = 0 diskStoreHitCount = 0 missCountNotFound = 0 missCountExpired = 0 ]
There was no such logger 'org.codehaus.plexus.redback.xwork.filter.authentication.HttpAuthenticator:basic' 33439467.
 WARN|main|82373|PlexusContainer                - Component manager not found for returned component. Ignored. component=org.apache.maven.archiva.web.repository.ProxiedDavServer@14131a8
 INFO|main|82851|log                            - jetty-6.1.5
 INFO|main|82853|log                            - Started SocketConnector@0.0.0.0:37499
Remote HTTP Server started on http://localhost:37499/snapshots
 INFO|main|83757|log                            - jetty-6.1.5
 INFO|main|83758|log                            - Started SocketConnector@0.0.0.0:37501
Remote HTTP Server started on http://localhost:37501/private-snapshots
 INFO|main|84688|AuditLog                       - internal guest 127.0.0.1 "/org/apache/archiva/archivatest-maven-plugin/maven-metadata.xml" "Modify File (proxied)"
 INFO|main|84912|Cache:url-failures-cache       - Disposing cache: [ name = url-failures-cache status = STATUS_ALIVE eternal = false overflowToDisk = false maxElementsInMemory = 1000 maxElementsOnDisk = 0 memoryStoreEvictionPolicy = LRU timeToLiveSeconds = 1800 timeToIdleSeconds = 2700 diskPersistent = false diskExpiryThreadIntervalSeconds = 600 cacheEventListeners:  hitCount = 0 memoryStoreHitCount = 0 diskStoreHitCount = 0 missCountNotFound = 0 missCountExpired = 0 ]
There was no such logger 'org.codehaus.plexus.redback.xwork.filter.authentication.HttpAuthenticator:basic' 13267334.
 WARN|main|84912|PlexusContainer                - Component manager not found for returned component. Ignored. component=org.apache.maven.archiva.web.repository.ProxiedDavServer@6bd4a9
Tests run: 3, Failures: 0, Errors: 0, Skipped: 0, Time elapsed: 6.864 sec
Running org.apache.maven.archiva.web.repository.RepositoryServletNoProxyTest
 INFO|main|85038|Cache:url-failures-cache       - Disposing cache: [ name = url-failures-cache status = STATUS_ALIVE eternal = false overflowToDisk = false maxElementsInMemory = 1000 maxElementsOnDisk = 0 memoryStoreEvictionPolicy = LRU timeToLiveSeconds = 1800 timeToIdleSeconds = 2700 diskPersistent = false diskExpiryThreadIntervalSeconds = 600 cacheEventListeners:  hitCount = 0 memoryStoreHitCount = 0 diskStoreHitCount = 0 missCountNotFound = 0 missCountExpired = 0 ]
There was no such logger 'org.codehaus.plexus.redback.xwork.filter.authentication.HttpAuthenticator:basic' 32833247.
 WARN|main|85038|PlexusContainer                - Component manager not found for returned component. Ignored. component=org.apache.maven.archiva.web.repository.ProxiedDavServer@18612e4
 INFO|main|85158|Cache:url-failures-cache       - Disposing cache: [ name = url-failures-cache status = STATUS_ALIVE eternal = false overflowToDisk = false maxElementsInMemory = 1000 maxElementsOnDisk = 0 memoryStoreEvictionPolicy = LRU timeToLiveSeconds = 1800 timeToIdleSeconds = 2700 diskPersistent = false diskExpiryThreadIntervalSeconds = 600 cacheEventListeners:  hitCount = 0 memoryStoreHitCount = 0 diskStoreHitCount = 0 missCountNotFound = 0 missCountExpired = 0 ]
 WARN|main|85158|PlexusContainer                - Component manager not found for returned component. Ignored. component=org.apache.maven.archiva.web.repository.ProxiedDavServer@1520a06
There was no such logger 'org.codehaus.plexus.redback.xwork.filter.authentication.HttpAuthenticator:basic' 21720560.
 INFO|main|85278|AuditLog                       - internal guest 127.0.0.1 "/commons-lang/commons-lang/2.1/maven-metadata.xml" "Modify File (proxied)"
 INFO|main|85280|Cache:url-failures-cache       - Disposing cache: [ name = url-failures-cache status = STATUS_ALIVE eternal = false overflowToDisk = false maxElementsInMemory = 1000 maxElementsOnDisk = 0 memoryStoreEvictionPolicy = LRU timeToLiveSeconds = 1800 timeToIdleSeconds = 2700 diskPersistent = false diskExpiryThreadIntervalSeconds = 600 cacheEventListeners:  hitCount = 0 memoryStoreHitCount = 0 diskStoreHitCount = 0 missCountNotFound = 0 missCountExpired = 0 ]
There was no such logger 'org.codehaus.plexus.redback.xwork.filter.authentication.HttpAuthenticator:basic' 6027060.
 WARN|main|85280|PlexusContainer                - Component manager not found for returned component. Ignored. component=org.apache.maven.archiva.web.repository.ProxiedDavServer@11fa9dd
 INFO|main|85438|AuditLog                       - internal guest 127.0.0.1 "/commons-lang/commons-lang/maven-metadata.xml" "Modify File (proxied)"
 INFO|main|85439|Cache:url-failures-cache       - Disposing cache: [ name = url-failures-cache status = STATUS_ALIVE eternal = false overflowToDisk = false maxElementsInMemory = 1000 maxElementsOnDisk = 0 memoryStoreEvictionPolicy = LRU timeToLiveSeconds = 1800 timeToIdleSeconds = 2700 diskPersistent = false diskExpiryThreadIntervalSeconds = 600 cacheEventListeners:  hitCount = 0 memoryStoreHitCount = 0 diskStoreHitCount = 0 missCountNotFound = 0 missCountExpired = 0 ]
There was no such logger 'org.codehaus.plexus.redback.xwork.filter.authentication.HttpAuthenticator:basic' 11953664.
 WARN|main|85440|PlexusContainer                - Component manager not found for returned component. Ignored. component=org.apache.maven.archiva.web.repository.ProxiedDavServer@39c5c6
 INFO|main|85556|Cache:url-failures-cache       - Disposing cache: [ name = url-failures-cache status = STATUS_ALIVE eternal = false overflowToDisk = false maxElementsInMemory = 1000 maxElementsOnDisk = 0 memoryStoreEvictionPolicy = LRU timeToLiveSeconds = 1800 timeToIdleSeconds = 2700 diskPersistent = false diskExpiryThreadIntervalSeconds = 600 cacheEventListeners:  hitCount = 0 memoryStoreHitCount = 0 diskStoreHitCount = 0 missCountNotFound = 0 missCountExpired = 0 ]
There was no such logger 'org.codehaus.plexus.redback.xwork.filter.authentication.HttpAuthenticator:basic' 14592558.
 WARN|main|85557|PlexusContainer                - Component manager not found for returned component. Ignored. component=org.apache.maven.archiva.web.repository.ProxiedDavServer@1aaf3cb
 INFO|main|85690|Cache:url-failures-cache       - Disposing cache: [ name = url-failures-cache status = STATUS_ALIVE eternal = false overflowToDisk = false maxElementsInMemory = 1000 maxElementsOnDisk = 0 memoryStoreEvictionPolicy = LRU timeToLiveSeconds = 1800 timeToIdleSeconds = 2700 diskPersistent = false diskExpiryThreadIntervalSeconds = 600 cacheEventListeners:  hitCount = 0 memoryStoreHitCount = 0 diskStoreHitCount = 0 missCountNotFound = 0 missCountExpired = 0 ]
There was no such logger 'org.codehaus.plexus.redback.xwork.filter.authentication.HttpAuthenticator:basic' 4930683.
 WARN|main|85691|PlexusContainer                - Component manager not found for returned component. Ignored. component=org.apache.maven.archiva.web.repository.ProxiedDavServer@84a6c0
 INFO|main|85808|Cache:url-failures-cache       - Disposing cache: [ name = url-failures-cache status = STATUS_ALIVE eternal = false overflowToDisk = false maxElementsInMemory = 1000 maxElementsOnDisk = 0 memoryStoreEvictionPolicy = LRU timeToLiveSeconds = 1800 timeToIdleSeconds = 2700 diskPersistent = false diskExpiryThreadIntervalSeconds = 600 cacheEventListeners:  hitCount = 0 memoryStoreHitCount = 0 diskStoreHitCount = 0 missCountNotFound = 0 missCountExpired = 0 ]
 WARN|main|85808|PlexusContainer                - Component manager not found for returned component. Ignored. component=org.apache.maven.archiva.web.repository.ProxiedDavServer@2453bb
There was no such logger 'org.codehaus.plexus.redback.xwork.filter.authentication.HttpAuthenticator:basic' 24727649.
 INFO|main|85933|Cache:url-failures-cache       - Disposing cache: [ name = url-failures-cache status = STATUS_ALIVE eternal = false overflowToDisk = false maxElementsInMemory = 1000 maxElementsOnDisk = 0 memoryStoreEvictionPolicy = LRU timeToLiveSeconds = 1800 timeToIdleSeconds = 2700 diskPersistent = false diskExpiryThreadIntervalSeconds = 600 cacheEventListeners:  hitCount = 0 memoryStoreHitCount = 0 diskStoreHitCount = 0 missCountNotFound = 0 missCountExpired = 0 ]
There was no such logger 'org.codehaus.plexus.redback.xwork.filter.authentication.HttpAuthenticator:basic' 7314530.
 WARN|main|85934|PlexusContainer                - Component manager not found for returned component. Ignored. component=org.apache.maven.archiva.web.repository.ProxiedDavServer@19c1dc4
 INFO|main|86419|Cache:url-failures-cache       - Disposing cache: [ name = url-failures-cache status = STATUS_ALIVE eternal = false overflowToDisk = false maxElementsInMemory = 1000 maxElementsOnDisk = 0 memoryStoreEvictionPolicy = LRU timeToLiveSeconds = 1800 timeToIdleSeconds = 2700 diskPersistent = false diskExpiryThreadIntervalSeconds = 600 cacheEventListeners:  hitCount = 0 memoryStoreHitCount = 0 diskStoreHitCount = 0 missCountNotFound = 0 missCountExpired = 0 ]
There was no such logger 'org.codehaus.plexus.redback.xwork.filter.authentication.HttpAuthenticator:basic' 19497251.
 WARN|main|86419|PlexusContainer                - Component manager not found for returned component. Ignored. component=org.apache.maven.archiva.web.repository.ProxiedDavServer@191c88c
 INFO|main|86544|Cache:url-failures-cache       - Disposing cache: [ name = url-failures-cache status = STATUS_ALIVE eternal = false overflowToDisk = false maxElementsInMemory = 1000 maxElementsOnDisk = 0 memoryStoreEvictionPolicy = LRU timeToLiveSeconds = 1800 timeToIdleSeconds = 2700 diskPersistent = false diskExpiryThreadIntervalSeconds = 600 cacheEventListeners:  hitCount = 0 memoryStoreHitCount = 0 diskStoreHitCount = 0 missCountNotFound = 0 missCountExpired = 0 ]
There was no such logger 'org.codehaus.plexus.redback.xwork.filter.authentication.HttpAuthenticator:basic' 18265388.
 WARN|main|86545|PlexusContainer                - Component manager not found for returned component. Ignored. component=org.apache.maven.archiva.web.repository.ProxiedDavServer@b8476a
 INFO|main|86676|Cache:url-failures-cache       - Disposing cache: [ name = url-failures-cache status = STATUS_ALIVE eternal = false overflowToDisk = false maxElementsInMemory = 1000 maxElementsOnDisk = 0 memoryStoreEvictionPolicy = LRU timeToLiveSeconds = 1800 timeToIdleSeconds = 2700 diskPersistent = false diskExpiryThreadIntervalSeconds = 600 cacheEventListeners:  hitCount = 0 memoryStoreHitCount = 0 diskStoreHitCount = 0 missCountNotFound = 0 missCountExpired = 0 ]
There was no such logger 'org.codehaus.plexus.redback.xwork.filter.authentication.HttpAuthenticator:basic' 31651732.
 WARN|main|86676|PlexusContainer                - Component manager not found for returned component. Ignored. component=org.apache.maven.archiva.web.repository.ProxiedDavServer@144576d
Tests run: 11, Failures: 0, Errors: 0, Skipped: 0, Time elapsed: 1.761 sec
Running org.apache.maven.archiva.web.repository.RepositoryServletProxiedRelocatedTest
 INFO|main|86813|log                            - jetty-6.1.5
 INFO|main|86814|log                            - Started SocketConnector@0.0.0.0:37505
Remote HTTP Server started on http://localhost:37505/central
There was no such logger 'org.apache.maven.archiva.configuration.ArchivaConfiguration:default' 26440262.
 INFO|main|86922|Cache:url-failures-cache       - Disposing cache: [ name = url-failures-cache status = STATUS_ALIVE eternal = false overflowToDisk = false maxElementsInMemory = 1000 maxElementsOnDisk = 0 memoryStoreEvictionPolicy = LRU timeToLiveSeconds = 1800 timeToIdleSeconds = 2700 diskPersistent = false diskExpiryThreadIntervalSeconds = 600 cacheEventListeners:  hitCount = 0 memoryStoreHitCount = 0 diskStoreHitCount = 0 missCountNotFound = 0 missCountExpired = 0 ]
Tests run: 1, Failures: 0, Errors: 1, Skipped: 0, Time elapsed: 0.249 sec <<< FAILURE!
Running org.apache.maven.archiva.web.action.admin.connectors.proxy.ProxyConnectorsActionTest
[INFO] Disposing cache: [ name = url-failures-cache status = STATUS_ALIVE eternal = false overflowToDisk = false maxElementsInMemory = 1000 maxElementsOnDisk = 0 memoryStoreEvictionPolicy = LRU timeToLiveSeconds = 1800 timeToIdleSeconds = 2700 diskPersistent = true diskExpiryThreadIntervalSeconds = 600 cacheEventListeners:  hitCount = 0 memoryStoreHitCount = 0 diskStoreHitCount = 0 missCountNotFound = 0 missCountExpired = 0 ]
[INFO] Disposing cache: [ name = url-failures-cache status = STATUS_ALIVE eternal = false overflowToDisk = false maxElementsInMemory = 1000 maxElementsOnDisk = 0 memoryStoreEvictionPolicy = LRU timeToLiveSeconds = 1800 timeToIdleSeconds = 2700 diskPersistent = true diskExpiryThreadIntervalSeconds = 600 cacheEventListeners:  hitCount = 0 memoryStoreHitCount = 0 diskStoreHitCount = 0 missCountNotFound = 0 missCountExpired = 0 ]
Tests run: 2, Failures: 0, Errors: 0, Skipped: 0, Time elapsed: 0.537 sec
Running org.apache.maven.archiva.web.action.admin.repositories.EditRemoteRepositoryActionTest
[INFO] Disposing cache: [ name = url-failures-cache status = STATUS_ALIVE eternal = false overflowToDisk = false maxElementsInMemory = 1000 maxElementsOnDisk = 0 memoryStoreEvictionPolicy = LRU timeToLiveSeconds = 1800 timeToIdleSeconds = 2700 diskPersistent = true diskExpiryThreadIntervalSeconds = 600 cacheEventListeners:  hitCount = 0 memoryStoreHitCount = 0 diskStoreHitCount = 0 missCountNotFound = 0 missCountExpired = 0 ]
[INFO] Disposing cache: [ name = url-failures-cache status = STATUS_ALIVE eternal = false overflowToDisk = false maxElementsInMemory = 1000 maxElementsOnDisk = 0 memoryStoreEvictionPolicy = LRU timeToLiveSeconds = 1800 timeToIdleSeconds = 2700 diskPersistent = true diskExpiryThreadIntervalSeconds = 600 cacheEventListeners:  hitCount = 0 memoryStoreHitCount = 0 diskStoreHitCount = 0 missCountNotFound = 0 missCountExpired = 0 ]
[INFO] Disposing cache: [ name = url-failures-cache status = STATUS_ALIVE eternal = false overflowToDisk = false maxElementsInMemory = 1000 maxElementsOnDisk = 0 memoryStoreEvictionPolicy = LRU timeToLiveSeconds = 1800 timeToIdleSeconds = 2700 diskPersistent = true diskExpiryThreadIntervalSeconds = 600 cacheEventListeners:  hitCount = 0 memoryStoreHitCount = 0 diskStoreHitCount = 0 missCountNotFound = 0 missCountExpired = 0 ]
Tests run: 3, Failures: 0, Errors: 0, Skipped: 0, Time elapsed: 0.203 sec
Running org.apache.maven.archiva.web.action.admin.connectors.proxy.SortProxyConnectorsActionTest
[INFO] Disposing cache: [ name = url-failures-cache status = STATUS_ALIVE eternal = false overflowToDisk = false maxElementsInMemory = 1000 maxElementsOnDisk = 0 memoryStoreEvictionPolicy = LRU timeToLiveSeconds = 1800 timeToIdleSeconds = 2700 diskPersistent = true diskExpiryThreadIntervalSeconds = 600 cacheEventListeners:  hitCount = 0 memoryStoreHitCount = 0 diskStoreHitCount = 0 missCountNotFound = 0 missCountExpired = 0 ]
[INFO] Disposing cache: [ name = url-failures-cache status = STATUS_ALIVE eternal = false overflowToDisk = false maxElementsInMemory = 1000 maxElementsOnDisk = 0 memoryStoreEvictionPolicy = LRU timeToLiveSeconds = 1800 timeToIdleSeconds = 2700 diskPersistent = true diskExpiryThreadIntervalSeconds = 600 cacheEventListeners:  hitCount = 0 memoryStoreHitCount = 0 diskStoreHitCount = 0 missCountNotFound = 0 missCountExpired = 0 ]
[INFO] Disposing cache: [ name = url-failures-cache status = STATUS_ALIVE eternal = false overflowToDisk = false maxElementsInMemory = 1000 maxElementsOnDisk = 0 memoryStoreEvictionPolicy = LRU timeToLiveSeconds = 1800 timeToIdleSeconds = 2700 diskPersistent = true diskExpiryThreadIntervalSeconds = 600 cacheEventListeners:  hitCount = 0 memoryStoreHitCount = 0 diskStoreHitCount = 0 missCountNotFound = 0 missCountExpired = 0 ]
[INFO] Disposing cache: [ name = url-failures-cache status = STATUS_ALIVE eternal = false overflowToDisk = false maxElementsInMemory = 1000 maxElementsOnDisk = 0 memoryStoreEvictionPolicy = LRU timeToLiveSeconds = 1800 timeToIdleSeconds = 2700 diskPersistent = true diskExpiryThreadIntervalSeconds = 600 cacheEventListeners:  hitCount = 0 memoryStoreHitCount = 0 diskStoreHitCount = 0 missCountNotFound = 0 missCountExpired = 0 ]
[INFO] Disposing cache: [ name = url-failures-cache status = STATUS_ALIVE eternal = false overflowToDisk = false maxElementsInMemory = 1000 maxElementsOnDisk = 0 memoryStoreEvictionPolicy = LRU timeToLiveSeconds = 1800 timeToIdleSeconds = 2700 diskPersistent = true diskExpiryThreadIntervalSeconds = 600 cacheEventListeners:  hitCount = 0 memoryStoreHitCount = 0 diskStoreHitCount = 0 missCountNotFound = 0 missCountExpired = 0 ]
Tests run: 5, Failures: 0, Errors: 0, Skipped: 0, Time elapsed: 0.613 sec
Running org.apache.maven.archiva.web.repository.RepositoryServletTest
 INFO|main|88447|Cache:url-failures-cache       - Disposing cache: [ name = url-failures-cache status = STATUS_ALIVE eternal = false overflowToDisk = false maxElementsInMemory = 1000 maxElementsOnDisk = 0 memoryStoreEvictionPolicy = LRU timeToLiveSeconds = 1800 timeToIdleSeconds = 2700 diskPersistent = false diskExpiryThreadIntervalSeconds = 600 cacheEventListeners:  hitCount = 0 memoryStoreHitCount = 0 diskStoreHitCount = 0 missCountNotFound = 0 missCountExpired = 0 ]
There was no such logger 'org.codehaus.plexus.redback.xwork.filter.authentication.HttpAuthenticator:basic' 1655417.
 WARN|main|88447|PlexusContainer                - Component manager not found for returned component. Ignored. component=org.apache.maven.archiva.web.repository.ProxiedDavServer@1015293
 INFO|main|88580|Cache:url-failures-cache       - Disposing cache: [ name = url-failures-cache status = STATUS_ALIVE eternal = false overflowToDisk = false maxElementsInMemory = 1000 maxElementsOnDisk = 0 memoryStoreEvictionPolicy = LRU timeToLiveSeconds = 1800 timeToIdleSeconds = 2700 diskPersistent = false diskExpiryThreadIntervalSeconds = 600 cacheEventListeners:  hitCount = 0 memoryStoreHitCount = 0 diskStoreHitCount = 0 missCountNotFound = 0 missCountExpired = 0 ]
There was no such logger 'org.codehaus.plexus.redback.xwork.filter.authentication.HttpAuthenticator:basic' 5624303.
 INFO|main|88716|Cache:url-failures-cache       - Disposing cache: [ name = url-failures-cache status = STATUS_ALIVE eternal = false overflowToDisk = false maxElementsInMemory = 1000 maxElementsOnDisk = 0 memoryStoreEvictionPolicy = LRU timeToLiveSeconds = 1800 timeToIdleSeconds = 2700 diskPersistent = false diskExpiryThreadIntervalSeconds = 600 cacheEventListeners:  hitCount = 0 memoryStoreHitCount = 0 diskStoreHitCount = 0 missCountNotFound = 0 missCountExpired = 0 ]
There was no such logger 'org.codehaus.plexus.redback.xwork.filter.authentication.HttpAuthenticator:basic' 3346210.
 WARN|main|88717|PlexusContainer                - Component manager not found for returned component. Ignored. component=org.apache.maven.archiva.web.repository.ProxiedDavServer@3380c5
 WARN|main|88717|PlexusContainer                - Component manager not found for returned component. Ignored. component=org.apache.maven.archiva.web.repository.ProxiedDavServer@1d179fb
Tests run: 3, Failures: 0, Errors: 0, Skipped: 0, Time elapsed: 0.422 sec
Running org.apache.maven.archiva.web.repository.RepositoryServletProxiedReleasePolicyTest
 INFO|main|88833|log                            - jetty-6.1.5
 INFO|main|88834|log                            - Started SocketConnector@0.0.0.0:37508
Remote HTTP Server started on http://localhost:37508/central
 INFO|main|89992|Cache:url-failures-cache       - Disposing cache: [ name = url-failures-cache status = STATUS_ALIVE eternal = false overflowToDisk = false maxElementsInMemory = 1000 maxElementsOnDisk = 0 memoryStoreEvictionPolicy = LRU timeToLiveSeconds = 1800 timeToIdleSeconds = 2700 diskPersistent = false diskExpiryThreadIntervalSeconds = 600 cacheEventListeners:  hitCount = 0 memoryStoreHitCount = 0 diskStoreHitCount = 0 missCountNotFound = 0 missCountExpired = 0 ]
There was no such logger 'org.codehaus.plexus.redback.xwork.filter.authentication.HttpAuthenticator:basic' 13074502.
 WARN|main|89992|PlexusContainer                - Component manager not found for returned component. Ignored. component=org.apache.maven.archiva.web.repository.ProxiedDavServer@13130a9
 INFO|main|90108|log                            - jetty-6.1.5
 INFO|main|90109|log                            - Started SocketConnector@0.0.0.0:37512
Remote HTTP Server started on http://localhost:37512/central
 INFO|main|91093|AuditLog                       - internal guest 127.0.0.1 "org/apache/archiva/test/1.0/test-1.0.jar" "Modify File (proxied)"
There was no such logger 'org.codehaus.plexus.redback.xwork.filter.authentication.HttpAuthenticator:basic' 33375948.
 INFO|main|91200|Cache:url-failures-cache       - Disposing cache: [ name = url-failures-cache status = STATUS_ALIVE eternal = false overflowToDisk = false maxElementsInMemory = 1000 maxElementsOnDisk = 0 memoryStoreEvictionPolicy = LRU timeToLiveSeconds = 1800 timeToIdleSeconds = 2700 diskPersistent = false diskExpiryThreadIntervalSeconds = 600 cacheEventListeners:  hitCount = 0 memoryStoreHitCount = 0 diskStoreHitCount = 0 missCountNotFound = 0 missCountExpired = 0 ]
 WARN|main|91200|PlexusContainer                - Component manager not found for returned component. Ignored. component=org.apache.maven.archiva.web.repository.ProxiedDavServer@1da5a49
 INFO|main|91310|log                            - jetty-6.1.5
 INFO|main|91311|log                            - Started SocketConnector@0.0.0.0:37515
Remote HTTP Server started on http://localhost:37515/central
 INFO|main|92313|AuditLog                       - internal guest 127.0.0.1 "org/apache/archiva/test/1.0/test-1.0.jar" "Modify File (proxied)"
 INFO|main|92421|Cache:url-failures-cache       - Disposing cache: [ name = url-failures-cache status = STATUS_ALIVE eternal = false overflowToDisk = false maxElementsInMemory = 1000 maxElementsOnDisk = 0 memoryStoreEvictionPolicy = LRU timeToLiveSeconds = 1800 timeToIdleSeconds = 2700 diskPersistent = false diskExpiryThreadIntervalSeconds = 600 cacheEventListeners:  hitCount = 0 memoryStoreHitCount = 0 diskStoreHitCount = 0 missCountNotFound = 0 missCountExpired = 0 ]
There was no such logger 'org.codehaus.plexus.redback.xwork.filter.authentication.HttpAuthenticator:basic' 10870991.
 WARN|main|92422|PlexusContainer                - Component manager not found for returned component. Ignored. component=org.apache.maven.archiva.web.repository.ProxiedDavServer@1779845
 INFO|main|92527|log                            - jetty-6.1.5
 INFO|main|92528|log                            - Started SocketConnector@0.0.0.0:37519
Remote HTTP Server started on http://localhost:37519/central
 INFO|main|93453|RepositoryProxyConnectors:default - Transfer not attempted on http://localhost:37519/central/org/apache/archiva/test/1.0/test-1.0.jar : NO to update releases, policy is DAILY, local file exist, and has been updated within the last day.: using already present local file.
 INFO|main|93453|AuditLog                       - internal guest 127.0.0.1 "org/apache/archiva/test/1.0/test-1.0.jar" "Modify File (proxied)"
 INFO|main|93561|Cache:url-failures-cache       - Disposing cache: [ name = url-failures-cache status = STATUS_ALIVE eternal = false overflowToDisk = false maxElementsInMemory = 1000 maxElementsOnDisk = 0 memoryStoreEvictionPolicy = LRU timeToLiveSeconds = 1800 timeToIdleSeconds = 2700 diskPersistent = false diskExpiryThreadIntervalSeconds = 600 cacheEventListeners:  hitCount = 0 memoryStoreHitCount = 0 diskStoreHitCount = 0 missCountNotFound = 0 missCountExpired = 0 ]
 WARN|main|93562|PlexusContainer                - Component manager not found for returned component. Ignored. component=org.apache.maven.archiva.web.repository.ProxiedDavServer@a6e962
There was no such logger 'org.codehaus.plexus.redback.xwork.filter.authentication.HttpAuthenticator:basic' 1112653.
 INFO|main|93678|log                            - jetty-6.1.5
 INFO|main|93679|log                            - Started SocketConnector@0.0.0.0:37523
Remote HTTP Server started on http://localhost:37523/central
 INFO|main|94692|AuditLog                       - internal guest 127.0.0.1 "org/apache/archiva/test/1.0/test-1.0.jar" "Modify File (proxied)"
 INFO|main|94801|Cache:url-failures-cache       - Disposing cache: [ name = url-failures-cache status = STATUS_ALIVE eternal = false overflowToDisk = false maxElementsInMemory = 1000 maxElementsOnDisk = 0 memoryStoreEvictionPolicy = LRU timeToLiveSeconds = 1800 timeToIdleSeconds = 2700 diskPersistent = false diskExpiryThreadIntervalSeconds = 600 cacheEventListeners:  hitCount = 0 memoryStoreHitCount = 0 diskStoreHitCount = 0 missCountNotFound = 0 missCountExpired = 0 ]
There was no such logger 'org.codehaus.plexus.redback.xwork.filter.authentication.HttpAuthenticator:basic' 15739886.
 WARN|main|94802|PlexusContainer                - Component manager not found for returned component. Ignored. component=org.apache.maven.archiva.web.repository.ProxiedDavServer@16728ec
 INFO|main|95618|log                            - jetty-6.1.5
 INFO|main|95619|log                            - Started SocketConnector@0.0.0.0:37527
Remote HTTP Server started on http://localhost:37527/central
 INFO|main|96632|AuditLog                       - internal guest 127.0.0.1 "org/apache/archiva/test/1.0/test-1.0.jar" "Modify File (proxied)"
 INFO|main|96741|Cache:url-failures-cache       - Disposing cache: [ name = url-failures-cache status = STATUS_ALIVE eternal = false overflowToDisk = false maxElementsInMemory = 1000 maxElementsOnDisk = 0 memoryStoreEvictionPolicy = LRU timeToLiveSeconds = 1800 timeToIdleSeconds = 2700 diskPersistent = false diskExpiryThreadIntervalSeconds = 600 cacheEventListeners:  hitCount = 0 memoryStoreHitCount = 0 diskStoreHitCount = 0 missCountNotFound = 0 missCountExpired = 0 ]
 WARN|main|96741|PlexusContainer                - Component manager not found for returned component. Ignored. component=org.apache.maven.archiva.web.repository.ProxiedDavServer@dd2471
There was no such logger 'org.codehaus.plexus.redback.xwork.filter.authentication.HttpAuthenticator:basic' 6719635.
 INFO|main|96887|log                            - jetty-6.1.5
 INFO|main|96888|log                            - Started SocketConnector@0.0.0.0:37531
Remote HTTP Server started on http://localhost:37531/central
 INFO|main|97841|RepositoryProxyConnectors:default - Transfer not attempted on http://localhost:37531/central/org/apache/archiva/test/1.0/test-1.0.pom : NO to update, releases policy set to NEVER.
 INFO|main|97841|RepositoryProxyConnectors:default - Transfer not attempted on http://localhost:37531/central/org/apache/archiva/test/1.0/test-1.0.jar : NO to update, releases policy set to NEVER.: using already present local file.
 INFO|main|97841|AuditLog                       - internal guest 127.0.0.1 "org/apache/archiva/test/1.0/test-1.0.jar" "Modify File (proxied)"
 INFO|main|97950|Cache:url-failures-cache       - Disposing cache: [ name = url-failures-cache status = STATUS_ALIVE eternal = false overflowToDisk = false maxElementsInMemory = 1000 maxElementsOnDisk = 0 memoryStoreEvictionPolicy = LRU timeToLiveSeconds = 1800 timeToIdleSeconds = 2700 diskPersistent = false diskExpiryThreadIntervalSeconds = 600 cacheEventListeners:  hitCount = 0 memoryStoreHitCount = 0 diskStoreHitCount = 0 missCountNotFound = 0 missCountExpired = 0 ]
There was no such logger 'org.codehaus.plexus.redback.xwork.filter.authentication.HttpAuthenticator:basic' 21579384.
 WARN|main|97951|PlexusContainer                - Component manager not found for returned component. Ignored. component=org.apache.maven.archiva.web.repository.ProxiedDavServer@811c52
 INFO|main|98056|log                            - jetty-6.1.5
 INFO|main|98057|log                            - Started SocketConnector@0.0.0.0:37533
Remote HTTP Server started on http://localhost:37533/central
 INFO|main|99032|RepositoryProxyConnectors:default - Transfer not attempted on http://localhost:37533/central/org/apache/archiva/test/1.0/test-1.0.pom : NO to update, releases policy set to NEVER.
 INFO|main|99032|RepositoryProxyConnectors:default - Transfer not attempted on http://localhost:37533/central/org/apache/archiva/test/1.0/test-1.0.jar : NO to update, releases policy set to NEVER.
 INFO|main|99140|Cache:url-failures-cache       - Disposing cache: [ name = url-failures-cache status = STATUS_ALIVE eternal = false overflowToDisk = false maxElementsInMemory = 1000 maxElementsOnDisk = 0 memoryStoreEvictionPolicy = LRU timeToLiveSeconds = 1800 timeToIdleSeconds = 2700 diskPersistent = false diskExpiryThreadIntervalSeconds = 600 cacheEventListeners:  hitCount = 0 memoryStoreHitCount = 0 diskStoreHitCount = 0 missCountNotFound = 0 missCountExpired = 0 ]
There was no such logger 'org.codehaus.plexus.redback.xwork.filter.authentication.HttpAuthenticator:basic' 6943517.
 WARN|main|99141|PlexusContainer                - Component manager not found for returned component. Ignored. component=org.apache.maven.archiva.web.repository.ProxiedDavServer@1770daa
 INFO|main|99246|log                            - jetty-6.1.5
 INFO|main|99247|log                            - Started SocketConnector@0.0.0.0:37537
Remote HTTP Server started on http://localhost:37537/central
 INFO|main|100199|RepositoryProxyConnectors:default - Transfer not attempted on http://localhost:37537/central/org/apache/archiva/test/1.0/test-1.0.pom : NO to update, releases policy set to NEVER.
 INFO|main|100199|RepositoryProxyConnectors:default - Transfer not attempted on http://localhost:37537/central/org/apache/archiva/test/1.0/test-1.0.jar : NO to update, releases policy set to NEVER.: using already present local file.
 INFO|main|100200|AuditLog                       - internal guest 127.0.0.1 "org/apache/archiva/test/1.0/test-1.0.jar" "Modify File (proxied)"
 INFO|main|100310|Cache:url-failures-cache       - Disposing cache: [ name = url-failures-cache status = STATUS_ALIVE eternal = false overflowToDisk = false maxElementsInMemory = 1000 maxElementsOnDisk = 0 memoryStoreEvictionPolicy = LRU timeToLiveSeconds = 1800 timeToIdleSeconds = 2700 diskPersistent = false diskExpiryThreadIntervalSeconds = 600 cacheEventListeners:  hitCount = 0 memoryStoreHitCount = 0 diskStoreHitCount = 0 missCountNotFound = 0 missCountExpired = 0 ]
There was no such logger 'org.codehaus.plexus.redback.xwork.filter.authentication.HttpAuthenticator:basic' 13349882.
 WARN|main|100311|PlexusContainer                - Component manager not found for returned component. Ignored. component=org.apache.maven.archiva.web.repository.ProxiedDavServer@1a73d7d
 INFO|main|100439|log                            - jetty-6.1.5
 INFO|main|100440|log                            - Started SocketConnector@0.0.0.0:37541
Remote HTTP Server started on http://localhost:37541/central
 INFO|main|101432|RepositoryProxyConnectors:default - Transfer not attempted on http://localhost:37541/central/org/apache/archiva/test/1.0/test-1.0.jar : NO to update releases, policy is HOURLY, local file exist, and has been updated within the last hour.: using already present local file.
 INFO|main|101432|AuditLog                       - internal guest 127.0.0.1 "org/apache/archiva/test/1.0/test-1.0.jar" "Modify File (proxied)"
 INFO|main|101540|Cache:url-failures-cache       - Disposing cache: [ name = url-failures-cache status = STATUS_ALIVE eternal = false overflowToDisk = false maxElementsInMemory = 1000 maxElementsOnDisk = 0 memoryStoreEvictionPolicy = LRU timeToLiveSeconds = 1800 timeToIdleSeconds = 2700 diskPersistent = false diskExpiryThreadIntervalSeconds = 600 cacheEventListeners:  hitCount = 0 memoryStoreHitCount = 0 diskStoreHitCount = 0 missCountNotFound = 0 missCountExpired = 0 ]
There was no such logger 'org.codehaus.plexus.redback.xwork.filter.authentication.HttpAuthenticator:basic' 7931808.
 WARN|main|101540|PlexusContainer                - Component manager not found for returned component. Ignored. component=org.apache.maven.archiva.web.repository.ProxiedDavServer@1e7872e
 INFO|main|101641|log                            - jetty-6.1.5
 INFO|main|101642|log                            - Started SocketConnector@0.0.0.0:37547
Remote HTTP Server started on http://localhost:37547/central
 INFO|main|102671|AuditLog                       - internal guest 127.0.0.1 "org/apache/archiva/test/1.0/test-1.0.jar" "Modify File (proxied)"
 INFO|main|102780|Cache:url-failures-cache       - Disposing cache: [ name = url-failures-cache status = STATUS_ALIVE eternal = false overflowToDisk = false maxElementsInMemory = 1000 maxElementsOnDisk = 0 memoryStoreEvictionPolicy = LRU timeToLiveSeconds = 1800 timeToIdleSeconds = 2700 diskPersistent = false diskExpiryThreadIntervalSeconds = 600 cacheEventListeners:  hitCount = 0 memoryStoreHitCount = 0 diskStoreHitCount = 0 missCountNotFound = 0 missCountExpired = 0 ]
There was no such logger 'org.codehaus.plexus.redback.xwork.filter.authentication.HttpAuthenticator:basic' 1564133.
 WARN|main|102780|PlexusContainer                - Component manager not found for returned component. Ignored. component=org.apache.maven.archiva.web.repository.ProxiedDavServer@31613
 INFO|main|102899|log                            - jetty-6.1.5
 INFO|main|102900|log                            - Started SocketConnector@0.0.0.0:37552
Remote HTTP Server started on http://localhost:37552/central
 INFO|main|103911|AuditLog                       - internal guest 127.0.0.1 "org/apache/archiva/test/1.0/test-1.0.jar" "Modify File (proxied)"
 INFO|main|104020|Cache:url-failures-cache       - Disposing cache: [ name = url-failures-cache status = STATUS_ALIVE eternal = false overflowToDisk = false maxElementsInMemory = 1000 maxElementsOnDisk = 0 memoryStoreEvictionPolicy = LRU timeToLiveSeconds = 1800 timeToIdleSeconds = 2700 diskPersistent = false diskExpiryThreadIntervalSeconds = 600 cacheEventListeners:  hitCount = 0 memoryStoreHitCount = 0 diskStoreHitCount = 0 missCountNotFound = 0 missCountExpired = 0 ]
There was no such logger 'org.codehaus.plexus.redback.xwork.filter.authentication.HttpAuthenticator:basic' 8411091.
 WARN|main|104020|PlexusContainer                - Component manager not found for returned component. Ignored. component=org.apache.maven.archiva.web.repository.ProxiedDavServer@9b69e6
 INFO|main|104148|log                            - jetty-6.1.5
 INFO|main|104149|log                            - Started SocketConnector@0.0.0.0:37560
Remote HTTP Server started on http://localhost:37560/central
 INFO|main|105184|RepositoryProxyConnectors:default - Transfer not attempted on http://localhost:37560/central/org/apache/archiva/test/1.0/test-1.0.jar : NO to update releases, policy is ONCE, and local file exist.: using already present local file.
 INFO|main|105185|AuditLog                       - internal guest 127.0.0.1 "org/apache/archiva/test/1.0/test-1.0.jar" "Modify File (proxied)"
 INFO|main|105290|Cache:url-failures-cache       - Disposing cache: [ name = url-failures-cache status = STATUS_ALIVE eternal = false overflowToDisk = false maxElementsInMemory = 1000 maxElementsOnDisk = 0 memoryStoreEvictionPolicy = LRU timeToLiveSeconds = 1800 timeToIdleSeconds = 2700 diskPersistent = false diskExpiryThreadIntervalSeconds = 600 cacheEventListeners:  hitCount = 0 memoryStoreHitCount = 0 diskStoreHitCount = 0 missCountNotFound = 0 missCountExpired = 0 ]
There was no such logger 'org.codehaus.plexus.redback.xwork.filter.authentication.HttpAuthenticator:basic' 7311614.
 WARN|main|105290|PlexusContainer                - Component manager not found for returned component. Ignored. component=org.apache.maven.archiva.web.repository.ProxiedDavServer@cc1164
 INFO|main|105399|log                            - jetty-6.1.5
 INFO|main|105400|log                            - Started SocketConnector@0.0.0.0:37567
Remote HTTP Server started on http://localhost:37567/central
 INFO|main|106411|AuditLog                       - internal guest 127.0.0.1 "org/apache/archiva/test/1.0/test-1.0.jar" "Modify File (proxied)"
 INFO|main|106519|Cache:url-failures-cache       - Disposing cache: [ name = url-failures-cache status = STATUS_ALIVE eternal = false overflowToDisk = false maxElementsInMemory = 1000 maxElementsOnDisk = 0 memoryStoreEvictionPolicy = LRU timeToLiveSeconds = 1800 timeToIdleSeconds = 2700 diskPersistent = false diskExpiryThreadIntervalSeconds = 600 cacheEventListeners:  hitCount = 0 memoryStoreHitCount = 0 diskStoreHitCount = 0 missCountNotFound = 0 missCountExpired = 0 ]
There was no such logger 'org.codehaus.plexus.redback.xwork.filter.authentication.HttpAuthenticator:basic' 8924287.
 WARN|main|106520|PlexusContainer                - Component manager not found for returned component. Ignored. component=org.apache.maven.archiva.web.repository.ProxiedDavServer@c8e545
 INFO|main|106624|log                            - jetty-6.1.5
 INFO|main|106625|log                            - Started SocketConnector@0.0.0.0:37573
Remote HTTP Server started on http://localhost:37573/central
 INFO|main|107610|AuditLog                       - internal guest 127.0.0.1 "org/apache/archiva/test/1.0/test-1.0.jar" "Modify File (proxied)"
 INFO|main|107719|Cache:url-failures-cache       - Disposing cache: [ name = url-failures-cache status = STATUS_ALIVE eternal = false overflowToDisk = false maxElementsInMemory = 1000 maxElementsOnDisk = 0 memoryStoreEvictionPolicy = LRU timeToLiveSeconds = 1800 timeToIdleSeconds = 2700 diskPersistent = false diskExpiryThreadIntervalSeconds = 600 cacheEventListeners:  hitCount = 0 memoryStoreHitCount = 0 diskStoreHitCount = 0 missCountNotFound = 0 missCountExpired = 0 ]
There was no such logger 'org.codehaus.plexus.redback.xwork.filter.authentication.HttpAuthenticator:basic' 17971360.
 WARN|main|107720|PlexusContainer                - Component manager not found for returned component. Ignored. component=org.apache.maven.archiva.web.repository.ProxiedDavServer@1b2725a
Tests run: 15, Failures: 0, Errors: 0, Skipped: 0, Time elapsed: 19 sec
Running org.apache.maven.archiva.web.repository.RepositoryServletDeployTest
 INFO|main|107882|AuditLog                       - internal guest 127.0.0.1 "path/to" "Created Directory"
 INFO|main|107900|AuditLog                       - internal guest 127.0.0.1 "/path/to/artifact.jar" "Created File"
 INFO|main|107901|Cache:url-failures-cache       - Disposing cache: [ name = url-failures-cache status = STATUS_ALIVE eternal = false overflowToDisk = false maxElementsInMemory = 1000 maxElementsOnDisk = 0 memoryStoreEvictionPolicy = LRU timeToLiveSeconds = 1800 timeToIdleSeconds = 2700 diskPersistent = false diskExpiryThreadIntervalSeconds = 600 cacheEventListeners:  hitCount = 0 memoryStoreHitCount = 0 diskStoreHitCount = 0 missCountNotFound = 0 missCountExpired = 0 ]
There was no such logger 'org.codehaus.plexus.redback.xwork.filter.authentication.HttpAuthenticator:basic' 15196048.
 WARN|main|107902|PlexusContainer                - Component manager not found for returned component. Ignored. component=org.apache.maven.archiva.web.repository.ProxiedDavServer@ebcda1
Tests run: 1, Failures: 0, Errors: 0, Skipped: 0, Time elapsed: 0.178 sec

Results :
Tests run: 146, Failures: 0, Errors: 1, Skipped: 0

[INFO] ------------------------------------------------------------------------
[ERROR] BUILD FAILURE
[INFO] ------------------------------------------------------------------------
[INFO] There are test failures.
[INFO] ------------------------------------------------------------------------
[INFO] For more information, run Maven with the -e switch
[INFO] ------------------------------------------------------------------------
[INFO] Total time: 2 minutes 34 seconds
[INFO] Finished at: Mon Jan 28 14:25:44 GMT+00:00 2008
[INFO] Final Memory: 27M/311M
[INFO] ------------------------------------------------------------------------

****************************************************************************



Mime
View raw message