maven-notifications mailing list archives

Site index · List index
Message view « Date » · « Thread »
Top « Date » · « Thread »
From "Continuum@maven.zones.apache.org" <contin...@maven.zones.apache.org>
Subject [continuum] BUILD FAILURE: Maven Deploy Plugin
Date Thu, 31 Jan 2008 14:21:05 GMT
Online report : http://maven.zones.apache.org/continuum/buildResult.action?buildId=40938&projectId=13

Build statistics:
  State: Failed
  Previous State: Failed
  Started at: Thu 31 Jan 2008 14:20:44 +0000
  Finished at: Thu 31 Jan 2008 14:21:01 +0000
  Total time: 16s
  Build Trigger: Schedule
  Build Number: 127
  Exit code: 1
  Building machine hostname: maven.zones.apache.org
  Operating system : SunOS(unknown)
  Java Home version : 
          java version "1.4.2_09"
          Java(TM) 2 Runtime Environment, Standard Edition (build 1.4.2_09-b05)
          Java HotSpot(TM) Client VM (build 1.4.2_09-b05, mixed mode)
        
  Builder version :
          Maven version: 2.0.7
          Java version: 1.4.2_09
          OS name: "sunos" version: "5.10" arch: "x86"
    
****************************************************************************
SCM Changes:
****************************************************************************
No files changed

****************************************************************************
Dependencies Changes:
****************************************************************************
No dependencies changed


****************************************************************************
Build Defintion:
****************************************************************************
POM filename: pom.xml
Goals: clean install   
Arguments: --batch-mode --non-recursive -P integration-tests
Build Fresh: true
Always Build: true
Default Build Definition: false
Schedule: Integration Test Run
Profile Name: JDK 1.4.2
Description: 


****************************************************************************
Test Summary:
****************************************************************************
Tests: 20
Failures: 4
Total time: 2972

****************************************************************************
Output:
****************************************************************************
[INFO] Scanning for projects...
[INFO] ----------------------------------------------------------------------------
[INFO] Building Maven Deploy Plugin
[INFO]    task-segment: [clean, install]
[INFO] ----------------------------------------------------------------------------
[INFO] [clean:clean]
[INFO] [plugin:descriptor]
[INFO] Using 2 extractors.
[INFO] Applying extractor for language: java
[INFO] Extractor for language: java found 2 mojo descriptors.
[INFO] Applying extractor for language: bsh
[INFO] Extractor for language: bsh found 0 mojo descriptors.
[INFO] [resources:resources]
[INFO] Using default encoding to copy filtered resources.
[INFO] Resource directory does not exist: /export/home/build/data/continuum/checkouts/13/src/main/resources
[INFO] snapshot org.apache.maven:maven-plugin-testing-harness:2.4-SNAPSHOT: checking for updates
from apache.snapshots
[INFO] [compiler:compile]
[INFO] Compiling 10 source files to /export/home/build/data/continuum/checkouts/13/target/classes
[INFO] [resources:testResources]
[INFO] Using default encoding to copy filtered resources.
[INFO] Copying 18 resources
[INFO] [compiler:testCompile]
[INFO] Compiling 8 source files to /export/home/build/data/continuum/checkouts/13/target/test-classes
[INFO] [surefire:test]
[INFO] Surefire report directory: /export/home/build/data/continuum/checkouts/13/target/surefire-reports

-------------------------------------------------------
 T E S T S
-------------------------------------------------------
Running org.apache.maven.plugin.deploy.DeployFileMojoTest
[INFO] Retrieving previous metadata from deploy-test
[INFO] Uploading repository metadata for: 'artifact org.apache.maven.test:maven-deploy-file-test'
[INFO] Retrieving previous metadata from deploy-test
[INFO] Uploading project information for maven-deploy-file-test 1.0
[INFO] Retrieving previous metadata from deploy-test
[INFO] Uploading repository metadata for: 'artifact org.apache.maven.test:maven-deploy-file-test'
[INFO] Retrieving previous metadata from deploy-test
[INFO] Uploading project information for maven-deploy-file-test 1.0
[INFO] Retrieving previous metadata from deploy-test
[INFO] Uploading repository metadata for: 'artifact org.apache.maven.test:maven-deploy-file-test'
[INFO] Retrieving previous metadata from deploy-test
[INFO] Uploading project information for maven-deploy-file-test 1.0
[INFO] Retrieving previous metadata from deploy-test
[INFO] Uploading repository metadata for: 'artifact org.apache.maven.test:maven-deploy-file-test'
[INFO] Retrieving previous metadata from deploy-test
[INFO] Uploading project information for maven-deploy-file-test 1.0
[INFO] Retrieving previous metadata from deploy-test
[INFO] Uploading repository metadata for: 'artifact org.apache.maven.test:maven-deploy-file-test'
[INFO] Retrieving previous metadata from deploy-test
[INFO] Uploading project information for maven-deploy-file-test 1.0
[INFO] Retrieving previous metadata from deploy-test
[INFO] Uploading repository metadata for: 'artifact org.apache.maven.test:maven-deploy-file-test'
[INFO] Retrieving previous metadata from deploy-test
[INFO] Uploading project information for maven-deploy-file-test 1.0
Tests run: 6, Failures: 0, Errors: 0, Skipped: 0, Time elapsed: 1.832 sec
Running org.apache.maven.plugin.deploy.DeployMojoTest
Testing user.home value for .ssh dir: /export/home/build/data/continuum/checkouts/13/target/ssh-user-home
Testing .ssh dir: /export/home/build/data/continuum/checkouts/13/target/ssh-user-home/.ssh
Tests run: 7, Failures: 0, Errors: 4, Skipped: 0, Time elapsed: 1.152 sec <<< FAILURE!
Running org.apache.maven.plugin.deploy.DeployFileMojoUnitTest
Tests run: 7, Failures: 0, Errors: 0, Skipped: 0, Time elapsed: 0.016 sec

Results :

Tests in error: 
  testBasicDeploy(org.apache.maven.plugin.deploy.DeployMojoTest)
  testBasicDeployWithPackagingAsPom(org.apache.maven.plugin.deploy.DeployMojoTest)
  testUpdateReleaseParamSetToTrue(org.apache.maven.plugin.deploy.DeployMojoTest)
  testDeployWithAttachedArtifacts(org.apache.maven.plugin.deploy.DeployMojoTest)

Tests run: 20, Failures: 0, Errors: 4, Skipped: 0

[INFO] ------------------------------------------------------------------------
[ERROR] BUILD FAILURE
[INFO] ------------------------------------------------------------------------
[INFO] There are test failures.

Please refer to /export/home/build/data/continuum/checkouts/13/target/surefire-reports for
the individual test results.
[INFO] ------------------------------------------------------------------------
[INFO] For more information, run Maven with the -e switch
[INFO] ------------------------------------------------------------------------
[INFO] Total time: 13 seconds
[INFO] Finished at: Thu Jan 31 14:21:00 GMT+00:00 2008
[INFO] Final Memory: 15M/28M
[INFO] ------------------------------------------------------------------------

****************************************************************************



Mime
View raw message