maven-notifications mailing list archives

Site index · List index
Message view « Date » · « Thread »
Top « Date » · « Thread »
From "Continuum@maven.zones.apache.org" <contin...@maven.zones.apache.org>
Subject [continuum] BUILD FAILURE: Maven War Plugin
Date Wed, 23 Jan 2008 15:39:32 GMT
Online report : http://maven.zones.apache.org/continuum/buildResult.action?buildId=40328&projectId=34

Build statistics:
  State: Failed
  Previous State: Ok
  Started at: Wed 23 Jan 2008 15:37:57 +0000
  Finished at: Wed 23 Jan 2008 15:39:17 +0000
  Total time: 1m 19s
  Build Trigger: Schedule
  Build Number: 119
  Exit code: 1
  Building machine hostname: maven.zones.apache.org
  Operating system : SunOS(unknown)
  Java Home version : 
          java version "1.4.2_09"
          Java(TM) 2 Runtime Environment, Standard Edition (build 1.4.2_09-b05)
          Java HotSpot(TM) Client VM (build 1.4.2_09-b05, mixed mode)
        
  Builder version :
          Maven version: 2.0.7
          Java version: 1.4.2_09
          OS name: "sunos" version: "5.10" arch: "x86"
    
****************************************************************************
SCM Changes:
****************************************************************************
Changed: no author @ no date
Comment: no comment
Files changed:
  src/test/java/org/apache/maven/plugin/war/overlay/OverlayManagerTest.java ( no revision
)
  src/test/java/org/apache/maven/plugin/war/stub/WarArtifactStub.java ( no revision )
  src/main/java/org/apache/maven/plugin/war/overlay/OverlayManager.java ( no revision )
  src/main/java/org/apache/maven/plugin/war/AbstractWarMojo.java ( no revision )
  src/main/java/org/apache/maven/plugin/war/packaging/ArtifactsPackagingTask.java ( no revision
)
  src/main/java/org/apache/maven/plugin/war/packaging/OverlayPackagingTask.java ( no revision
)
  src/main/java/org/apache/maven/plugin/war/WarMojo.java ( no revision )
  src/site/apt/examples/skinny-wars.apt ( no revision )

****************************************************************************
Dependencies Changes:
****************************************************************************
No dependencies changed


****************************************************************************
Build Defintion:
****************************************************************************
POM filename: pom.xml
Goals: clean install   
Arguments: -B -N
Build Fresh: false
Always Build: false
Default Build Definition: true
Schedule: DEFAULT_SCHEDULE
Profile Name: JDK 1.4.2
Description: 


****************************************************************************
Test Summary:
****************************************************************************
Tests: 0
Failures: 0
Total time: 0

****************************************************************************
Output:
****************************************************************************
[INFO] Scanning for projects...
[INFO] ----------------------------------------------------------------------------
[INFO] Building Maven War Plugin
[INFO]    task-segment: [clean, install]
[INFO] ----------------------------------------------------------------------------
[INFO] [clean:clean]
[INFO] Deleting directory /export/home/build/data/continuum/checkouts/34/target
[INFO] [plugin:descriptor]
[INFO] Using 2 extractors.
[INFO] Applying extractor for language: java
[INFO] Extractor for language: java found 4 mojo descriptors.
[INFO] Applying extractor for language: bsh
[INFO] Extractor for language: bsh found 0 mojo descriptors.
[INFO] Setting property: classpath.resource.loader.class => 'org.codehaus.plexus.velocity.ContextClassLoaderResourceLoader'.
[INFO] Setting property: velocimacro.messages.on => 'false'.
[INFO] Setting property: resource.loader => 'classpath'.
[INFO] Setting property: resource.manager.logwhenfound => 'false'.
[INFO] [remote-resources:process {execution: default}]
[INFO] [resources:resources]
[INFO] Using default encoding to copy filtered resources.
[INFO] Resource directory does not exist: /export/home/build/data/continuum/checkouts/34/src/main/resources
[INFO] Copying 2 resources
[INFO] [compiler:compile]
[INFO] Compiling 29 source files to /export/home/build/data/continuum/checkouts/34/target/classes
[INFO] ------------------------------------------------------------------------
[ERROR] BUILD FAILURE
[INFO] ------------------------------------------------------------------------
[INFO] Compilation failure
/export/home/build/data/continuum/checkouts/34/src/main/java/org/apache/maven/plugin/war/WarMojo.java:[190,33]
toString() in java.lang.Object cannot be applied to (java.lang.String[])



/export/home/build/data/continuum/checkouts/34/src/main/java/org/apache/maven/plugin/war/WarMojo.java:[190,33]
toString() in java.lang.Object cannot be applied to (java.lang.String[])


[INFO] ------------------------------------------------------------------------
[INFO] For more information, run Maven with the -e switch
[INFO] ------------------------------------------------------------------------
[INFO] Total time: 1 minute 16 seconds
[INFO] Finished at: Wed Jan 23 15:39:17 GMT+00:00 2008
[INFO] Final Memory: 19M/36M
[INFO] ------------------------------------------------------------------------

****************************************************************************



Mime
View raw message