maven-notifications mailing list archives

Site index · List index
Message view « Date » · « Thread »
Top « Date » · « Thread »
From "Continuum@maven.zones.apache.org" <contin...@maven.zones.apache.org>
Subject [continuum] BUILD FAILURE: Maven Assembly Plugin
Date Thu, 31 Jan 2008 14:12:43 GMT
Online report : http://maven.zones.apache.org/continuum/buildResult.action?buildId=40930&projectId=5

Build statistics:
  State: Failed
  Previous State: Failed
  Started at: Thu 31 Jan 2008 13:56:25 +0000
  Finished at: Thu 31 Jan 2008 14:12:27 +0000
  Total time: 16m 2s
  Build Trigger: Schedule
  Build Number: 159
  Exit code: 1
  Building machine hostname: maven.zones.apache.org
  Operating system : SunOS(unknown)
  Java Home version : 
          java version "1.4.2_09"
          Java(TM) 2 Runtime Environment, Standard Edition (build 1.4.2_09-b05)
          Java HotSpot(TM) Client VM (build 1.4.2_09-b05, mixed mode)
        
  Builder version :
          Maven version: 2.0.7
          Java version: 1.4.2_09
          OS name: "sunos" version: "5.10" arch: "x86"
    
****************************************************************************
SCM Changes:
****************************************************************************
No files changed

****************************************************************************
Dependencies Changes:
****************************************************************************
No dependencies changed


****************************************************************************
Build Defintion:
****************************************************************************
POM filename: pom.xml
Goals: clean install   
Arguments: --batch-mode --non-recursive -P integration-tests
Build Fresh: true
Always Build: true
Default Build Definition: false
Schedule: Integration Test Run
Profile Name: JDK 1.4.2
Description: 


****************************************************************************
Test Summary:
****************************************************************************
Tests: 266
Failures: 0
Total time: 10181

****************************************************************************
Output:
****************************************************************************
[INFO] Scanning for projects...
[INFO] ----------------------------------------------------------------------------
[INFO] Building Maven Assembly Plugin
[INFO]    task-segment: [clean, install]
[INFO] ----------------------------------------------------------------------------
[INFO] snapshot org.apache.maven.plugins:maven-component-it-plugin:1.0-SNAPSHOT: checking for updates from apache.snapshots
[INFO] snapshot org.apache.maven.plugins:maven-component-it-plugin:1.0-SNAPSHOT: checking for updates from codehaus.snapshots
[INFO] snapshot org.apache.maven.plugins:maven-component-it-plugin:1.0-SNAPSHOT: checking for updates from codehaus.org
[INFO] snapshot org.apache.maven.plugins:maven-invoker-plugin:1.1-SNAPSHOT: checking for updates from apache.snapshots
[INFO] snapshot org.apache.maven.plugins:maven-invoker-plugin:1.1-SNAPSHOT: checking for updates from codehaus.snapshots
[INFO] snapshot org.apache.maven.plugins:maven-invoker-plugin:1.1-SNAPSHOT: checking for updates from codehaus.org
[INFO] [clean:clean]
[INFO] Deleting directory /export/home/build/data/continuum/checkouts/5/target
[INFO] Deleting directory /export/home/build/data/continuum/checkouts/5/target/classes
[INFO] Deleting directory /export/home/build/data/continuum/checkouts/5/target/test-classes
[INFO] Deleting file-set: src/it (included: [**/target, **/build.log], excluded: [])
[INFO] artifact org.apache.maven.plugins:maven-plugin-plugin: checking for updates from codehaus.snapshots
[INFO] snapshot org.apache.maven.plugins:maven-plugin-plugin:2.4-SNAPSHOT: checking for updates from apache.snapshots
[INFO] snapshot org.apache.maven.plugins:maven-plugin-plugin:2.4-SNAPSHOT: checking for updates from codehaus.snapshots
[INFO] snapshot org.apache.maven:maven-plugin-tools:2.4-SNAPSHOT: checking for updates from apache.snapshots
[INFO] snapshot org.apache.maven:maven-plugin-tools:2.4-SNAPSHOT: checking for updates from codehaus.snapshots
[INFO] artifact org.apache.maven.plugins:maven-resources-plugin: checking for updates from codehaus.snapshots
[INFO] snapshot org.apache.maven.plugins:maven-resources-plugin:2.3-SNAPSHOT: checking for updates from apache.snapshots
[INFO] snapshot org.apache.maven.plugins:maven-resources-plugin:2.3-SNAPSHOT: checking for updates from codehaus.snapshots
[INFO] artifact org.apache.maven.plugins:maven-compiler-plugin: checking for updates from codehaus.snapshots
[INFO] snapshot org.apache.maven.plugins:maven-compiler-plugin:2.1-SNAPSHOT: checking for updates from apache.snapshots
[INFO] snapshot org.apache.maven.plugins:maven-compiler-plugin:2.1-SNAPSHOT: checking for updates from codehaus.snapshots
[INFO] artifact org.apache.maven.plugins:maven-jar-plugin: checking for updates from codehaus.snapshots
[INFO] snapshot org.apache.maven.plugins:maven-jar-plugin:2.3-SNAPSHOT: checking for updates from apache.snapshots
[INFO] snapshot org.apache.maven.plugins:maven-jar-plugin:2.3-SNAPSHOT: checking for updates from codehaus.snapshots
[INFO] artifact org.apache.maven.plugins:maven-install-plugin: checking for updates from codehaus.snapshots
[INFO] snapshot org.apache.maven.plugins:maven-install-plugin:2.3-SNAPSHOT: checking for updates from apache.snapshots
[INFO] snapshot org.apache.maven.plugins:maven-install-plugin:2.3-SNAPSHOT: checking for updates from codehaus.snapshots
[INFO] [component-it:inject-local-repository-path {execution: inject-localrepo-path}]
[INFO] Injecting local-repository path: /export/home/build/.m2/repository into project properties under key: local.repo.path
[INFO] [modello:xpp3-reader {execution: descriptor}]
[INFO] outputDirectory: /export/home/build/data/continuum/checkouts/5/target/generated-sources/modello
[INFO] Generating current version: 1.1.0
[INFO] [modello:xpp3-writer {execution: descriptor}]
[INFO] outputDirectory: /export/home/build/data/continuum/checkouts/5/target/generated-sources/modello
[INFO] Generating current version: 1.1.0
[INFO] [modello:java {execution: descriptor}]
[INFO] outputDirectory: /export/home/build/data/continuum/checkouts/5/target/generated-sources/modello
[INFO] Generating current version: 1.1.0
[INFO] [modello:xsd {execution: descriptor}]
[INFO] outputDirectory: /export/home/build/data/continuum/checkouts/5/target/generated-site/xsd
[INFO] Generating current version: 1.1.0
[INFO] [modello:xpp3-reader {execution: component}]
[INFO] outputDirectory: /export/home/build/data/continuum/checkouts/5/target/generated-sources/modello
[INFO] Generating current version: 1.1.0
[INFO] [modello:xpp3-writer {execution: component}]
[INFO] outputDirectory: /export/home/build/data/continuum/checkouts/5/target/generated-sources/modello
[INFO] Generating current version: 1.1.0
[INFO] [modello:java {execution: component}]
[INFO] outputDirectory: /export/home/build/data/continuum/checkouts/5/target/generated-sources/modello
[INFO] Generating current version: 1.1.0
[INFO] [modello:xsd {execution: component}]
[INFO] outputDirectory: /export/home/build/data/continuum/checkouts/5/target/generated-site/xsd
[INFO] Generating current version: 1.1.0
[INFO] [plexus:descriptor {execution: create-component-descriptor}]
[INFO] snapshot org.apache.maven:maven-plugin-tools-java:2.4-SNAPSHOT: checking for updates from codehaus.org
[INFO] snapshot org.apache.maven:maven-plugin-tools-api:2.4-SNAPSHOT: checking for updates from codehaus.org
[INFO] snapshot org.apache.maven.doxia:doxia-site-renderer:1.0-alpha-10-SNAPSHOT: checking for updates from codehaus.org
[INFO] snapshot org.apache.maven.doxia:doxia-sitetools:1.0-alpha-10-SNAPSHOT: checking for updates from codehaus.org
[INFO] snapshot org.apache.maven.doxia:doxia-decoration-model:1.0-alpha-10-SNAPSHOT: checking for updates from codehaus.org
[INFO] snapshot org.apache.maven:maven-plugin-tools-beanshell:2.4-SNAPSHOT: checking for updates from codehaus.org
[INFO] snapshot org.apache.maven.doxia:doxia-core:1.0-alpha-10-SNAPSHOT: checking for updates from codehaus.org
[INFO] snapshot org.apache.maven.doxia:doxia:1.0-alpha-10-SNAPSHOT: checking for updates from codehaus.org
[INFO] snapshot org.apache.maven.doxia:doxia-sink-api:1.0-alpha-10-SNAPSHOT: checking for updates from codehaus.org
[INFO] [plugin:descriptor]
[INFO] Using 2 extractors.
[INFO] Applying extractor for language: java
[INFO] Extractor for language: java found 9 mojo descriptors.
[INFO] Applying extractor for language: bsh
[INFO] Extractor for language: bsh found 0 mojo descriptors.
[INFO] [plexus:merge-descriptors {execution: merge}]
[INFO] [resources:resources]
[INFO] Using default encoding to copy filtered resources.
[INFO] Copying 5 resources
[INFO] Copying 1 resource
[INFO] snapshot org.codehaus.plexus:plexus-active-collections:1.0-beta-2-SNAPSHOT: checking for updates from apache.snapshots
[INFO] snapshot org.apache.maven.shared:maven-repository-builder:1.0-alpha-2-SNAPSHOT: checking for updates from codehaus.org
[INFO] [compiler:compile]
[INFO] Compiling 77 source files to /export/home/build/data/continuum/checkouts/5/target/classes
[INFO] [resources:testResources]
[INFO] Using default encoding to copy filtered resources.
[INFO] Copying 482 resources to projects
[INFO] Copying 1 resource to it-project-parent
[INFO] Copying 0 resource to remote-repository
[INFO] [compiler:testCompile]
[INFO] Compiling 33 source files to /export/home/build/data/continuum/checkouts/5/target/test-classes
[INFO] [surefire:test]
[INFO] Surefire report directory: /export/home/build/data/continuum/checkouts/5/target/surefire-reports

-------------------------------------------------------
 T E S T S
-------------------------------------------------------
Running org.apache.maven.plugin.assembly.archive.phase.ModuleSetAssemblyPhaseTest
[WARNING] [DEPRECATION] Use of <moduleSources/> as a file-set is deprecated. Please use the <fileSets/> sub-element of <moduleSources/> instead.
[WARNING] [DEPRECATION] Use of <moduleSources/> as a file-set is deprecated. Please use the <fileSets/> sub-element of <moduleSources/> instead.
[WARNING] [DEPRECATION] Use of <moduleSources/> as a file-set is deprecated. Please use the <fileSets/> sub-element of <moduleSources/> instead.
[DEBUG] module source directory is: /var/tmp/module-set-phase.test.1201787831711
[DEBUG] module dest directory is: artifact/ (assembly basedir may be prepended)
[DEBUG] module source directory is: /var/tmp/module-set-phase.test.1201787831821
[DEBUG] module dest directory is: artifact/out/ (assembly basedir may be prepended)
[DEBUG] module source directory is: /var/tmp/module-set-phase.test.1201787831871
[DEBUG] module dest directory is: artifact/ (assembly basedir may be prepended)
[DEBUG] Processing binary artifact for module project: group:module:jar:version
[DEBUG] Adding artifact: group:module:version:jar with file: /var/tmp/ArtifactMock.test.36979 to assembly location: out/artifact.
[WARNING] NOTE: Currently, inclusion of module dependencies may produce unpredictable results if a version conflict occurs.
[DEBUG] Processing binary dependencies for module project: group:module:jar:version
[DEBUG] No dependency sets specified.
[DEBUG] Excluding POM-packaging module: group:artifact
[WARNING] NOTE: Currently, inclusion of module dependencies may produce unpredictable results if a version conflict occurs.
[DEBUG] Processing binary attachment: test for module project: group:artifact:jar:version
[DEBUG] Adding artifact: group:artifact:version:jar:test with file: /var/tmp/ArtifactMock.test.36980 to assembly location: out/artifact.
[WARNING] NOTE: Currently, inclusion of module dependencies may produce unpredictable results if a version conflict occurs.
[DEBUG] Processing binary dependencies for module project: group:artifact:jar:version
[DEBUG] No dependency sets specified.
[DEBUG] Processing binary attachment: test for module project: group:artifact:jar:version
[DEBUG] Processing binary artifact for module project: group:artifact:jar:version
[DEBUG] Adding artifact: group:artifact:version:jar with file: /var/tmp/ArtifactMock.test.36982 to assembly location: out/artifact.
[WARNING] NOTE: Currently, inclusion of module dependencies may produce unpredictable results if a version conflict occurs.
[DEBUG] Processing binary dependencies for module project: group:artifact:jar:version
[DEBUG] No dependency sets specified.
[DEBUG] Processing binary artifact for module project: group:artifact:jar:version
[DEBUG] Adding artifact: group:artifact:version:jar with file: /var/tmp/ArtifactMock.test.36983 to assembly location: out/artifact.
[WARNING] NOTE: Currently, inclusion of module dependencies may produce unpredictable results if a version conflict occurs.
[DEBUG] Processing binary dependencies for module project: group:artifact:jar:version
[DEBUG] Project group:artifact:jar:version has no dependencies. Skipping dependency set addition.
[INFO] Processing DependencySet (output=out)
[DEBUG] Filtering dependency artifacts WITHOUT transitive dependency path information.
[DEBUG] Adding 1 dependency artifacts.
[DEBUG] Adding artifact: group:dep:1:jar with file: /var/tmp/ArtifactMock.test.36984 to assembly location: out/dep.
[DEBUG] Processing binary artifact for module project: group:artifact:jar:version
[DEBUG] Adding artifact: group:artifact:0:jar with file: /var/tmp/ArtifactMock.test.36985 to assembly location: out/artifact.
[WARNING] NOTE: Currently, inclusion of module dependencies may produce unpredictable results if a version conflict occurs.
[DEBUG] Processing binary dependencies for module project: group:artifact:jar:version
[DEBUG] Project group:artifact:jar:version has no dependencies. Skipping dependency set addition.
[INFO] Processing DependencySet (output=out)
[DEBUG] Filtering dependency artifacts WITHOUT transitive dependency path information.
[DEBUG] Adding 1 dependency artifacts.
[DEBUG] Adding artifact: group:dep:1:jar with file: /var/tmp/ArtifactMock.test.36986 to assembly location: out/dep.
[DEBUG] Adding artifact: group:artifact:version:type with file: /var/tmp/ArtifactMock.test.36987 to assembly location: out/artifact.
[INFO] Processing sources for module project: group:artifact:jar:version
[DEBUG] module source directory is: /src
[DEBUG] module dest directory is: artifact/ (assembly basedir may be prepended)
[DEBUG] FileSet[artifact/] dir perms: -1 file perms: -1
[DEBUG] The archive base directory is '/var/tmp/module-set-phase.test.1201787832511'
Tests run: 28, Failures: 0, Errors: 0, Skipped: 0, Time elapsed: 1.208 sec
Running org.apache.maven.plugin.assembly.utils.PropertyUtilsTest
Tests run: 9, Failures: 0, Errors: 0, Skipped: 0, Time elapsed: 0.129 sec
Running org.apache.maven.plugin.assembly.utils.AssemblyFormatUtilsTest
Tests run: 43, Failures: 0, Errors: 0, Skipped: 0, Time elapsed: 0.522 sec
Running org.apache.maven.plugin.assembly.archive.phase.RepositoryAssemblyPhaseTest
[DEBUG] Assembling repository to: /var/tmp/repository-phase.test.1201787833520/out
[DEBUG] Finished assembling repository to: /var/tmp/repository-phase.test.1201787833520/out
Tests run: 2, Failures: 0, Errors: 0, Skipped: 0, Time elapsed: 0.1 sec
Running org.apache.maven.plugin.assembly.format.FileFormatterTest
[INFO] Initializing assembly filters...
[INFO] Initializing assembly filters...
[INFO] Initializing assembly filters...
[INFO] Initializing assembly filters...
[INFO] Initializing assembly filters...
Tests run: 9, Failures: 0, Errors: 0, Skipped: 0, Time elapsed: 0.69 sec
Running org.apache.maven.plugin.assembly.archive.task.AddDirectoryTaskTest
Tests run: 4, Failures: 0, Errors: 0, Skipped: 0, Time elapsed: 0.123 sec
Running org.apache.maven.plugin.assembly.archive.task.AddFileSetsTaskTest
[DEBUG] FileSet[dir2] dir perms: -1 file perms: -1
[DEBUG] The archive base directory is '/var/tmp/add-fileset.test.1201787834710'
[DEBUG] Adding file-set from directory: '/var/tmp/add-fileset.test.1201787834710/dir'
assembly output directory is: 'dir2/'
[DEBUG] FileSet[dir] dir perms: -1 file perms: -1
[DEBUG] The archive base directory is '/var/tmp/add-fileset.test.1201787834780'
[DEBUG] Adding file-set from directory: '/var/tmp/add-fileset.test.1201787834780/dir'
assembly output directory is: 'dir/'
[DEBUG] FileSet[dir] dir perms: -1 file perms: -1
[DEBUG] The archive base directory is '/var/tmp/add-fileset.test.1201787834850'
Tests run: 9, Failures: 0, Errors: 0, Skipped: 0, Time elapsed: 0.555 sec
Running org.apache.maven.plugin.assembly.utils.FilterUtilsTest
[DEBUG] group:artifact:type:version was removed by one or more filters.
[DEBUG] Statistics for Includes filter:
o 'other.group:other-artifact:type:version'

[WARNING] The following patterns were never triggered in this artifact inclusion filter:
o  'other.group:other-artifact:type:version'

[DEBUG] The following artifacts were removed by this artifact inclusion filter: 
group:artifact:type:version
[DEBUG] Statistics for Includes filter:
o 'group:artifact'

[DEBUG] Statistics for Includes filter:
o 'group:artifact:jar'

[DEBUG] Statistics for Includes filter:
o 'group:dependentArtifact'

[DEBUG] group:artifact:version:null:jar was removed by one or more filters.
[DEBUG] Statistics for Excludes filter:
o 'group:dependentArtifact'

[DEBUG] The following artifacts were removed by this artifact exclusion filter: 
group:artifact:version:null:jar
[DEBUG] group:artifact:version:null:jar was removed by one or more filters.
[DEBUG] Statistics for Excludes filter:
o 'group:artifact'

[DEBUG] The following artifacts were removed by this artifact exclusion filter: 
group:artifact:version:null:jar
[DEBUG] group:artifact:version:null:jar was removed by one or more filters.
[DEBUG] Statistics for Excludes filter:
o 'group:artifact:jar'

[DEBUG] The following artifacts were removed by this artifact exclusion filter: 
group:artifact:version:null:jar
[DEBUG] group:artifact:version:null:jar was removed by one or more filters.
[DEBUG] Statistics for Includes filter:
o 'fail:fail'

[WARNING] The following patterns were never triggered in this artifact inclusion filter:
o  'fail:fail'

Tests run: 12, Failures: 0, Errors: 0, Skipped: 0, Time elapsed: 0.019 sec
Running org.apache.maven.plugin.assembly.utils.PropertiesInterpolationValueSourceTest
Tests run: 3, Failures: 0, Errors: 0, Skipped: 0, Time elapsed: 0.004 sec
Running org.apache.maven.plugin.assembly.archive.DefaultAssemblyArchiverTest
[DEBUG] All known ContainerDescritporHandler components: none; map is null.
Tests run: 9, Failures: 0, Errors: 0, Skipped: 0, Time elapsed: 0.114 sec
Running org.apache.maven.plugin.assembly.archive.task.AddDependencySetsTaskTest
[INFO] Processing DependencySet (output=tmp/)
[DEBUG] Filtering dependency artifacts WITHOUT transitive dependency path information.
[DEBUG] Adding 1 dependency artifacts.
[DEBUG] Adding artifact: org.depgrp:dep:1:war with file: /var/tmp/ArtifactMock.test.36998 to assembly location: tmp/dep-1.war.
[WARNING] The mode: 12 contains nonsensical permissions:
- World has write access, but user does not.
- World has write access, but group does not.
- Group has execute/list access, but user does not.
[INFO] Processing DependencySet (output=/out)
[WARNING] Cannot include project artifact: null; it doesn't have an associated file or directory.
[DEBUG] Filtering dependency artifacts WITHOUT transitive dependency path information.
[DEBUG] Adding 0 dependency artifacts.
[INFO] Processing DependencySet (output=out)
[WARNING] Cannot include project artifact: null; it doesn't have an associated file or directory.
[DEBUG] Filtering dependency artifacts WITHOUT transitive dependency path information.
[DEBUG] Adding 1 dependency artifacts.
[DEBUG] Adding artifact: group:artifact:version:jar with file: /var/tmp/ArtifactMock.test.36999 to assembly location: out/artifact.
[WARNING] The mode: 12 contains nonsensical permissions:
- World has write access, but user does not.
- World has write access, but group does not.
- Group has execute/list access, but user does not.
[INFO] Processing DependencySet (output=out)
[WARNING] Cannot include project artifact: null; it doesn't have an associated file or directory.
[DEBUG] Filtering dependency artifacts WITHOUT transitive dependency path information.
[DEBUG] Adding 1 dependency artifacts.
[DEBUG] Unpacking artifact: group:artifact:version:jar to assembly location: out/.
[WARNING] The mode: 12 contains nonsensical permissions:
- World has write access, but user does not.
- World has write access, but group does not.
- Group has execute/list access, but user does not.
[WARNING] The mode: 12 contains nonsensical permissions:
- World has write access, but user does not.
- World has write access, but group does not.
- Group has execute/list access, but user does not.
[DEBUG] Unpacking artifact contents for: EasyMock for interface org.apache.maven.artifact.Artifact to: out/
[WARNING] Cannot include project artifact: null; it doesn't have an associated file or directory.
[DEBUG] Filtering dependency artifacts WITHOUT transitive dependency path information.
[WARNING] Cannot include project artifact: null; it doesn't have an associated file or directory.
[DEBUG] Filtering dependency artifacts USING transitive dependency path information.
[DEBUG] group2:artifact2:1.0 was removed by one or more filters.
[DEBUG] Statistics for Includes filter:
o 'group:artifact'

[DEBUG] The following artifacts were removed by this artifact inclusion filter: 
group2:artifact2:1.0
[WARNING] Cannot include project artifact: null; it doesn't have an associated file or directory.
[DEBUG] Filtering dependency artifacts WITHOUT transitive dependency path information.
[DEBUG] group2:artifact2:1.0 was removed by one or more filters.
[DEBUG] Statistics for Includes filter:
o 'group:artifact'

[DEBUG] The following artifacts were removed by this artifact inclusion filter: 
group2:artifact2:1.0
Tests run: 7, Failures: 0, Errors: 0, Skipped: 0, Time elapsed: 0.161 sec
Running org.apache.maven.plugin.assembly.utils.AssemblyFileUtilsTest
Tests run: 9, Failures: 0, Errors: 0, Skipped: 0, Time elapsed: 0.043 sec
Running org.apache.maven.plugin.assembly.filter.ComponentsXmlArchiverFileFilterTest
[INFO] Building zip: /var/tmp/componentsXmlArchiverFileFilter.test37009.zip
Tests run: 7, Failures: 0, Errors: 0, Skipped: 0, Time elapsed: 0.303 sec
Running org.apache.maven.plugin.assembly.io.DefaultAssemblyReaderTest
[INFO] Adding site directory to assembly : /var/tmp/assembly-reader.test.1201787835620
[INFO] Adding site directory to assembly : /var/tmp/assembly-reader.test.1201787835820
[INFO] Adding site directory to assembly : /var/tmp/assembly-reader.test.1201787835900
[INFO] Reading assembly descriptor: /var/tmp/assembly-reader.test.1201787836340/test.xml
[INFO] Reading assembly descriptor: /var/tmp/assembly-reader.test.1201787836340/test2.xml
Tests run: 21, Failures: 0, Errors: 0, Skipped: 0, Time elapsed: 1.047 sec
Running org.apache.maven.plugin.assembly.format.FileSetFormatterTest
[INFO] No files selected for line-ending conversion. Skipping: /var/tmp/fileSetFormatter-test.1201787836720
[INFO] Initializing assembly filters...
[INFO] Initializing assembly filters...
Tests run: 8, Failures: 0, Errors: 0, Skipped: 0, Time elapsed: 1.518 sec
Running org.apache.maven.plugin.assembly.archive.archiver.AssemblyProxyArchiverTest
[DEBUG] Adding file: /var/tmp/massembly-proxyArchiver37017 to archive location: file.txt
[DEBUG] Adding directory file-set in: /var/tmp/massembly-proxyArchiver1201787838180 to archive location: 
Tests run: 2, Failures: 0, Errors: 0, Skipped: 0, Time elapsed: 0.163 sec
Running org.apache.maven.plugin.assembly.interpolation.AssemblyInterpolatorTest
Tests run: 6, Failures: 0, Errors: 0, Skipped: 0, Time elapsed: 0.084 sec
Running org.apache.maven.plugin.assembly.archive.phase.FileItemAssemblyPhaseTest
Tests run: 6, Failures: 0, Errors: 0, Skipped: 0, Time elapsed: 0.774 sec
Running org.apache.maven.plugin.assembly.utils.ProjectUtilsTest
[WARNING] Cannot compute whether testGroup:test:jar:1.0 is a module of: testGroup:test:jar:1.0; it does not have an associated POM file on the local filesystem.
Tests run: 5, Failures: 0, Errors: 0, Skipped: 0, Time elapsed: 0.012 sec
Running org.apache.maven.plugin.assembly.archive.task.AddArtifactTaskTest
[DEBUG] Adding artifact: group:artifact:version:jar with file: /var/tmp/ArtifactMock.test.37019 to assembly location: artifact.
[DEBUG] Adding artifact: group:myArtifact:1:jar with file: /var/tmp/ArtifactMock.test.37020 to assembly location: tmp/myArtifact-1.jar.
[DEBUG] Unpacking artifact: group:artifact:version:jar to assembly location: .
[DEBUG] Unpacking artifact contents for: EasyMock for interface org.apache.maven.artifact.Artifact to: 
[DEBUG] Unpacking artifact: group:artifact:version:jar to assembly location: .
[DEBUG] Unpacking artifact contents for: EasyMock for interface org.apache.maven.artifact.Artifact to: 
[DEBUG] Unpacking artifact: group:artifact:version:jar to assembly location: .
[DEBUG] Unpacking artifact contents for: EasyMock for interface org.apache.maven.artifact.Artifact to: 
Tests run: 5, Failures: 0, Errors: 0, Skipped: 0, Time elapsed: 0.098 sec
Running org.apache.maven.plugin.assembly.utils.TypeConversionUtilsTest
Tests run: 6, Failures: 0, Errors: 0, Skipped: 0, Time elapsed: 0.01 sec
Running org.apache.maven.plugin.assembly.archive.phase.DependencySetAssemblyPhaseTest
On test setup, hashcode for dependency artifact: 31753535
[DEBUG] Project group:project:jar:0 has no dependencies. Skipping dependency set addition.
[INFO] Processing DependencySet (output=/out)
[DEBUG] Filtering dependency artifacts WITHOUT transitive dependency path information.
[DEBUG] Adding 1 dependency artifacts.
[DEBUG] Adding artifact: group:dep:1:jar with file: /var/tmp/ArtifactMock.test.37024 to assembly location: out/dep.
[WARNING] The mode: 12 contains nonsensical permissions:
- World has write access, but user does not.
- World has write access, but group does not.
- Group has execute/list access, but user does not.
[DEBUG] No dependency sets specified.
Tests run: 2, Failures: 0, Errors: 0, Skipped: 0, Time elapsed: 0.047 sec
Running org.apache.maven.plugin.assembly.archive.phase.FileSetAssemblyPhaseTest
Tests run: 2, Failures: 0, Errors: 0, Skipped: 0, Time elapsed: 0.106 sec
Running org.apache.maven.plugin.assembly.archive.ManifestCreationFinalizerTest
[INFO] Building jar: /var/tmp/manifest-finalizer.test.37025.jar
Tests run: 3, Failures: 0, Errors: 0, Skipped: 0, Time elapsed: 0.105 sec

Results :

Tests run: 217, Failures: 0, Errors: 0, Skipped: 0

[INFO] [jar:jar]
[INFO] Building jar: /export/home/build/data/continuum/checkouts/5/target/maven-assembly-plugin-2.2-beta-2-SNAPSHOT.jar
[INFO] [plugin:addPluginArtifactMetadata]
[INFO] [component-it:stage {execution: stage-artifact-types}]
Using target/it-build-target and target/it-build-target/classes to build IT version of plugin
Using staged plugin-pom: /export/home/build/data/continuum/checkouts/5/maven-assembly-artifact-types/pom-testing.xml
Using IT Plugin Jar: /export/home/build/data/continuum/checkouts/5/maven-assembly-artifact-types/target/it-build-target/maven-assembly-artifact-types-testing.jar
[INFO] Installing /export/home/build/data/continuum/checkouts/5/maven-assembly-artifact-types/target/it-build-target/maven-assembly-artifact-types-testing.jar to /export/home/build/data/continuum/checkouts/5/target/local-repository/org/apache/maven/plugins/maven-assembly-artifact-types/testing/maven-assembly-artifact-types-testing.jar
[INFO] Installing /export/home/build/data/continuum/checkouts/5/maven-assembly-artifact-types/../pom.xml to /export/home/build/data/continuum/checkouts/5/target/local-repository/org/apache/maven/plugins/maven-assembly-plugin/2.2-beta-2-SNAPSHOT/maven-assembly-plugin-2.2-beta-2-SNAPSHOT.pom
[INFO] [component-it:stage {execution: stage-plugin}]
Using target/it-build-target and target/it-build-target/classes to build IT version of plugin
Using staged plugin-pom: /export/home/build/data/continuum/checkouts/5/pom-testing.xml
Using IT Plugin Jar: /export/home/build/data/continuum/checkouts/5/target/it-build-target/maven-assembly-plugin-testing.jar
[INFO] Installing /export/home/build/data/continuum/checkouts/5/target/it-build-target/maven-assembly-plugin-testing.jar to /export/home/build/data/continuum/checkouts/5/target/local-repository/org/apache/maven/plugins/maven-assembly-plugin/testing/maven-assembly-plugin-testing.jar
[INFO] [invoker:run {execution: setup-integration-test-parent}]
[INFO] Building: pom.xml
[INFO] [INFO] Scanning for projects...
[INFO] [INFO] ----------------------------------------------------------------------------
[INFO] [INFO] Building Unnamed - org.apache.maven.plugin.assembly.test:it-project-parent:pom:1
[INFO] [INFO]    task-segment: [install]
[INFO] [INFO] ----------------------------------------------------------------------------
[INFO] [INFO] artifact org.apache.maven.plugins:maven-site-plugin: checking for updates from main.local.as.remote
[INFO] [INFO] artifact org.apache.maven.plugins:maven-site-plugin: checking for updates from integration.test.repo
[INFO] [INFO] artifact org.apache.maven.plugins:maven-site-plugin: checking for updates from central
[INFO] Downloading: http://repo1.maven.org/maven2/org/apache/maven/plugins/maven-site-plugin/2.0-beta-6/maven-site-plugin-2.0-beta-6.pom
[INFO] 10K downloaded
[INFO] Downloading: file:///export/home/build/.m2/repository/org/apache/maven/plugins/maven-plugins/10/maven-plugins-10.pom
[INFO] 7K downloaded
[INFO] Downloading: file:///export/home/build/.m2/repository/org/apache/maven/maven-parent/7/maven-parent-7.pom
[INFO] 20K downloaded
[INFO] Downloading: file:///export/home/build/.m2/repository/org/apache/apache/4/apache-4.pom
[INFO] 4K downloaded
[INFO] Downloading: file:///export/home/build/.m2/repository/org/apache/maven/plugins/maven-site-plugin/2.0-beta-6/maven-site-plugin-2.0-beta-6.jar
[INFO] 118K downloaded
[INFO] [INFO] artifact org.apache.maven.plugins:maven-install-plugin: checking for updates from main.local.as.remote
[INFO] [INFO] artifact org.apache.maven.plugins:maven-install-plugin: checking for updates from integration.test.repo
[INFO] [INFO] artifact org.apache.maven.plugins:maven-install-plugin: checking for updates from central
[INFO] Downloading: http://repo1.maven.org/maven2/org/apache/maven/plugins/maven-install-plugin/2.2/maven-install-plugin-2.2.pom
[INFO] 2K downloaded
[INFO] Downloading: file:///export/home/build/.m2/repository/org/apache/maven/plugins/maven-plugins/8/maven-plugins-8.pom
[INFO] 5K downloaded
[INFO] Downloading: file:///export/home/build/.m2/repository/org/apache/maven/maven-parent/5/maven-parent-5.pom
[INFO] 14K downloaded
[INFO] Downloading: file:///export/home/build/.m2/repository/org/apache/apache/3/apache-3.pom
[INFO] 3K downloaded
[INFO] Downloading: file:///export/home/build/.m2/repository/org/apache/maven/plugins/maven-install-plugin/2.2/maven-install-plugin-2.2.jar
[INFO] 15K downloaded
[INFO] Downloading: file:///export/home/build/.m2/repository/org/apache/maven/maven-artifact/2.0.2/maven-artifact-2.0.2.pom
[INFO] 765b downloaded
[INFO] Downloading: file:///export/home/build/.m2/repository/org/apache/maven/maven/2.0.2/maven-2.0.2.pom
[INFO] 12K downloaded
[INFO] Downloading: file:///export/home/build/.m2/repository/org/codehaus/plexus/plexus-utils/1.1/plexus-utils-1.1.pom
[INFO] 767b downloaded
[INFO] Downloading: file:///export/home/build/.m2/repository/org/codehaus/plexus/plexus/1.0.4/plexus-1.0.4.pom
[INFO] 5K downloaded
[INFO] Downloading: file:///export/home/build/.m2/repository/org/mortbay/jetty/jetty/6.1.5/jetty-6.1.5.pom
[INFO] 4K downloaded
[INFO] Downloading: file:///export/home/build/.m2/repository/org/mortbay/jetty/project/6.1.5/project-6.1.5.pom
[INFO] 12K downloaded
[INFO] Downloading: file:///export/home/build/.m2/repository/org/mortbay/jetty/jetty-util/6.1.5/jetty-util-6.1.5.pom
[INFO] 3K downloaded
[INFO] Downloading: file:///export/home/build/.m2/repository/org/mortbay/jetty/servlet-api-2.5/6.1.5/servlet-api-2.5-6.1.5.pom
[INFO] 3K downloaded
[INFO] Downloading: file:///export/home/build/.m2/repository/org/codehaus/plexus/plexus-container-default/1.0-alpha-9/plexus-container-default-1.0-alpha-9.pom
[INFO] 1K downloaded
[INFO] Downloading: file:///export/home/build/.m2/repository/org/codehaus/plexus/plexus-containers/1.0.3/plexus-containers-1.0.3.pom
[INFO] 492b downloaded
[INFO] Downloading: file:///export/home/build/.m2/repository/junit/junit/3.8.1/junit-3.8.1.pom
[INFO] 998b downloaded
[INFO] Downloading: file:///export/home/build/.m2/repository/org/codehaus/plexus/plexus-utils/1.0.4/plexus-utils-1.0.4.pom
[INFO] 6K downloaded
[INFO] Downloading: file:///export/home/build/.m2/repository/classworlds/classworlds/1.1-alpha-2/classworlds-1.1-alpha-2.pom
[INFO] 3K downloaded
[INFO] Downloading: file:///export/home/build/.m2/repository/org/apache/maven/maven-model/2.0.2/maven-model-2.0.2.pom
[INFO] 2K downloaded
[INFO] Downloading: file:///export/home/build/.m2/repository/org/apache/maven/doxia/doxia-site-renderer/1.0-alpha-10/doxia-site-renderer-1.0-alpha-10.pom
[INFO] 4K downloaded
[INFO] Downloading: file:///export/home/build/.m2/repository/org/apache/maven/doxia/doxia-sitetools/1.0-alpha-10/doxia-sitetools-1.0-alpha-10.pom
[INFO] 7K downloaded
[INFO] Downloading: file:///export/home/build/.m2/repository/org/apache/maven/maven-parent/6/maven-parent-6.pom
[INFO] 19K downloaded
[INFO] Downloading: file:///export/home/build/.m2/repository/org/apache/maven/doxia/doxia-core/1.0-alpha-10/doxia-core-1.0-alpha-10.pom
[INFO] 2K downloaded
[INFO] Downloading: file:///export/home/build/.m2/repository/org/apache/maven/doxia/doxia/1.0-alpha-10/doxia-1.0-alpha-10.pom
[INFO] 8K downloaded
[INFO] Downloading: file:///export/home/build/.m2/repository/org/apache/maven/doxia/doxia-sink-api/1.0-alpha-10/doxia-sink-api-1.0-alpha-10.pom
[INFO] 1K downloaded
[INFO] Downloading: file:///export/home/build/.m2/repository/org/codehaus/plexus/plexus-utils/1.4.5/plexus-utils-1.4.5.pom
[INFO] 2K downloaded
[INFO] Downloading: file:///export/home/build/.m2/repository/org/codehaus/plexus/plexus/1.0.11/plexus-1.0.11.pom
[INFO] 8K downloaded
[INFO] Downloading: file:///export/home/build/.m2/repository/org/codehaus/plexus/plexus-i18n/1.0-beta-7/plexus-i18n-1.0-beta-7.pom
[INFO] 1K downloaded
[INFO] Downloading: file:///export/home/build/.m2/repository/org/codehaus/plexus/plexus-components/1.1.12/plexus-components-1.1.12.pom
[INFO] 2K downloaded
[INFO] Downloading: file:///export/home/build/.m2/repository/org/codehaus/plexus/plexus/1.0.10/plexus-1.0.10.pom
[INFO] 8K downloaded
[INFO] Downloading: file:///export/home/build/.m2/repository/org/codehaus/plexus/plexus-utils/1.4.1/plexus-utils-1.4.1.pom
[INFO] 1K downloaded
[INFO] Downloading: file:///export/home/build/.m2/repository/org/codehaus/plexus/plexus-velocity/1.1.7/plexus-velocity-1.1.7.pom
[INFO] 1K downloaded
[INFO] Downloading: file:///export/home/build/.m2/repository/org/apache/velocity/velocity/1.5/velocity-1.5.pom
[INFO] 7K downloaded
[INFO] Downloading: file:///export/home/build/.m2/repository/commons-collections/commons-collections/3.1/commons-collections-3.1.pom
[INFO] 5K downloaded
[INFO] Downloading: file:///export/home/build/.m2/repository/commons-lang/commons-lang/2.1/commons-lang-2.1.pom
[INFO] 9K downloaded
[INFO] Downloading: file:///export/home/build/.m2/repository/oro/oro/2.0.8/oro-2.0.8.pom
[INFO] 140b downloaded
[INFO] Downloading: file:///export/home/build/.m2/repository/org/apache/maven/doxia/doxia-decoration-model/1.0-alpha-10/doxia-decoration-model-1.0-alpha-10.pom
[INFO] 2K downloaded
[INFO] Downloading: file:///export/home/build/.m2/repository/commons-collections/commons-collections/3.2/commons-collections-3.2.pom
[INFO] 10K downloaded
[INFO] Downloading: file:///export/home/build/.m2/repository/org/apache/maven/doxia/doxia-module-apt/1.0-alpha-10/doxia-module-apt-1.0-alpha-10.pom
[INFO] 2K downloaded
[INFO] Downloading: file:///export/home/build/.m2/repository/org/apache/maven/doxia/doxia-modules/1.0-alpha-10/doxia-modules-1.0-alpha-10.pom
[INFO] 2K downloaded
[INFO] Downloading: file:///export/home/build/.m2/repository/org/apache/maven/doxia/doxia-module-fml/1.0-alpha-10/doxia-module-fml-1.0-alpha-10.pom
[INFO] 2K downloaded
[INFO] Downloading: file:///export/home/build/.m2/repository/org/apache/maven/doxia/doxia-module-xdoc/1.0-alpha-10/doxia-module-xdoc-1.0-alpha-10.pom
[INFO] 2K downloaded
[INFO] Downloading: file:///export/home/build/.m2/repository/org/apache/maven/doxia/doxia-module-xhtml/1.0-alpha-10/doxia-module-xhtml-1.0-alpha-10.pom
[INFO] 1K downloaded
[INFO] Downloading: file:///export/home/build/.m2/repository/org/apache/maven/maven-settings/2.0/maven-settings-2.0.pom
[INFO] 1K downloaded
[INFO] Downloading: file:///export/home/build/.m2/repository/org/apache/maven/maven/2.0/maven-2.0.pom
[INFO] 8K downloaded
[INFO] Downloading: file:///export/home/build/.m2/repository/org/apache/maven/maven-model/2.0/maven-model-2.0.pom
[INFO] 2K downloaded
[INFO] Downloading: file:///export/home/build/.m2/repository/org/codehaus/plexus/plexus-container-default/1.0-alpha-8/plexus-container-default-1.0-alpha-8.pom
[INFO] 7K downloaded
[INFO] Downloading: file:///export/home/build/.m2/repository/org/codehaus/plexus/plexus-archiver/1.0-alpha-7/plexus-archiver-1.0-alpha-7.pom
[INFO] 1K downloaded
[INFO] Downloading: file:///export/home/build/.m2/repository/org/codehaus/plexus/plexus-components/1.1.6/plexus-components-1.1.6.pom
[INFO] 1K downloaded
[INFO] Downloading: file:///export/home/build/.m2/repository/org/codehaus/plexus/plexus/1.0.8/plexus-1.0.8.pom
[INFO] 7K downloaded
[INFO] Downloading: file:///export/home/build/.m2/repository/org/codehaus/plexus/plexus-utils/1.2/plexus-utils-1.2.pom
[INFO] 767b downloaded
[INFO] Downloading: file:///export/home/build/.m2/repository/org/codehaus/plexus/plexus/1.0.5/plexus-1.0.5.pom
[INFO] 5K downloaded
[INFO] Downloading: file:///export/home/build/.m2/repository/org/apache/maven/maven-artifact-manager/2.0.2/maven-artifact-manager-2.0.2.pom
[INFO] 1K downloaded
[INFO] Downloading: file:///export/home/build/.m2/repository/org/apache/maven/maven-repository-metadata/2.0.2/maven-repository-metadata-2.0.2.pom
[INFO] 1K downloaded
[INFO] Downloading: file:///export/home/build/.m2/repository/org/apache/maven/wagon/wagon-provider-api/1.0-alpha-6/wagon-provider-api-1.0-alpha-6.pom
[INFO] 588b downloaded
[INFO] Downloading: file:///export/home/build/.m2/repository/org/apache/maven/wagon/wagon/1.0-alpha-6/wagon-1.0-alpha-6.pom
[INFO] 6K downloaded
[INFO] Downloading: file:///export/home/build/.m2/repository/org/apache/maven/reporting/maven-reporting-api/2.0.4/maven-reporting-api-2.0.4.pom
[INFO] 902b downloaded
[INFO] Downloading: file:///export/home/build/.m2/repository/org/apache/maven/reporting/maven-reporting/2.0.4/maven-reporting-2.0.4.pom
[INFO] 700b downloaded
[INFO] Downloading: file:///export/home/build/.m2/repository/org/apache/maven/maven/2.0.4/maven-2.0.4.pom
[INFO] 11K downloaded
[INFO] Downloading: file:///export/home/build/.m2/repository/org/apache/maven/doxia/doxia-sink-api/1.0-alpha-7/doxia-sink-api-1.0-alpha-7.pom
[INFO] 424b downloaded
[INFO] Downloading: file:///export/home/build/.m2/repository/org/apache/maven/doxia/doxia/1.0-alpha-7/doxia-1.0-alpha-7.pom
[INFO] 3K downloaded
[INFO] Downloading: file:///export/home/build/.m2/repository/org/apache/maven/maven-project/2.0/maven-project-2.0.pom
[INFO] 1K downloaded
[INFO] Downloading: file:///export/home/build/.m2/repository/org/apache/maven/maven-profile/2.0/maven-profile-2.0.pom
[INFO] 1K downloaded
[INFO] Downloading: file:///export/home/build/.m2/repository/org/apache/maven/maven-artifact-manager/2.0/maven-artifact-manager-2.0.pom
[INFO] 1K downloaded
[INFO] Downloading: file:///export/home/build/.m2/repository/org/apache/maven/maven-artifact/2.0/maven-artifact-2.0.pom
[INFO] 723b downloaded
[INFO] Downloading: file:///export/home/build/.m2/repository/org/apache/maven/maven-plugin-api/2.0/maven-plugin-api-2.0.pom
[INFO] 601b downloaded
[INFO] Downloading: file:///export/home/build/.m2/repository/org/apache/maven/wagon/wagon-provider-api/1.0-beta-2/wagon-provider-api-1.0-beta-2.pom
[INFO] 680b downloaded
[INFO] Downloading: file:///export/home/build/.m2/repository/org/apache/maven/wagon/wagon/1.0-beta-2/wagon-1.0-beta-2.pom
[INFO] 5K downloaded
[INFO] Downloading: file:///export/home/build/.m2/repository/org/apache/maven/maven-parent/4/maven-parent-4.pom
[INFO] 9K downloaded
[INFO] Downloading: file:///export/home/build/.m2/repository/org/apache/maven/doxia/doxia-core/1.0-alpha-10/doxia-core-1.0-alpha-10.jar
[INFO] 53K downloaded
[INFO] Downloading: file:///export/home/build/.m2/repository/org/apache/velocity/velocity/1.5/velocity-1.5.jar
[INFO] 382K downloaded
[INFO] Downloading: file:///export/home/build/.m2/repository/org/mortbay/jetty/servlet-api-2.5/6.1.5/servlet-api-2.5-6.1.5.jar
[INFO] 129K downloaded
[INFO] Downloading: file:///export/home/build/.m2/repository/org/mortbay/jetty/jetty-util/6.1.5/jetty-util-6.1.5.jar
[INFO] 134K downloaded
[INFO] Downloading: file:///export/home/build/.m2/repository/org/apache/maven/doxia/doxia-decoration-model/1.0-alpha-10/doxia-decoration-model-1.0-alpha-10.jar
[INFO] 48K downloaded
[INFO] Downloading: file:///export/home/build/.m2/repository/oro/oro/2.0.8/oro-2.0.8.jar
[INFO] 63K downloaded
[INFO] Downloading: file:///export/home/build/.m2/repository/org/apache/maven/doxia/doxia-site-renderer/1.0-alpha-10/doxia-site-renderer-1.0-alpha-10.jar
[INFO] 44K downloaded
[INFO] Downloading: file:///export/home/build/.m2/repository/org/apache/maven/doxia/doxia-module-fml/1.0-alpha-10/doxia-module-fml-1.0-alpha-10.jar
[INFO] 17K downloaded
[INFO] Downloading: file:///export/home/build/.m2/repository/commons-lang/commons-lang/2.1/commons-lang-2.1.jar
[INFO] 202K downloaded
[INFO] Downloading: file:///export/home/build/.m2/repository/commons-collections/commons-collections/3.2/commons-collections-3.2.jar
[INFO] 557K downloaded
[INFO] Downloading: file:///export/home/build/.m2/repository/org/apache/maven/doxia/doxia-module-xdoc/1.0-alpha-10/doxia-module-xdoc-1.0-alpha-10.jar
[INFO] 26K downloaded
[INFO] Downloading: file:///export/home/build/.m2/repository/org/codehaus/plexus/plexus-i18n/1.0-beta-7/plexus-i18n-1.0-beta-7.jar
[INFO] 10K downloaded
[INFO] Downloading: file:///export/home/build/.m2/repository/org/codehaus/plexus/plexus-velocity/1.1.7/plexus-velocity-1.1.7.jar
[INFO] 7K downloaded
[INFO] Downloading: file:///export/home/build/.m2/repository/org/codehaus/plexus/plexus-utils/1.4.5/plexus-utils-1.4.5.jar
[INFO] 200K downloaded
[INFO] Downloading: file:///export/home/build/.m2/repository/org/mortbay/jetty/jetty/6.1.5/jetty-6.1.5.jar
[INFO] 474K downloaded
[INFO] Downloading: file:///export/home/build/.m2/repository/org/codehaus/plexus/plexus-archiver/1.0-alpha-7/plexus-archiver-1.0-alpha-7.jar
[INFO] 138K downloaded
[INFO] Downloading: file:///export/home/build/.m2/repository/org/apache/maven/doxia/doxia-module-xhtml/1.0-alpha-10/doxia-module-xhtml-1.0-alpha-10.jar
[INFO] 20K downloaded
[INFO] Downloading: file:///export/home/build/.m2/repository/org/apache/maven/doxia/doxia-module-apt/1.0-alpha-10/doxia-module-apt-1.0-alpha-10.jar
[INFO] 45K downloaded
[INFO] [INFO] [site:attach-descriptor]
[INFO] Downloading: file:///export/home/build/.m2/repository/org/apache/maven/maven-project/2.0.6/maven-project-2.0.6.pom
[INFO] 2K downloaded
[INFO] Downloading: file:///export/home/build/.m2/repository/org/apache/maven/maven/2.0.6/maven-2.0.6.pom
[INFO] 8K downloaded
[INFO] [WARNING] *** CHECKSUM FAILED - Error retrieving checksum file for org/apache/maven/maven/2.0.6/maven-2.0.6.pom - IGNORING
[INFO] Downloading: file:///export/home/build/.m2/repository/org/apache/maven/maven-settings/2.0.6/maven-settings-2.0.6.pom
[INFO] 1K downloaded
[INFO] Downloading: file:///export/home/build/.m2/repository/org/apache/maven/maven-model/2.0.6/maven-model-2.0.6.pom
[INFO] 2K downloaded
[INFO] Downloading: file:///export/home/build/.m2/repository/org/codehaus/plexus/plexus-container-default/1.0-alpha-9-stable-1/plexus-container-default-1.0-alpha-9-stable-1.pom
[INFO] 3K downloaded
[INFO] Downloading: file:///export/home/build/.m2/repository/org/apache/maven/maven-profile/2.0.6/maven-profile-2.0.6.pom
[INFO] 1K downloaded
[INFO] Downloading: file:///export/home/build/.m2/repository/org/apache/maven/maven-artifact-manager/2.0.6/maven-artifact-manager-2.0.6.pom
[INFO] 2K downloaded
[INFO] Downloading: file:///export/home/build/.m2/repository/org/apache/maven/maven-repository-metadata/2.0.6/maven-repository-metadata-2.0.6.pom
[INFO] 1K downloaded
[INFO] Downloading: file:///export/home/build/.m2/repository/org/apache/maven/maven-artifact/2.0.6/maven-artifact-2.0.6.pom
[INFO] 1K downloaded
[INFO] Downloading: file:///export/home/build/.m2/repository/org/apache/maven/maven-plugin-registry/2.0.6/maven-plugin-registry-2.0.6.pom
[INFO] 1K downloaded
[INFO] Downloading: file:///export/home/build/.m2/repository/org/codehaus/plexus/plexus-digest/1.0/plexus-digest-1.0.pom
[INFO] 1K downloaded
[INFO] Downloading: file:///export/home/build/.m2/repository/org/codehaus/plexus/plexus-components/1.1.7/plexus-components-1.1.7.pom
[INFO] 4K downloaded
[INFO] Downloading: file:///export/home/build/.m2/repository/org/apache/maven/maven-plugin-api/2.0.6/maven-plugin-api-2.0.6.pom
[INFO] 1K downloaded
[INFO] Downloading: file:///export/home/build/.m2/repository/org/codehaus/plexus/plexus-utils/1.1/plexus-utils-1.1.jar
[INFO] 164K downloaded
[INFO] Downloading: file:///export/home/build/.m2/repository/org/codehaus/plexus/plexus-digest/1.0/plexus-digest-1.0.jar
[INFO] 11K downloaded
[INFO] [INFO] [install:install]
[INFO] [INFO] Installing /export/home/build/data/continuum/checkouts/5/target/test-classes/it-project-parent/interpolated-pom.xml to /export/home/build/data/continuum/checkouts/5/target/local-repository/org/apache/maven/plugin/assembly/test/it-project-parent/1/it-project-parent-1.pom
[INFO] [INFO] ------------------------------------------------------------------------
[INFO] [INFO] BUILD SUCCESSFUL
[INFO] [INFO] ------------------------------------------------------------------------
[INFO] [INFO] Total time: 23 seconds
[INFO] [INFO] Finished at: Thu Jan 31 14:00:11 GMT+00:00 2008
[INFO] [INFO] Final Memory: 7M/13M
[INFO] [INFO] ------------------------------------------------------------------------
[INFO] [invoker:run {execution: integration-test}]
[INFO] Building: forking-tests/assembly-attached-with-module-binaries/pom.xml
[INFO] ...FAILED[code=1]. See /export/home/build/data/continuum/checkouts/5/target/test-classes/projects/forking-tests/assembly-attached-with-module-binaries/build.log for details.
[INFO] Building: forking-tests/assembly-assembly-with-module-binaries/pom.xml
[INFO] ...FAILED[code=1]. See /export/home/build/data/continuum/checkouts/5/target/test-classes/projects/forking-tests/assembly-assembly-with-module-binaries/build.log for details.
[INFO] Building: multimodule/two-levels-includeBaseDirectory-withSources/pom.xml
[INFO] ...SUCCESS.
[INFO] Building: multimodule/twoLevel-includeSubModules-excludeSubModuleSourceDirs/pom.xml
[INFO] ...SUCCESS.
[INFO] Building: multimodule/two-level-multimodule-dontIncludeSubModules/pom.xml
[INFO] ...SUCCESS.
[INFO] Building: multimodule/two-levels-includeBaseDirectory-withBinaries/pom.xml
[INFO] ...SUCCESS.
[INFO] Building: multimodule/twoLevel-dontIncludeSubModules-artifactIdExprOutDir/pom.xml
[INFO] ...SUCCESS.
[INFO] Building: multimodule/two-level-multimodule/pom.xml
[INFO] ...SUCCESS.
[INFO] Building: container-descriptors/custom-handler-withMixedEntries/pom.xml
[INFO] ...SUCCESS.
[INFO] Building: container-descriptors/custom-containerDescriptorHandler/pom.xml
[INFO] ...SUCCESS.
[INFO] Building: container-descriptors/custom-handler-withFileEntries/pom.xml
[INFO] ...SUCCESS.
[INFO] Building: file-modes/fileItem-fileMode/pom.xml
[INFO] ...SUCCESS.
[INFO] Building: file-modes/file-set-fileMode/pom.xml
[INFO] ...SUCCESS.
[INFO] Building: mojo-tests/single-in-one-project-hierarchy/pom.xml
[INFO] ...SUCCESS.
[INFO] Building: mojo-tests/single-twice-in-multimodule-hierarchy/pom.xml
[INFO] ...SUCCESS.
[INFO] Building: mojo-tests/single-twice-in-one-project-hierarchy/pom.xml
[INFO] ...SUCCESS.
[INFO] Building: repositories/basic-repository/pom.xml
[INFO] ...SUCCESS.
[INFO] Building: mojo-configuration/manifest-with-mainClass/pom.xml
[INFO] ...SUCCESS.
[INFO] Building: mojo-configuration/manifest-with-customEntry/pom.xml
[INFO] ...SUCCESS.
[INFO] Building: mojo-configuration/no-appendAssemblyId-no-classifier/pom.xml
[INFO] ...SUCCESS.
[INFO] Building: dependency-sets/including-pom-dependency/pom.xml
[INFO] ...FAILED[code=1]. See /export/home/build/data/continuum/checkouts/5/target/test-classes/projects/dependency-sets/including-pom-dependency/build.log for details.
[INFO] Building: dependency-sets/dependencySet-withExecutedProject/pom.xml
[INFO] ...SUCCESS.
[INFO] Building: dependency-sets/include-project-artifact/pom.xml
[INFO] ...SUCCESS.
[INFO] Building: dependency-sets/dependencySet-unpacked/pom.xml
[INFO] ...SUCCESS.
[INFO] Building: dependency-sets/dependencySet-unpackedSubsetsTwice/pom.xml
[INFO] ...SUCCESS.
[INFO] Building: dependency-sets/using-moduleSet-implied-depSet/pom.xml
[INFO] ...SUCCESS.
[INFO] Building: dependency-sets/dependencySet-unpackedExcludingMetaInf/pom.xml
[INFO] ...SUCCESS.
[INFO] Building: dependency-sets/massembly-99/pom.xml
[INFO] ...SUCCESS.
[INFO] Building: dependency-sets/dependencySet-nonTransitive/pom.xml
[INFO] ...SUCCESS.
[INFO] Building: dependency-sets/include-provided/pom.xml
[INFO] ...SUCCESS.
[INFO] Building: dependency-sets/massembly-232/pom.xml
[INFO] ...SUCCESS.
[INFO] Building: dependency-sets/include-project-attachments/pom.xml
[INFO] ...SUCCESS.
[INFO] Building: dependency-sets/massembly-235/pom.xml
[INFO] ...SUCCESS.
[INFO] Building: dependency-sets/dependencySet-notUnpacked/pom.xml
[INFO] ...SUCCESS.
[INFO] Building: dependency-sets/dependencySet-projectArtifactNotIncluded/pom.xml
[INFO] ...SUCCESS.
[INFO] Building: dependency-sets/including-sar-dependency/pom.xml
[INFO] ...FAILED[code=1]. See /export/home/build/data/continuum/checkouts/5/target/test-classes/projects/dependency-sets/including-sar-dependency/build.log for details.
[INFO] Building: dependency-sets/dependencySet-matchScope/pom.xml
[INFO] ...SUCCESS.
[INFO] Building: descriptor-refs/project/multimodule-sources-copied/pom.xml
[INFO] ...SUCCESS.
[INFO] Building: descriptor-refs/project/sources-copied/pom.xml
[INFO] ...SUCCESS.
[INFO] Building: descriptor-refs/src/src-dir-copied/pom.xml
[INFO] ...SUCCESS.
[INFO] Building: descriptor-refs/bin/jars-in-archive-root/pom.xml
[INFO] ...SUCCESS.
[INFO] Building: descriptor-refs/jar-with-dependencies/deps-unpacked-to-root-dir/pom.xml
[INFO] ...SUCCESS.
[INFO] Building: descriptor-refs/jar-with-dependencies/component-descriptors-merged/pom.xml
[INFO] ...SUCCESS.
[INFO] Building: file-sets/excluding-svn-dirs/pom.xml
[INFO] ...SUCCESS.
[INFO] Building: file-sets/include-parent-dir/pom.xml
[INFO] ...SUCCESS.
[INFO] Building: file-sets/use-default-excludes/pom.xml
[INFO] ...SUCCESS.
[INFO] Building: file-sets/default-excludes-unspecified/pom.xml
[INFO] ...SUCCESS.
[INFO] Building: file-sets/dont-use-default-excludes/pom.xml
[INFO] ...SUCCESS.
[INFO] Building: file-sets/include-base-directory/pom.xml
[INFO] ...SUCCESS.
[INFO] Building: filtering-feature/filtersDefinedInAssemblyPluginConfig/pom.xml
[INFO] ...SUCCESS.
[INFO] Building: basic-features/file-copyIntoTopDir/pom.xml
[INFO] ...SUCCESS.
[INFO] Building: basic-features/file-sameName/pom.xml
[INFO] ...SUCCESS.
[INFO] Building: basic-features/outputFileNameMapping-simple/pom.xml
[INFO] ...SUCCESS.
[INFO] Building: basic-features/outputFileNameMapping-withArtifactBaseVersion/pom.xml
[INFO] ...SUCCESS.
[INFO] Building: basic-features/assemblyDescriptor-artifact/pom.xml
[INFO] ...SUCCESS.
[INFO] 

---------------------------------------
Execution Summary:
Builds Passing: 51
Builds Failing: 4
---------------------------------------

The following builds failed:

*  forking-tests/assembly-attached-with-module-binaries/pom.xml
*  forking-tests/assembly-assembly-with-module-binaries/pom.xml
*  dependency-sets/including-pom-dependency/pom.xml
*  dependency-sets/including-sar-dependency/pom.xml

[INFO] ------------------------------------------------------------------------
[ERROR] BUILD FAILURE
[INFO] ------------------------------------------------------------------------
[INFO] : org.apache.maven.plugin.invoker.InvokerMojo@537d55
4 builds failed.

4 builds failed.
[INFO] ------------------------------------------------------------------------
[INFO] For more information, run Maven with the -e switch
[INFO] ------------------------------------------------------------------------
[INFO] Total time: 15 minutes 10 seconds
[INFO] Finished at: Thu Jan 31 14:11:38 GMT+00:00 2008
[INFO] Final Memory: 49M/63M
[INFO] ------------------------------------------------------------------------

****************************************************************************



Mime
View raw message